Manifestation properties
type: Ontology
description: Properties that represent the attribute and relationship elements of the RDA Manifestation entity.
preferred namespace prefix: rdam
rights: Copyright © 2020 American Library Association, Canadian Federation of Library Associations, and CILIP: Chartered Institute of Library and Information Professionals
licence: deed.en US
creator: RDA Steering Committee
contributor: RSC Technical Working Group
publisher: ALA Digital Reference
type: http://rdaregistry.info/termList/RDALinkedDataWork/1003
title: RDA:n kappaleen ominaisuudet @fi
description: RDA-elementeistä johdetut ominaisuudet RDA:n manifestaation määrittelyjoukossa. @fi
label: sukupolven tarkemmat tiedot @fi
definition: Liittää manifestaation tarkempiin tietoihin suhteesta alkuperäisen tallenteen ja siitä tuotetun jäljenteen välillä. @fi
toolkit label: sukupolven tarkemmat tiedot @fi
toolkit definition: Tarkemmat tiedot suhteesta alkuperäisen tallenteen ja siitä tuotetun jäljenteen välillä. @fi
label: üretim ayrıntıları ile ilişkilidir @tr
definition: Bir gösterimi, bir orijinal taşıyıcı ile bir orijinalden yapılmış bir yeniden üretimin taşıyıcısı arasındaki ilişkinin detaylarıyla ilişkilendirir. @tr
toolkit label: üretim ayrıntıları @tr
toolkit definition: Bir orijinal taşıyıcı ile orijinalden yapılmış bir kopya taşıyıcısı arasındaki ilişkinin ayrıntıları. @tr
version info: v5.4.12
modified: 2026-02-19
issued: 2014-01-18

has access point for manifestation
status: Published
type: Property
lexical alias: accessPointForManifestation.en
definition: Relates a manifestation to a nomen that is an appellation of manifestation in natural language that is taken from a vocabulary encoding scheme or is constructed using a string encoding scheme.
domain: C10007
toolkit label: access point for manifestation
toolkit definition: A nomen that is an appellation of manifestation in natural language that is taken from a vocabulary encoding scheme or is constructed using a string encoding scheme.
sub property of: has appellation of manifestation
has element type: 3
sub property of: P00016
label: manifestaation hakutieto @fi
definition: Liittää manifestaation nomeniin, joka on luonnollisen kielen mukainen manifestaation nimitys, joka on otettu sanaston merkintäjärjestelmästä tai joka on muodostettu merkkijonon merkintäjärjestelmää käyttäen. @fi
toolkit label: manifestaation hakutieto @fi
toolkit definition: Nomen, joka on luonnollisen kielen mukainen manifestaation nimitys, joka on otettu sanaston merkintäjärjestelmästä tai joka on muodostettu merkkijonon merkintäjärjestelmää käyttäen. @fi
label: har søkeinngang for manifestasjon @no
definition: Relaterer en manifestasjon til en betegnelse på manifestasjon på et naturlig språk som er hentet fra et kodeskjema for vokabular eller er laget ved bruk av et kodeskjema for syntaks. @no
toolkit label: søkeinngang for manifestasjon @no
toolkit definition: En betegnelse på manifestasjon på et naturlig språk som er hentet fra et kodeskjema for vokabular eller er laget ved bruk av et kodeskjema for syntaks. @no
label: a pour point d’accès d’une manifestation @fr
definition: Met une manifestation en relation avec un nomen qui est une appellation de manifestation en langage naturel provenant d’un schéma d’encodage de vocabulaire ou construite à l’aide d’un schéma d’encodage de chaînes. @fr
toolkit label: point d’accès d’une manifestation @fr
toolkit definition: Nomen qui est une appellation de manifestation en langage naturel provenant d’un schéma d’encodage de vocabulaire ou construite à l’aide d’un schéma d’encodage de chaînes. @fr
label: heeft ingang voor manifestatie @nl
definition: Relateert een manifestatie aan een nomen dat is een benaming van manifestatie in natuurlijke taal die ontleend is aan een vocabulair coderingsschema of gevormd is volgens een stringcoderingsschema. @nl
toolkit label: ingang voor manifestatie @nl
toolkit definition: Een nomen dat is een benaming van manifestatie in natuurlijke taal die ontleend is aan een vocabulair coderingsschema of gevormd is volgens een stringcoderingsschema. @nl
label: له نقطة إتاحة لتجسيدة @ar
definition: يربط بين تجسيدة واسم تجسيدة في اللغة الطبيعية والمأخوذ من خطة ترميز مفردات، أو انشئت باستخدام خطة ترميز سلسلة تمثيلات. @ar
toolkit label: نقطة إتاحة لتجسيدة @ar
toolkit definition: اسم تجسيدة في اللغة الطبيعية والمأخوذ من خطة ترميز مفردات، أو انشئت باستخدام خطة ترميز سلسلة تمثيلات. @ar
label: té com a punt d’accés de manifestació @ca
definition: Relaciona una manifestació amb un nomen que és una apel·lació de manifestació en llenguatge natural que s’obté d’un esquema de codificació de vocabulari o s’elabora usant un esquema de codificació de cadenes. @ca
toolkit label: punt d’accés de manifestació @ca
toolkit definition: Nomen que és una apel·lació de manifestació en llenguatge natural que s’obté d’un esquema de codificació de vocabulari o s’elabora usant un esquema de codificació de cadenes. @ca
label: har søgeindgang for manifestation @da
definition: Relaterer en manifestation til en benævnelse på manifestation på normalsprog, som er taget fra et vokabularkodningsskema eller er konstrueret ved hjælp af et strengkodningsskema. @da
toolkit label: søgeindgang for manifestation @da
toolkit definition: Benævnelse på manifestation på normalsprog, som er taget fra et vokabularkodningsskema eller er konstrueret ved hjælp af et strengkodningsskema. @da
label: kehastuse otsielement @et
definition: Seostab kehastuse kehastuse nimetusega loomulikus keeles, mis on võetud leksikaalsest märkimissüsteemist või moodustatud stringilise märkimissüsteemi alusel. @et
toolkit label: kehastuse otsielement @et
toolkit definition: Kehastuse nimetus loomulikus keeles, mis on võetud leksikaalsest märkimissüsteemist või moodustatud stringilise märkimissüsteemi alusel. @et
label: hat Sucheinstieg für eine Manifestation @de
definition: Setzt eine Manifestation in Beziehung zu einer Bezeichnung für eine Manifestation in natürlicher Sprache, die einem Vocabulary Encoding Scheme entnommen oder mit einem String Encoding Scheme konstruiert wird. @de
toolkit label: Sucheinstieg für eine Manifestation @de
toolkit definition: Eine Bezeichnung für eine Manifestation in natürlicher Sprache, die einem Vocabulary Encoding Scheme entnommen oder mit einem String Encoding Scheme konstruiert wird. @de
label: hozzáférési pontja megjelenési formához a következő: @hu
definition: Hozzákapcsol egy megjelenési formát egy nomenhez, amely egy szótárkódolási sémából származik, vagy egy karakterlánc-kódolási séma használatával szerkesztett. @hu
toolkit label: hozzáférési pont megjelenési formához @hu
toolkit definition: Megjelenési forma szótárkódolási sémából származó vagy egy karakterkódolási séma használatával szerkesztett megnevezése természetes nyelven. @hu
label: ha come punto d'accesso per la manifestazione @it
definition: Correla una manifestazione a una denominazione espressa in linguaggio naturale derivata da uno schema di codifica di vocabolario o costruita usando uno schema di codifica della stringa. @it
toolkit label: punto d'accesso per la manifestazione @it
toolkit definition: Denominazione espressa in linguaggio naturale derivata da uno schema di codifica del vocabolario o costruita usando uno schema di codifica della stringa. @it
label: manifestācijas pamatforma @lv
definition: Sasaista manifestāciju ar nomenu, kas ir manifestācijas, vārds/nosaukums dabiskā valodā, kas ņemts no shēmas kontrolētu vārdnīcu kodēšanai vai tiek konstruēts, izmantojot virknes kodēšanas shēmu. @lv
toolkit label: manifestācijas pamatforma @lv
toolkit definition: Manifestācijas, vārds/nosaukums dabiskā valodā, kas ņemts no shēmas kontrolētu vārdnīcu kodēšanai vai tiek konstruēts, izmantojot virknes kodēšanas shēmu. @lv
label: 有载体表现的检索点 @zh-hans
definition: 将一种载体表现与作为一种载体表现的称谓、取自一个词表编码体系或者用一个串编码体系构建、用自然语言的一个命名关联起来。 @zh-hans
toolkit label: 载体表现的检索点 @zh-hans
toolkit definition: 作为一种载体表现的称谓、取自一个词表编码体系或者用一个串编码体系构建、用自然语言的一个命名 @zh-hans
label: gösterim için erişim noktası ile ilişkilidir @tr
definition: Bir gösterimi, bir kelime kodlama şemasından alınan veya bir dizi kodlama şeması kullanılarak oluşturulan doğal dilde gösterimin bir unvanı olan bir isim ile ilişkilendirir. @tr
toolkit label: Gösterim için erişim noktası @tr
toolkit definition: Bir kelime kodlama şemasından alınan veya bir dizi kodlama şeması kullanılarak oluşturulan, doğal dilde bir gösterimin bir unvanı olan bir isim. @tr
label: tiene punto de acceso para manifestación @es
definition: Relaciona una manifestación con un nomen que es una denominación de manifestación en lenguaje natural que se toma de un esquema de codificación de vocabulario o se construye utilizando un esquema de codificación de cadenas. @es
toolkit label: punto de acceso para manifestación @es
toolkit definition: Un nomen que es una denominación de manifestación en lenguaje natural que se toma de un esquema de codificación de vocabulario o se construye utilizando un esquema de codificación de cadenas. @es
has subproperty: has authorized access point for manifestation
has subproperty: has variant access point for manifestation
has subproperty: P30276

a pour relation de manifestation d’accompagnement
status: Deprecated
type: Property
domain: C10007
lexical alias: accompanyingManifestationRelationship.en
definition: Met une manifestation en relation avec une manifestation qui accompagne ou est accompagnée par une autre manifestation. @fr
toolkit label: relation de manifestation d’accompagnement @fr
toolkit definition: Manifestation qui accompagne ou est accompagnée par une autre manifestation. @fr
toolkit label: relaciones de manifestación acompañante @es
toolkit definition: Una manifestación que acompaña o está acompañado por la manifestación. @es
sub property of: has related manifestation of manifestation
instruction number: 24.5
toolkit label: relatie begeleidende manifestatie @nl
toolkit definition: Een manifestatie die de manifestatie begeleidt of door deze wordt begeleid. @nl
label: có mối quan hệ biểu thị kèm theo @vi
definition: Liên kết biểu thị với biểu thị kèm theo hoặc được kèm theo bởi biểu thị khác. @vi
toolkit label: mối quan hệ biểu thị kèm theo @vi
toolkit definition: Biểu thị kèm theo hoặc được kèm theo bởi biểu thị khác. @vi
label: har ledsagende manifestationsrelation med @da
definition: Relaterer en manifestation til en manifestation der ledsager eller er ledsaget af en manifestation. @da
toolkit label: ledsagende manifestationsrelation @da
toolkit definition: Manifestation der ledsager eller ledsages af en manifestation. @da
label: hat Begleitende Beziehungen auf Manifestationsebene @de
definition: Setzt eine Manifestation mit einer Manifestation, die eine andere Manifestation begleitet oder von einer begleitet wird, in Beziehung. @de
toolkit label: Begleitende Beziehungen auf Manifestationsebene @de
toolkit definition: Eine Manifestation, die eine andere Manifestation begleitet oder von einer begleitet wird. @de
label: té com a relació de manifestació d’acompanyament @ca
definition: Relaciona una manifestació amb una manifestació que acompanya o és acompanyada per una altra manifestació. @ca
toolkit label: relació de manifestació d’acompanyament @ca
toolkit definition: Manifestació que acompanya o és acompanyada per una altra manifestació. @ca
label: yhdessä ilmestyneiden manifestaatioiden suhde @fi
definition: Liittää manifestaation manifestaatioon, joka on ilmestynyt yhdessä toisen manifestaation kanssa. @fi
toolkit label: yhdessä ilmestyneiden manifestaatioiden suhde @fi
toolkit definition: Manifestaatio, joka on ilmestynyt yhdessä toisen manifestaation kanssa. @fi
toolkit label: ledsagende manifestasjon: relasjonstype @no
toolkit definition: En manifestasjon som ledsager eller ledsages av en annen manifestasjon. @no
label: έχει συνοδευτική σχέση εκδήλωσης με @el
definition: Συνδέει μια εκδήλωση με μια εκδήλωση που συνοδεύει ή συνοδεύεται από μια άλλη εκδήλωση. @el
toolkit label: συνοδευτική σχέση εκδήλωσης @el
toolkit definition: Μια εκδήλωση που συνοδεύει ή συνοδεύεται από μια άλλη εκδήλωση. @el
has subproperty: P30210

has base material
status: Published
definition: Relates a manifestation to an underlying physical material of a manifestation.
type: Property
domain: C10007
lexical alias: baseMaterial.en
instruction number: 3.6
toolkit label: base material
toolkit definition: An underlying physical material of a manifestation.
label: a pour matériau de base @fr
definition: Met une manifestation en relation avec un matériau physique sous-jacent d’une manifestation. @fr
toolkit label: matériau de base @fr
toolkit definition: Matériau physique sous-jacent d’une manifestation. @fr
toolkit label: material base @es
toolkit definition: Un material físico subyacente de una manifestación. @es
label: har bärande material @sv
toolkit label: bärande material @sv
toolkit label: basismateriaal @nl
toolkit definition: Een onderliggend fysieke materiaal van een resource. @nl
label: có vật liệu cơ sở @vi
definition: Liên kết biểu thị với vật liệu vật lý nằm bên dưới của biểu thị. @vi
toolkit label: vật liệu cơ sở @vi
toolkit definition: Vật liệu vật lý nằm bên dưới của biểu thị. @vi
label: har basismateriale @da
definition: Relaterer en manifestation til en manifestations underliggende fysiske materiale. @da
toolkit label: basismateriale @da
toolkit definition: En manifestations underliggende fysiske materiale. @da
label: hat Trägermaterial @de
definition: Setzt eine Manifestation in Beziehung zu einem zugrunde liegenden, physischen Material einer Manifestation. @de
toolkit label: Trägermaterial @de
toolkit definition: Ein zugrunde liegendes, physisches Material einer Manifestation. @de
label: té com a material de base @ca
definition: Relaciona una manifestació amb un material físic subjacent d’una manifestació. @ca
toolkit label: material de base @ca
toolkit definition: Material físic subjacent d’una manifestació. @ca
definition: Liittää manifestaation manifestaation fyysiseen pohjamateriaaliin. @fi
toolkit label: pohjamateriaali @fi
toolkit definition: Manifestaation fyysinen pohjamateriaali. @fi
toolkit definition: Et underliggende fysisk materiale for en manifestasjon. @no
label: έχει βασικό υλικό @el
definition: Συνδέει μια εκδήλωση με ένα υποκείμενο φυσικό υλικό μιας εκδήλωσης. @el
toolkit label: βασικό υλικό @el
toolkit definition: Ένα υποκείμενο φυσικό υλικό μιας εκδήλωσης. @el
sub property of: has material
has element type: 4
label: alapanyaga a következő: @hu
definition: Hozzákapcsol egy megjelenési formát egy megjelenési forma mögöttes fizikai anyagához. @hu
toolkit label: alapanyaga: @hu
toolkit definition: Egy megjelenési forma mögöttes fizikai anyaga. @hu
label: pohjamateriaali @fi
definition: Relaterer en manifestasjon til et underliggende fysisk materiale for en manifestasjon. @no
label: heeft basismateriaal @nl
definition: Relateert een manifestatie aan een onderliggend fysieke materiaal van een resource. @nl
label: له مادة أساسية @ar
definition: يربط بين تجسيدة ومادة ملموسة أساسية لتجسيدة. @ar
toolkit label: مادة أساسية @ar
toolkit definition: مادة ملموسة أساسية لتجسيدة. @ar
label: alusmaterjal @et
definition: Seostab kehastuse kehastuse aluspõhjaks oleva füüsilise materjaliga. @et
toolkit label: alusmaterjal @et
toolkit definition: Kehastuse aluspõhjaks olev füüsiline materjal. @et
label: ha come materiale di base @it
definition: Correla una manifestazione a un substrato fisico di una manifestazione. @it
toolkit label: materiale di base @it
toolkit definition: Substrato fisico di una manifestazione. @it
label: pamatmateriāls @lv
definition: Sasaista manifestāciju ar manifestācijas pamatā esošu fizisku materiālu. @lv
toolkit label: pamatmateriāls @lv
toolkit definition: Manifestācijas pamatā esošs fizisks materiāls. @lv
label: 有基底材料 @zh-hans
definition: 将一种载体表现与一种载体表现的下层物理材料关联起来。 @zh-hans
toolkit label: 基底材料 @zh-hans
toolkit definition: 一种载体表现的下层物理材料 @zh-hans
label: temel malzeme ile ilişkilidir @tr
definition: Bir gösterimi, altta yatan fiziksel bir durumla ilişkilendirir. @tr
toolkit label: temel malzeme @tr
toolkit definition: Bir gösterimin altında yatan fiziksel malzeme. @tr
label: tiene material base @es
definition: Relaciona una manifestación con un material físico subyacente de una manifestación. @es
has subproperty: has base material for microfilm, microfiche, photographic film, and motion picture film (Deprecated)

has details of base material
status: Published
type: Property
lexical alias: detailsOfBaseMaterial.en
definition: Relates a manifestation to details of an underlying physical material of a manifestation.
domain: C10007
instruction number: 3.6.1.4
toolkit label: details of base material
toolkit definition: Details of an underlying physical material of a manifestation.
toolkit label: detalles del material base @es
toolkit definition: Detalles de un material físico subyacente de una manifestación. @es
label: har detaljerad information om bärande matieral @sv
toolkit label: detaljerad information om bärande matieral @sv
toolkit label: details van basismateriaal @nl
toolkit definition: Details van een onderliggend fysiek materiaal van een resource. @nl
label: có chi tiết của vật liệu cơ sở @vi
definition: Liên kết biểu thị với chi tiết của vật liệu vật lý nằm bên dưới của biểu thị. @vi
toolkit label: chi tiết của vật liệu cơ sở @vi
toolkit definition: Chi tiết của vật liệu vật lý nằm bên dưới của biểu thị. @vi
label: har detaljer om basismateriale @da
definition: Relaterer en manifestation til detaljer om en manifestations underliggende fysiske materiale. @da
toolkit label: detaljer om basismateriale @da
toolkit definition: Detaljer om en manifestations underliggende fysiske materiale. @da
label: hat Details zum Trägermaterial @de
definition: Setzt eine Manifestation in Beziehung zu den Details zu einem zugrunde liegenden physischen Material einer Manifestation. @de
toolkit label: Details zum Trägermaterial @de
toolkit definition: Details zu einem zugrunde liegenden physischen Material einer Manifestation. @de
label: té com a particularitats de material de base @ca
definition: Relaciona una manifestació amb les particularitats d’un material físic subjacent d’una manifestació. @ca
toolkit label: particularitats de material de base @ca
toolkit definition: Particularitats d’un material físic subjacent d’una manifestació. @ca
definition: Liittää manifestaation tarkempiin tietoihin manifestaation fyysisestä pohjamateriaalista. @fi
toolkit label: pohjamateriaalin tarkemmat tiedot @fi
toolkit definition: Tarkemmat tiedot manifestaation fyysisestä pohjamateriaalista. @fi
toolkit label: detaljer vedrørende basismateriale @no
toolkit definition: Detaljer vedrørende et underliggende fysisk materiale i en manifestasjon. @no
label: έχει λεπτομέρειες του βασικού υλικού @el
definition: Συνδέει μια εκδήλωση με τις λεπτομέρειες ενός υποκείμενου φυσικού υλικού μιας εκδήλωσης. @el
toolkit label: λεπτομέρειες του βασικού υλικού @el
toolkit definition: Λεπτομέρειες ενός υποκείμενου φυσικού υλικού μιας εκδήλωσης. @el
label: a pour particularités d’un matériau de base @fr
definition: Met une manifestation en relation avec des particularités d’un matériau physique sous-jacent d’une manifestation. @fr
toolkit label: particularités d’un matériau de base @fr
toolkit definition: Particularités d’un matériau physique sous-jacent d’une manifestation. @fr
has element type: 6
label: alapanyag részletei a következők: @hu
definition: Hozzákapcsol egy megjelenési formát egy megjelenési forma mögöttes fizikai anyagának részleteihez. @hu
toolkit label: alapanyag részletei: @hu
toolkit definition: Egy megjelenési forma mögöttes fizikai anyagának részletei. @hu
label: pohjamateriaalin tarkemmat tiedot @fi
label: har detaljer vedrørende basismateriale @no
definition: Relaterer en manifestasjon til detaljer vedrørende et underliggende fysisk materiale i en manifestasjon. @no
label: heeft details van basismateriaal @nl
definition: Relateert een manifestatie aan details van een onderliggend fysiek materiaal van een resource. @nl
label: له تفاصيل مادة الأساس @ar
definition: يربط بين تجسيدة وتفاصيل المادة الفيزيائية الأساسية لتجسيدة. @ar
toolkit label: تفاصيل مادة الأساس @ar
toolkit definition: تفاصيل المادة الفيزيائية الأساسية لتجسيدة. @ar
label: alusmaterjali täpsustus @et
definition: Seostab kehastuse täpsemate andmetega kehastuse aluspõhjaks oleva füüsilise materjali kohta. @et
toolkit label: alusmaterjali täpsustus @et
toolkit definition: Täpsemad andmed kehastuse aluspõhjaks oleva füüsilise materjali kohta. @et
label: ha come particolari relativi al materiale di base @it
definition: Correla una manifestazione ai particolari relativi a un substrato fisico di una manifestazione. @it
toolkit label: particolari relativi al materiale di base @it
toolkit definition: Particolari relativi a un substrato fisico di una manifestazione. @it
label: detalizēti par pamatmateriālu @lv
definition: Sasaista manifestāciju ar sīkāku informāciju par manifestācijas pamatā esošo fizisko materiālu. @lv
toolkit label: detalizēti par pamatmateriālu @lv
toolkit definition: Sīkāka informācija par manifestācijas pamatā esošo fizisko materiālu. @lv
label: 有基底材料的细节 @zh-hans
definition: 将一种载体表现与一种载体表现的下层物理材料的细节关联起来。 @zh-hans
toolkit label: 基底材料的细节 @zh-hans
toolkit definition: 一种载体表现的下层物理材料的细节 @zh-hans
label: temel materyalin ayrıntıları ile ilişkilidir @tr
definition: Bir gösterimi, altta yatan bir konunun fiziksel malzemesi ayrıntılarıyla ilişkilendirir. @tr
toolkit label: temel malzemenin detayları @tr
toolkit definition: Bir gösterimin altındaki fiziksel malzemenin ayrıntıları. @tr
label: tiene detalles del material base @es
definition: Relaciona una manifestación con detalles de un material físico subyacente de una manifestación. @es

has applied material
status: Published
definition: Relates a manifestation to a physical or chemical substance applied to a base material of a manifestation.
type: Property
domain: C10007
lexical alias: appliedMaterial.en
instruction number: 3.7
toolkit label: applied material
toolkit definition: A physical or chemical substance applied to a base material of a manifestation.
label: a pour matériau appliqué @fr
definition: Met une manifestation en relation avec une substance physique ou chimique appliquée sur un matériau de base d’une manifestation. @fr
toolkit label: matériau appliqué @fr
toolkit definition: Substance physique ou chimique appliquée sur un matériau de base d’une manifestation. @fr
toolkit label: material aplicado @es
toolkit definition: Una sustancia física o química aplicada a un material base de una manifestación. @es
label: har applicerat material @sv
toolkit label: applicerat material @sv
toolkit label: bevestigd materiaal @nl
toolkit definition: Een fysieke of chemische substantie die bevestigd is op het basismateriaal van een manifestatie. @nl
label: có vật liệu ứng dụng @vi
definition: Liên kết biểu thị với chất vật lý hoặc hoá học được áp dụng làm vật liệu cơ sở cho biểu thị. @vi
toolkit label: vật liệu ứng dụng @vi
toolkit definition: Chất vật lý hoặc hoá học được áp dụng làm vật liệu cơ sở cho biểu thị. @vi
label: har anvendt materiale @da
definition: Relaterer en manifestation til et fysisk eller kemisk stof, som er påført en manifestations basismateriale. @da
toolkit label: anvendt materiale @da
toolkit definition: Fysisk eller kemisk stof, som er påført en manifestations basismateriale. @da
label: hat aufgebrachtes Material @de
definition: Setzt eine Manifestation in Beziehung zu einer physischen oder chemischen Substanz, die auf ein Trägermaterial einer Manifestation aufgebracht wird. @de
toolkit label: Aufgebrachtes Material @de
toolkit definition: Eine physische oder chemische Substanz, die auf ein Trägermaterial einer Manifestation aufgebracht wird. @de
label: té com a material aplicat @ca
definition: Relaciona una manifestació amb una substància física o química aplicada a un material de base d’una manifestació. @ca
toolkit label: material aplicat @ca
toolkit definition: Substància física o química aplicada a un material de base d’una manifestació. @ca
definition: Liittää manifestaation fysikaaliseen tai kemialliseen aineeseen, jota on laitettu manifestaation pohjamateriaalin päälle. @fi
toolkit label: päällimateriaali @fi
toolkit definition: Fysikaalinen tai kemiallinen aine, jota on laitettu manifestaation pohjamateriaalin päälle. @fi
toolkit definition: Et fysisk eller kjemisk stoff påført basismaterialet til en manifestasjon. @no
label: έχει εφαρμοσμένο υλικό @el
definition: Συνδέει μια εκδήλωση με μια φυσική ή χημική ουσία που εφαρμόζεται σε ένα βασικό υλικό μιας εκδήλωσης. @el
toolkit label: εφαρμοσμένο υλικό @el
toolkit definition: Μια φυσική ή χημική ουσία που εφαρμόζεται σε ένα βασικό υλικό μιας εκδήλωσης. @el
sub property of: has material
has element type: 4
label: alkalmazott anyaga a következő: @hu
definition: Hozzákapcsol egy megjelenési formát egy fizikai vagy kémiai anyaghoz, amelyet egy megjelenési forma alapanyagaként alkalmaznak. @hu
toolkit label: alkalmazott anyaga: @hu
toolkit definition: Egy fizikai vagy kémiai anyag, amelyet egy megjelenési forma alapanyagaként alkalmaznak. @hu
label: päällimateriaali @fi
definition: Relaterer en manifestasjon til et fysisk eller kjemisk stoff påført basismaterialet til en manifestasjon. @no
label: heeft bevestigd materiaal @nl
definition: Relateert een manifestatie aan een fysieke of chemische substantie die bevestigd is op het basismateriaal van een manifestatie. @nl
label: له مادة مستخدمة @ar
definition: يربط بين تجسيدة ومادة فيزيائية أو كيميائية مستخدمة كمادة أساسية لتجسيدة. @ar
toolkit label: مادة مستخدمة @ar
toolkit definition: مادة فيزيائية أو كيميائية مستخدمة كمادة أساسية لتجسيدة. @ar
label: pealismaterjal @et
definition: Seostab kehastuse füüsilise või keemilise ainega, millega on kaetud kehastuse alusmaterjal. @et
toolkit label: pealismaterjal @et
toolkit definition: Füüsiline või keemiline aine, millega on kaetud kehastuse alusmaterjal. @et
label: ha come materiale applicato @it
definition: Correla una manifestazione a una sostanza fisica o chimica applicata al materiale di base di una manifestazione. @it
toolkit label: materiale applicato @it
toolkit definition: Sostanza fisica o chimica applicata al materiale di base di una manifestazione. @it
label: izmantotais materiāls @lv
definition: Sasaista manifestāciju ar fizisku vai ķīmisku vielu, kas pielietota manifestācijas pamatmateriālam. @lv
toolkit label: izmantotais materiāls @lv
toolkit definition: Fiziska vai ķīmiska viela, kas pielietota manifestācijas pamatmateriālam. @lv
label: 有施加材料 @zh-hans
definition: 将一种载体表现与施加于一种载体表现基底材料上的物理或化学物质关联起来。 @zh-hans
toolkit label: 施加材料 @zh-hans
toolkit definition: 施加于一种载体表现基底材料上的物理或化学物质 @zh-hans
label: uygulanan malzeme ile ilişkilidir @tr
definition: Bir gösterimi, bir gösterimin temel malzemesine uygulanan fiziksel veya kimyasal bir maddeyle ilişkilendirir. @tr
toolkit label: uygulnan materyal @tr
toolkit definition: Bir gösterimin temel malzemesine uygulanan fiziksel veya kimyasal bir madde. @tr
label: tiene material aplicado @es
definition: Relaciona una manifestación con una sustancia física o química aplicada a un material base de una manifestación. @es
has subproperty: has emulsion on microfilm and microfiche

has details of applied material
status: Published
type: Property
lexical alias: detailsOfAppliedMaterial.en
definition: Relates a manifestation to details of a physical or chemical substance that is applied to a base material of a manifestation.
domain: C10007
instruction number: 3.7.1.4
toolkit label: details of applied material
toolkit definition: Details of a physical or chemical substance that is applied to a base material of a manifestation.
toolkit label: detalles del material aplicado @es
toolkit definition: Detalles de una sustancia física o química que se aplica a un material base de una manifestación. @es
label: har detaljerad information om applicerat material @sv
toolkit label: detaljerad information om applicerat material @sv
toolkit label: details van aangebracht materiaal @nl
toolkit definition: Details van een fysische of chemische substantie aangebracht op een basismateriaal van een resource. @nl
label: có chi tiết của vật liệu ứng dụng @vi
definition: Liên kết biểu thị với chi tiết của chất hoá học hoawcjm vật lý được áp dụng làm vật liệu cơ sở của biểu thị. @vi
toolkit label: chi tiết của vật liệu ứng dụng @vi
toolkit definition: Chi tiết của chất hoá học hoawcjm vật lý được áp dụng làm vật liệu cơ sở của biểu thị. @vi
label: har detaljer om anvendt materiale @da
definition: Relaterer en manifestation til detaljer om et fysisk eller kemisk stof, som er påført en manifestations basismateriale. @da
toolkit label: detaljer om anvendt materiale @da
toolkit definition: Detaljer om et fysisk eller kemisk stof, som er påført en manifestations basismateriale. @da
label: hat Details zu aufgebrachtem Material @de
definition: Setzt eine Manifestation in Beziehung zu den Details zu einer physischen oder chemischen Substanz, die auf ein Trägermaterial einer Manifestation aufgebracht ist. @de
toolkit label: Details zu aufgebrachtem Material @de
toolkit definition: Details zu einer physischen oder chemischen Substanz, die auf ein Trägermaterial einer Manifestation aufgebracht ist. @de
label: té com a particularitats de material aplicat @ca
definition: Relaciona una manifestació amb les particularitats d’una substància física o química que s’aplica sobre un material de base d’una manifestació. @ca
toolkit label: particularitats de material aplicat @ca
toolkit definition: Particularitats d’una substància física o química que s’aplica sobre un material de base d’una manifestació. @ca
definition: Liittää manifestaation tarkempiin tietoihin materiaalista tai kemikaalisista aineista, joita käytetään manifestaation pohjamateriaalin päällä. @fi
toolkit label: päällimateriaalin tarkemmat tiedot @fi
toolkit definition: Tarkemmat tiedot materiaalista tai kemikaalisista aineista, joita käytetään manifestaation pohjamateriaalin päällä. @fi
toolkit label: detaljer vedrørende anvendt materiale @no
toolkit definition: Detaljer vedrørende et fysisk eller kjemisk stoff som er påført basismaterialet til en manifestasjon. @no
label: έχει λεπτομέρειες του εφαρμοσμένου υλικού @el
definition: Συνδέει μια εκδήλωση με τις λεπτομέρειες της φυσικής ή χημικής ουσίας που εφαρμόζεται στο βασικό υλικό μιας εκδήλωσης. @el
toolkit label: λεπτομέρειες του εφαρμοσμένου υλικού @el
toolkit definition: Λεπτομέρειες της φυσικής ή χημικής ουσίας που εφαρμόζεται στο βασικό υλικό μιας εκδήλωσης. @el
label: a pour particularités d’un matériau appliqué @fr
definition: Met une manifestation en relation avec des particularités d’une substance physique ou chimique appliquée sur un matériau de base d’une manifestation. @fr
toolkit label: particularités d’un matériau appliqué @fr
toolkit definition: Particularités d’une substance physique ou chimique appliquée sur un matériau de base d’une manifestation. @fr
has element type: 6
label: az alkalmazott anyag részletei a következők: @hu
definition: Hozzákapcsol egy megjelenési formát egy megjelenési forma alapanyagaként alkalmazott fizikai vagy kémiai anyag részleteihez. @hu
toolkit label: az alkalmazott anyag részletei: @hu
toolkit definition: Egy megjelenési forma alapanyagaként alkalmazott fizikai vagy kémiai anyag részletei. @hu
label: päällimateriaalin tarkemmat tiedot @fi
label: har detaljer vedrørende anvendt materiale @no
definition: Relaterer en manifestasjon til detaljer vedrørende et fysisk eller kjemisk stoff som er påført basismaterialet til en manifestasjon. @no
label: heeft details van aangebracht materiaal @nl
definition: Relateert een manifestatie aan details van een fysische of chemische substantie aangebracht op een basismateriaal van een resource. @nl
label: له تفاصيل مادة مستخدمة @ar
definition: يربط بين تجسيدة وتفاصيل المادة الفيزيائية أو الكيميائية التي تم صنع مادة القاعدة منها لتجسيدة. @ar
toolkit label: تفاصيل مادة مستخدمة @ar
toolkit definition: تفاصيل المادة الفيزيائية أو الكيميائية التي تم صنع مادة القاعدة منها لتجسيدة. @ar
label: pealismaterjali täpsustus @et
definition: Seostab kehastuse täpsemate andmetega füüsilise või keemilise aine kohta, millega on kaetud kehastuse alusmaterjal. @et
toolkit label: pealismaterjali täpsustus @et
toolkit definition: Täpsemad andmed füüsilise või keemilise aine kohta, millega on kaetud kehastuse alusmaterjal. @et
label: detalizēti par izmantoto materiālu @lv
definition: Sasaista manifestāciju ar sīkāku informāciju par fizikālām vai ķīmiskām vielām, kas izmantotas manifestācijas pamatmateriālā. @lv
toolkit label: detalizēti par izmantoto materiālu @lv
toolkit definition: Sīkāka informācija par fizikālām vai ķīmiskām vielām, kas izmantotas manifestācijas pamatmateriālā. @lv
label: 有施加材料的细节 @zh-hans
definition: 将一种载体表现与施加于一种载体表现的基底材料上的物理或化学物质的细节关联起来。 @zh-hans
toolkit label: 施加材料的细节 @zh-hans
toolkit definition: 施加于一种载体表现的基底材料上的物理或化学物质的细节 @zh-hans
label: uygulanan materyalin ayrıntıları ile ilişkilidir @tr
definition: Bir gösterimi, bir temel malzemeye uygulanan fiziksel veya kimyasal bir maddenin ayrıntılarıyla ilişkilendirir. @tr
toolkit label: uygulanan malzemenin detayları @tr
toolkit definition: Bir gösterimin temel malzemesine uygulanan fiziksel veya kimyasal maddenin ayrıntıları. @tr
label: tiene detalles del material aplicado @es
definition: Relaciona una manifestación con detalles de una sustancia física o química que se aplica a un material base de una manifestación. @es
has subproperty: has details of emulsion on microfilm and microfiche
has subproperty: P30216

has dimensions of still image
status: Published
definition: Relates a manifestation to a measurement of the pictorial area of a still image.
type: Property
domain: C10007
sub property of: has dimensions
lexical alias: dimensionsOfStillImage.en
instruction number: 3.5.3
toolkit label: dimensions of still image
toolkit definition: A measurement of a pictorial area of a still image.
label: a pour dimensions d’une image fixe @fr
definition: Met une manifestation en relation avec une mesure d'une partie graphique d’une image fixe. @fr
toolkit label: dimensions d’une image fixe @fr
toolkit definition: Mesure d'une partie graphique d’une image fixe. @fr
toolkit label: dimensiones de imagen fija @es
toolkit definition: Una medición del área pictórica de una imagen fija. @es
label: har bildytans mått @sv
toolkit label: bildytans mått @sv
toolkit label: afmetingen van stilstaand beeld @nl
toolkit definition: Een afmeting van het beeldgedeelte van een stilstaand beeld. @nl
label: có kích thước của hình ảnh tĩnh @vi
definition: Liên kết biểu thị với độ đo của khu vực có hình của hình ảnh tĩnh. @vi
toolkit label: kích thước của hình ảnh tĩnh @vi
toolkit definition: Độ đo của khu vực có hình của hình ảnh tĩnh. @vi
label: har størrelse på stillbillede @da
definition: Relaterer en manifestation til et mål af et stillbilledes billedområde. @da
toolkit label: størrelse på stillbillede @da
toolkit definition: Mål af et stillbilledes billedområde. @da
label: hat Maße eines unbewegten Bilds @de
definition: Setzt eine Manifestation in Beziehung zu einer Abmessung der Bildfläche eines unbewegten Bilds. @de
toolkit label: Maße eines unbewegten Bilds @de
toolkit definition: Eine Abmessung der Bildfläche eines unbewegten Bilds. @de
label: té com a dimensions d’una imatge fixa @ca
definition: Relaciona una manifestació amb una mida d’una àrea il·lustrada d’una imatge fixa. @ca
toolkit label: dimensions d’una imatge fixa @ca
toolkit definition: Mida d’una àrea il·lustrada d’una imatge fixa. @ca
definition: Liittää manifestaation stilkuvan kuva-alueen mittoihin. @fi
toolkit label: stillkuvan koko @fi
toolkit definition: Stillkuvan kuva-alueen mitat. @fi
toolkit label: bildestørrelse @no
toolkit definition: Målene til bildeflaten for et bilde. @no
label: έχει διαστάσεις της σταθερής εικόνας @el
definition: Συνδέει μια εκδήλωση με μια μέτρηση της εικονογραφικής περιοχής μιας σταθερής εικόνας. @el
toolkit label: διαστάσεις της σταθερής εικόνας @el
toolkit definition: Μια μέτρηση της εικονογραφικής περιοχής μιας σταθερής εικόνας. @el
has element type: 6
label: állókép mérete a következő: @hu
definition: Hozzákapcsol egy megjelenési formát egy állókép képterületének a méretéhez. @hu
toolkit label: állókép mérete: @hu
toolkit definition: Egy állókép képterületének a mérete. @hu
label: stillkuvan koko @fi
label: har bildestørrelse @no
definition: Relaterer en manifestasjon til målene til bildeflaten for et bilde. @no
label: heeft afmetingen van stilstaand beeld @nl
definition: Relateert een manifestatie aan een afmeting van het beeldgedeelte van een stilstaand beeld. @nl
label: له أبعاد الصورة الثابتة @ar
definition: يربط بين تجسيدة ومقاييس المساحة المصورة في صورة ثابتة. @ar
toolkit label: أبعاد الصورة الثابتة @ar
toolkit definition: مقاييس المساحة المصورة في صورة ثابتة. @ar
label: liikumatu pildi mõõtmed @et
definition: Seostab kehastuse liikumatu pildi pildiala mõõtudega. @et
toolkit label: liikumatu pildi mõõtmed @et
toolkit definition: Liikumatu pildi pildiala mõõdud. @et
label: ha come dimensioni dell'immagine fissa @it
definition: Correla una manifestazione a una misura dell'area della figura di un'immagine fissa. @it
toolkit label: dimensioni dell'immagine fissa @it
toolkit definition: Misura dell'area della figura di un'immagine fissa. @it
label: attēla izmēri @lv
definition: Sasaista manifestāciju ar attēla laukuma izmēriem bez piemalēm. @lv
toolkit label: attēla izmēri @lv
toolkit definition: Attēla laukuma izmēri bez piemalēm. @lv
label: 有静态图像的尺寸 @zh-hans
definition: 将一种载体表现与一个静态图像的图画区域的测量值关联起来。 @zh-hans
toolkit label: 静态图像的尺寸 @zh-hans
toolkit definition: 一个静态图像的图画区域的测量值 @zh-hans
label: durağan görüntü boyutları ile ilişkilidir @tr
definition: Bir gösterimi, hareketsiz bir görüntünün resimsel alanının ölçümüyle ilişkilendirir. @tr
toolkit label: hareketsiz görüntü boyutları @tr
toolkit definition: Hareketsiz bir görüntünün resimsel alanının ölçümü. @tr
label: tiene dimensiones de imagen fija @es

has ISSN of subseries (Deprecated)
status: Deprecated
definition: Relates a manifestation to an identifier for manifestation that is assigned to a subseries by an ISSN registration agency. (Deprecated)
type: Property
domain: C10007
lexical alias: issnOfSubseries.en
instruction number: 2.12.16
toolkit label: ISSN of subseries (Deprecated)
toolkit definition: An identifier for manifestation that is assigned to a subseries by an ISSN registration agency. (Deprecated)
label: a pour ISSN de sous-collection @fr
definition: Met une manifestation en relation avec un identifiant attribué à une sous-collection par une agence d’enregistrement de l’ISSN. @fr
toolkit label: ISSN de sous-collection @fr
toolkit definition: Identifiant attribué à une sous-collection par une agence d’enregistrement de l’ISSN. @fr
toolkit label: ISSN de la subserie @es
toolkit definition: El identificador asignado a una subserie por una agencia de registro del ISSN. @es
label: har underseries ISSN @sv
toolkit label: underseries ISSN @sv
toolkit label: ISSN van onderreeks @nl
toolkit definition: Een identificatie toegekend aan een onderreeks door een ISSN-registratiebureau. @nl
label: có issn của tiểu tùng thư @vi
definition: Liên kết biểu thị với chỉ số nhận dạng được cơ quan đăng ký ISSN gán cho tiểu tùng thư. @vi
toolkit label: ISSN của tiểu tùng thư @vi
toolkit definition: Chỉ số nhận dạng được cơ quan đăng ký ISSN gán cho tiểu tùng thư. @vi
label: har ISSN for underserie @da
definition: Relaterer en manifestation til en unik identifikator givet til en underserie af en ISSN-registreringsinstitution. @da
toolkit label: ISSN for underserie @da
toolkit definition: Unik identifikator givet til en underserie af en ISSN-registreringsinstitution. @da
label: hat ISSN der Unterreihe @de
definition: Setzt eine Manifestation mit einem Identifikator, der einer Unterreihe durch eine ISSN-Registrierungsstelle zugewiesen wird, in Beziehung. @de
toolkit label: ISSN der Unterreihe @de
toolkit definition: Ein Identifikator, der einer Unterreihe durch eine ISSN-Registrierungsstelle zugewiesen wird. @de
label: té com a ISSN de subcol·lecció @ca
definition: Relaciona una manifestació amb un identificador assignat a una subcol·lecció per una agència de registre de l’ISSN. @ca
toolkit label: ISSN de subcol·lecció @ca
toolkit definition: Identificador assignat a una subcol·lecció per una agència de registre de l’ISSN. @ca
label: alasarjan ISSN-tunnus @fi
definition: Liittää manifestaation ISSN-keskuksen alasarjalle antamaan tunnisteeseen. @fi
toolkit label: alasarjan ISSN-tunnus @fi
toolkit definition: ISSN-keskuksen alasarjalle antama tunniste. @fi
toolkit definition: En identifikator tildelt en underserie av et ISSN-kontor. @no
label: έχει ISSN της υποσειράς @el
definition: Συνδέει μια εκδήλωση με ένα αναγνωριστικό που ανατίθεται σε μια υποσειρά από έναν φορέα απόδοσης του ISSN. @el
toolkit label: ISSN της υποσειράς @el
toolkit definition: Ένα αναγνωριστικό που ανατίθεται σε μια υποσειρά από έναν φορέα απόδοσης του ISSN. @el
has element type: 2
label: van alsorozati ISSN-je @hu
definition: Egy megjelenési formát hozzákapcsol egy azonosítóhoz, amelyet egy ISSN regisztrációs ügynökség utal ki egy alsorozatnak. @hu
toolkit label: alsorozat ISSN-je @hu
toolkit definition: Egy azonosító, amelyet egy ISSN regisztrációs ügynökség utalt ki egy alsorozatnak. @hu
has subproperty: P30167

has other title information of subseries (Deprecated)
status: Deprecated
definition: Relates a manifestation to a word, character, or group of words or characters that appears in conjunction with, and is subordinate to, a title proper of a subseries. (Deprecated)
type: Property
domain: C10007
lexical alias: otherTitleInformationOfSubseries.en
instruction number: 2.12.12
toolkit label: other title information of subseries (Deprecated)
toolkit definition: A word, character, or group of words or characters that appears in conjunction with, and is subordinate to, a title proper of a subseries. (Deprecated)
label: a pour complément de titre de sous-collection @fr
definition: Met une manifestation en relation avec un mot, un caractère ou un groupe de mots ou de caractères qui figure conjointement avec un titre propre de sous-collection et lui est subordonné. @fr
toolkit label: complément de titre de sous-collection @fr
toolkit definition: Mot, caractère ou groupe de mots ou de caractères qui figure conjointement avec un titre propre de sous-collection et lui est subordonné. @fr
toolkit label: información complementaria del título de la subserie @es
toolkit definition: Información que aparece en conjunción con el título propiamente dicho de una subserie y está subordinada a él. @es
label: har övrig titelinformation för underserie @sv
toolkit label: övrig titelinformation för underserie @sv
toolkit label: andere titelinformatie van onderreeks @nl
toolkit definition: Een woord, karakter of groep woorden en/of karakters die verschijnen samen met, en ondergeschikt zijn aan de hoofdtitel van een onderreeks. @nl
label: có thông tin nhan đề khác của tiểu tùng thư @vi
definition: Liên kết biểu thị với từ, ký tự, hoặc nhóm từ hoặc ký tự, xuất hiện cùng với, và là dưới cấp của, nhan đề hợp thức của tiểu tùng thư. @vi
toolkit label: thông tin nhan đề khác của tiểu tùng thư @vi
toolkit definition: Từ, ký tự, hoặc nhóm từ hoặc ký tự, xuất hiện cùng với, và là dưới cấp của, nhan đề hợp thức của tiểu tùng thư. @vi
label: har anden titelinformation for underserie @da
definition: Relaterer en manifestation til et ord, tegn eller en gruppe af ord og/eller tegn, der optræder i forbindelse med, og er underordnet, en underseries hovedtitel. @da
toolkit label: anden titelinformation for underserie @da
toolkit definition: Ord, tegn eller gruppe af ord og/eller tegn, der optræder i forbindelse med, og er underordnet, en underseries hovedtitel. @da
label: hat Titelzusatz einer Unterreihe @de
definition: Setzt eine Manifestation mit einem Wort, einem Zeichen oder einer Gruppe von Wörtern und/oder Zeichen, die in Verbindung mit dem Haupttitel einer Unterreihe erscheinen und diesem nachgeordnet sind. @de
toolkit label: Titelzusatz einer Unterreihe @de
toolkit definition: Ein Wort, ein Zeichen oder eine Gruppe von Wörtern und/oder Zeichen, die in Verbindung mit dem Haupttitel einer Unterreihe erscheinen und diesem nachgeordnet sind. @de
label: té com a complement de títol de subcol·lecció @ca
definition: Relaciona una manifestació amb una paraula, caràcter o grup de paraules o de caràcters que figura en conjunció i subordinat al títol propi d’una subcol·lecció. @ca
toolkit label: complement de títol de subcol·lecció @ca
toolkit definition: Paraula, caràcter o grup de paraules o de caràcters que figura en conjunció i subordinat al títol propi d’una subcol·lecció. @ca
label: alasarjan muu nimeketieto @fi
definition: Liittää manifestaation sanaan, merkkiin tai ryhmään sanoja ja/tai merkkejä, jotka esiintyvät alasarjan päänimekkeen kanssa ja sille alisteisina. @fi
toolkit label: alasarjan muu nimeketieto @fi
toolkit definition: Sana, merkki tai ryhmä sanoja ja/tai merkkejä jotka esiintyvät alasarjan päänimekkeen kanssa ja sille alisteisina. @fi
toolkit label: annen tittelinformasjon for underserie @no
toolkit definition: Et ord, et tegn eller en gruppe av ord eller tegn som opptrer i forbindelse med, og er underordnet, hovedtittelen til en underserie. @no
label: έχει άλλες πληροφορίες σχετικές με τον τίτλο υποσειράς @el
definition: Συνδέει μια εκδήλωση με μια λέξη, έναν χαρακτήρα ή μια ομάδα λέξεων ή χαρακτήρων που εμφανίζονται σε συνδυασμό με και είναι υποδεέστεροι του κύριου τίτλου μιας υποσειράς. @el
toolkit label: άλλες πληροφορίες σχετικές με τον τίτλο υποσειράς @el
toolkit definition: Μια λέξη, ένας χαρακτήρας ή μια ομάδα λέξεων ή χαρακτήρων που εμφανίζονται σε συνδυασμό με και είναι υποδεέστεροι του κύριου τίτλου μιας υποσειράς. @el
has element type: 6
label: van alsorozati egyéb cím információja @hu
definition: Egy megjelenési formát hozzákapcsol egy szóhoz, karakterhez, vagy a szavak vagy karakterek egy csoportjához, amely egy alsorozat valódi címével párosulva, vagy annak alávetve jelenik meg. @hu
toolkit label: alsorozatról egyéb címinformáció @hu
toolkit definition: Egy szó, karakter, vagy szavak vagy karakterek egy csoportja, amely egy alsorozat valódi címével közösen, vagy annak alávetve jelenik meg. @hu
has subproperty: has parallel other title information of subseries (Deprecated)
has subproperty: P30144

has numbering within subseries (Deprecated)
status: Deprecated
definition: Relates a manifestation to a designation of the sequencing of a part or parts within a subseries. (Deprecated)
type: Property
domain: C10007
lexical alias: numberingWithinSubseries.en
scope note: Numbering includes a numeral, a letter, any other character, or the combination of these with or without an accompanying caption /or a chronological designation.
instruction number: 2.12.17
toolkit label: numbering within subseries (Deprecated)
toolkit definition: A designation of the sequencing of a part or parts within a subseries. (Deprecated)
label: a pour numérotation au sein d’une sous-collection @fr
definition: Met une manifestation en relation avec une désignation de l’ordre séquentiel d’une ou plusieurs parties à l’intérieur d’une sous-collection. @fr
scope note: La numérotation comprend un chiffre, une lettre, tout autre caractère ou la combinaison de ces éléments, accompagnés ou non d’une appellation et/ou d’une désignation chronologique. @fr
toolkit label: numérotation au sein d’une sous-collection @fr
toolkit definition: Désignation de l’ordre séquentiel d’une ou plusieurs parties à l’intérieur d’une sous-collection. @fr
toolkit label: numeración dentro de la subserie @es
toolkit definition: Una designación de la secuencia de una parte o partes dentro de la subserie. @es
label: har numrering inom underserie @sv
toolkit label: numrering inom underserie @sv
toolkit label: nummering binnen onderreeks @nl
toolkit definition: Een aanduiding van de volgorde van een deel of delen binnen een onderreeks. @nl
label: có đánh số bên trong tiểu tùng thư @vi
definition: Liên kết biểu thị với định danh của việc sắp xếp chuỗi của phần hoặc các phần bên trong tiểu tùng thư. @vi
scope note: Đánh số bao gồm con số, chữ cái, ký tự bất kỳ khác, hoặc tổ hợp của chúng có hoặc không dấu hiệu đi kèm và/hoặc định danh biên niên. @vi
toolkit label: đánh số bên trong tiểu tùng thư @vi
toolkit definition: Định danh của việc sắp xếp chuỗi của phần hoặc các phần bên trong tiểu tùng thư. @vi
scope note: Nummering omvat een getal, een letter, elk ander karakter of een combinatie daarvan met of zonder een begeleidende tekst en/of een chronologische aanduiding. @nl
label: har nummerering indenfor underserie @da
definition: Relaterer en manifestation til en sekvensbetegnelse for en del eller flere dele i en underserie. @da
scope note: Nummerering omfatter et tal, et bogstav, ethvert andet tegn eller en kombination af disse med eller uden tilhørende tekst og/eller en kronologisk betegnelse. @da
toolkit label: nummerering indenfor underserie @da
toolkit definition: Sekvensbetegnelse for en del eller flere dele i en underserie. @da
label: hat Zählung innerhalb der Unterreihe @de
definition: Setzt eine Manifestation mit einer Bezeichnung der Abfolge von einem bzw. mehreren Teilen innerhalb einer Unterreihe in Beziehung. @de
scope note: Zur Zählung innerhalb der Unterreihe kann eine Ziffer, ein Buchstabe oder jedes andere Zeichen oder eine Kombination aus diesen, mit oder ohne Begleittext (Band, Nummer usw.) und/oder chronologische Bezeichnung gehören. @de
toolkit label: Zählung innerhalb einer Unterreihe @de
toolkit definition: Eine Bezeichnung der Abfolge von einem bzw. mehreren Teilen innerhalb einer Unterreihe. @de
label: té com a numeració dins d’una subcol·lecció @ca
definition: Relaciona una manifestació amb una designació de l’ordre seqüencial d’una o més parts dins d’una subcol·lecció. @ca
scope note: La numeració inclou una xifra, una lletra, qualsevol altre caràcter o una combinació d’aquests elements amb o sense una designació d’acompanyament i/o una designació cronològica. @ca
toolkit label: numeració dins d’una subcol·lecció @ca
toolkit definition: Designació de l’ordre seqüencial d’una o més parts dins d’una subcol·lecció. @ca
label: alasarjan numerointi @fi
definition: Liittää manifestaation alasarjan numerointiin, joka osoittaa alasarjan osan tai osien järjestystä alasarjassa. @fi
toolkit label: alasarjan numerointi @fi
toolkit definition: Alasarjan numerointi osoittaa alasarjan osan tai osien järjestystä alasarjassa. @fi
toolkit label: nummerering innen underserie @no
toolkit definition: Nummerering av en del eller deler i en underserie. @no
label: έχει αρίθμηση εντός της υποσειράς @el
definition: Συνδέει μια εκδήλωση με έναν προσδιορισμό της ακολουθίας ενός μέρους ή μερών εντός μιας υποσειράς. @el
scope note: Η αρίθμηση περιλαμβάνει ένα αριθμητικό, ένα γράμμα, οποιονδήποτε άλλον χαρακτήρα ή τον συνδυασμό αυτών με ή χωρίς συνοδευτική κεφαλίδα ή/και χρονολογικό προσδιορισμό. @el
toolkit label: αρίθμηση εντός της υποσειράς @el
toolkit definition: Ένας προσδιορισμός της ακολουθίας ενός μέρους ή μερών εντός μιας υποσειράς. @el
has element type: 6
label: van alsorozaton belüli számozása @hu
definition: Egy megjelenési formát hozzákapcsol egy rész vagy részek sorrendiségének a jelöléséhez egy alsorozaton belül. @hu
scope note: A számozás magába foglal egy számot, egy betűt, bármely karaktert, vagy ezek kombinációját a kísérő felirattal vagy anélkül, és/vagy egy kronológiai jelölést. @hu
toolkit label: számozás alsorozaton belül @hu
toolkit definition: Rész vagy részek számsorrendjének jelölése egy alsorozaton belül. @hu
has subproperty: P30015

has parallel other title information of subseries (Deprecated)
status: Deprecated
definition: Relates a manifestation to an other title information of a subseries in another language or script. (Deprecated)
type: Property
domain: C10007
lexical alias: parallelOtherTitleInformationOfSubseries.en
instruction number: 2.12.13
toolkit label: parallel other title information of subseries (Deprecated)
toolkit definition: An other title information of a subseries in another language or script. (Deprecated)
label: a pour complément de titre parallèle de sous-collection @fr
definition: Met une manifestation en relation avec un complément de titre de sous-collection dans une langue ou une écriture différentes de celles enregistrées dans un élément Complément de titre de sous-collection. @fr
toolkit label: complément de titre parallèle de sous-collection @fr
toolkit definition: Complément de titre de sous-collection dans une langue ou une écriture différentes de celles enregistrées dans un élément Complément de titre de sous-collection. @fr
toolkit label: información complementaria paralela del título de la subserie @es
toolkit definition: Información complementaria de una subserie en una lengua y/o escritura que difiere de la registrada en el elemento información complementaria del título de la subserie. @es
label: har parallell övrig titelinformation för underserie @sv
toolkit label: parallell övrig titelinformation för underserie @sv
toolkit label: parallelle overige titelinformatie van de onderreeks @nl
toolkit definition: Overige titelinformatie van een reeks in een taal en/of schrift dat afwijkt van die zoals is opgenomen in het element onderreeks. @nl
label: có thông tin nhan đề khác song song của tiểu tùng thư @vi
definition: Liên kết biểu thị với thông tin nhan đề khác của tiểu tùng thư trong ngôn ngữ hoặc hệ thống viết khác với được ghi trong yếu tố thông tin nhan đề khác của tiểu tùng thư. @vi
toolkit label: thông tin nhan đề khác song song của tiểu tùng thư @vi
toolkit definition: Thông tin nhan đề khác của tiểu tùng thư trong ngôn ngữ hoặc hệ thống viết khác với được ghi trong yếu tố thông tin nhan đề khác của tiểu tùng thư. @vi
label: har parallel anden titelinformation for underserie @da
definition: Relaterer en manifestation til andre titeloplysninger for en serie på et andet sprog og/eller i et andet alfabet end det som er anvendt ved angivelsen af andre titeloplysninger for en underserie. @da
toolkit label: parallel anden titelinformation for underserie @da
toolkit definition: Andre titeloplysninger for en serie på et andet sprog og/eller i et andet alfabet end det som er anvendt ved angivelsen af andre titeloplysninger for en underserie. @da
label: hat parallelen Titelzusatz einer Unterreihe @de
definition: Setzt eine Manifestation mit einem Titelzusatz einer Unterreihe in einer Sprache und/oder Schrift, die von derjenigen abweicht, die im Element Titelzusatz der Unterreihe erfasst ist, in Beziehung. @de
toolkit label: Paralleler Titelzusatz einer Unterreihe @de
toolkit definition: Titelzusatz einer Unterreihe in einer Sprache und/oder Schrift, die von derjenigen abweicht, die im Element Titelzusatz der Unterreihe erfasst ist. @de
label: té com a complement paral·lel de títol de subcol·lecció @ca
definition: Relaciona una manifestació amb un complement del títol d’una subcol·lecció en una llengua o una escriptura que difereix de l’enregistrada en un element Complement de títol de subcol·lecció. @ca
toolkit label: complement paral·lel de títol de subcol·lecció @ca
toolkit definition: Complement del títol d’una subcol·lecció en una llengua o una escriptura que difereix de l’enregistrada en un element Complement de títol de subcol·lecció. @ca
label: alasarjan rinnakkainen muu nimeketieto @fi
definition: Liittää manifestaation alasarjan muuhun nimeketietoon toisella kiellä ja/tai kirjoitusjärjestelmällä. @fi
toolkit label: alasarjan rinnakkainen muu nimeketieto @fi
toolkit definition: Alasarjan muu nimeketieto toisella kiellä ja/tai kirjoitusjärjestelmällä. @fi
toolkit label: parallell annen tittelinformasjon knyttet til underserie @no
toolkit definition: Annen tittelinformasjon for underserie i et annet språk eller skriftsystem enn det som er registrert i elementet for annen serietittelinformasjon knyttet til underserie. @no
label: έχει άλλες πληροφορίες σχετικές με τον παράλληλο τίτλο υποσειράς @el
definition: Συνδέει μια εκδήλωση με άλλες πληροφορίες σχετικές με τον τίτλο υποσειράς σε μια γλώσσα ή γραφή που διαφέρει από εκείνη με την οποία καταχωρίστηκαν στο στοιχείο των άλλων πληροφοριών σχετικά με τον τίτλο υποσειράς. @el
toolkit label: άλλες πληροφορίες σχετικές με τον παράλληλο τίτλο υποσειράς @el
toolkit definition: Άλλες πληροφορίες σχετικές με τον τίτλο υποσειράς σε μια γλώσσα ή γραφή που διαφέρει από εκείνη με την οποία καταχωρίστηκαν στο στοιχείο των άλλων πληροφοριών σχετικών με τον τίτλο υποσειράς. @el
sub property of: has other title information of subseries (Deprecated)
has element type: 3
sub property of: has parallel other title information of series
label: van alsorozat párhuzamos egyéb címe információja @hu
definition: Egy megjelenési formát hozzákapcsol egy alsorozat egyéb címinformációjához olyan nyelven vagy írásmódban, amely különöbözik attól, amely az alsorozat egyéb címinformációja elemben rögzítve van. @hu
toolkit label: alsorozat párhuzamos egyéb címéről információ @hu
toolkit definition: Egy alsorozat másik címinformációja olyan nyelven vagy írásmódban, amely különbözik attól, amely egy alsorozat egyéb címinformációja elemben rögzítve van. @hu
has subproperty: P30153

has parallel title proper of subseries (Deprecated)
status: Deprecated
definition: Relates a manifestation to a title proper of a subseries in another language or script. (Deprecated)
type: Property
domain: C10007
lexical alias: parallelTitleProperOfSubseries.en
instruction number: 2.12.11
toolkit label: parallel title proper of subseries (Deprecated)
toolkit definition: A title proper of subseries in another language or script. (Deprecated)
label: a pour titre propre parallèle de sous-collection @fr
definition: Met une manifestation en relation avec un titre propre de sous-collection dans une autre langue ou écriture. @fr
toolkit label: titre propre parallèle de sous-collection @fr
toolkit definition: Titre propre de sous-collection dans une autre langue ou écriture. @fr
toolkit label: título paralelo propiamente dicho de la subserie @es
toolkit definition: El título propiamente dicho de una subserie en otra lengua y/o escritura. @es
label: har parallell huvudtitel till underserie @sv
toolkit label: parallell huvudtitel till underserie @sv
toolkit label: parallelle hoofdtitel van onderreeks @nl
toolkit definition: Een hoofdtitel van een onderreeks in een andere taal en/of schrift. @nl
label: có nhan đề hợp thức song song của tiểu tùng thư @vi
definition: Liên kết biểu thị với nhan đề hợp thức của tiểu tùng thư trong ngôn ngữ hoặc hệ thống viết khác. @vi
toolkit label: nhan đề hợp thức song song của tiểu tùng thư @vi
toolkit definition: Nhan đề hợp thức của tiểu tùng thư trong ngôn ngữ hoặc hệ thống viết khác. @vi
label: har parallel hovedtitel for underserie @da
definition: Relaterer en manifestation til en hovedtitel for en underserie på et andet sprog og/eller i et andet alfabet. @da
toolkit label: parallel hovedtitel for underserie @da
toolkit definition: Hovedtitel for en underserie på et andet sprog og/eller i et andet alfabet. @da
label: hat Paralleltitel einer Unterreihe @de
definition: Setzt eine Manifestation mit einem Haupttitel einer Unterreihe in einer anderen Sprache und/oder einer anderen Schrift in Beziehung. @de
toolkit label: Paralleltitel einer Unterreihe @de
toolkit definition: Ein Haupttitel einer Unterreihe in einer anderen Sprache und/oder einer anderen Schrift. @de
label: té com a títol propi paral·lel de subcol·lecció @ca
definition: Relaciona una manifestació amb un títol propi d’una subcol·lecció en una altra llengua o escriptura. @ca
toolkit label: títol propi paral·lel de subcol·lecció @ca
toolkit definition: Títol propi d’una subcol·lecció en una altra llengua o escriptura. @ca
label: alasarjan rinnakkainen päänimeke @fi
definition: Liittää manifestaation alasarjan päänimekkeeseen toisella kielellä ja/tai kirjoitusjärjestelmällä. @fi
toolkit label: alasarjan rinnakkainen päänimeke @fi
toolkit definition: Alasarjan päänimeke toisella kielellä ja/tai kirjoitusjärjestelmällä. @fi
toolkit label: parallell hovedtittel for underserie @no
toolkit definition: En underseries hovedtittel i et annet språk eller skriftsystem. @no
label: έχει παράλληλο κύριο τίτλο υποσειράς @el
definition: Συνδέει μια εκδήλωση με έναν κύριο τίτλο υποσειράς σε μια άλλη γλώσσα ή γραφή. @el
toolkit label: παράλληλος κύριος τίτλος υποσειράς @el
toolkit definition: Ένας κύριος τίτλος υποσειράς σε μια άλλη γλώσσα ή γραφή. @el
sub property of: has title proper of subseries (Deprecated)
has element type: 3
sub property of: has parallel title of series
label: van alsorozat párhuzamos valódi címe @hu
definition: Egy megjelenési formát hozzákapcsol egy alsorozat valódi címéhez egy másik nyelven vagy írásmódban. @hu
toolkit label: alsorozat párhuzamos valódi címe @hu
toolkit definition: Egy alsorozat valódi címe másik nyelven vagy írásmódban. @hu
has subproperty: P30205

has title proper of subseries (Deprecated)
status: Deprecated
definition: Relates a manifestation to a name of a series appearing on a manifestation of an issue of a subseries. (Deprecated)
type: Property
domain: C10007
lexical alias: titleProperOfSubseries.en
instruction number: 2.12.10
toolkit label: title proper of subseries (Deprecated)
toolkit definition: A name of a series appearing on a manifestation of an issue of a subseries. (Deprecated)
label: a pour titre propre de sous-collection @fr
definition: Met une manifestation en relation avec un nom de collection qui figure sur une manifestation d’une partie d’une sous-collection. @fr
toolkit label: titre propre de sous-collection @fr
toolkit definition: Nom de collection qui figure sur une manifestation d’une partie d’une sous-collection. @fr
toolkit label: título propiamente dicho de la subserie @es
toolkit definition: El nombre principal de la subserie (i.e., el título normalmente usado para citar la subserie). @es
label: har huvudtitel till underserie @sv
toolkit label: huvudtitel till underserie @sv
toolkit label: hoofdtitel vanonderreeks @nl
toolkit definition: Een benaming van een reeks die voorkomt op een manifestatie van een deel van een onderreeks. @nl
label: có nhan đề hợp thức của tiểu tùng thư @vi
definition: Liên kết biểu thị với tên của tùng thư xuất hiện trên biểu thị của phần của tiểu tùng thư. @vi
toolkit label: nhan đề hợp thức của tiểu tùng thư @vi
toolkit definition: Tên của tùng thư xuất hiện trên biểu thị của phần của tiểu tùng thư. @vi
label: har hovedtitel for underserie @da
definition: Relaterer en manifestation til et navn på en manifestation, der optræder på en manifestation af en del af en underserie. @da
toolkit label: hovedtitel for underserie @da
toolkit definition: Navn på en serie der optræder på en manifestation af en del af en underserie. @da
label: hat Haupttitel einer Unterreihe @de
definition: Setzt eine Manifestation mit einer Bezeichnung einer Reihe, die in einer Manifestation eines Teils einer Reihe erscheint, in Beziehung. @de
toolkit label: Haupttitel einer Unterreihe @de
toolkit definition: Eine Bezeichnung einer Reihe, die in einer Manifestation eines Teils einer Reihe erscheint. @de
label: té com a títol propi de subcol·lecció @ca
definition: Relaciona una manifestació amb un nom d’una col·lecció que figura en una manifestació d’una part d’una subcol·lecció. @ca
toolkit label: títol propi de subcol·lecció @ca
toolkit definition: Nom d’una col·lecció que figura en una manifestació d’una part d’una subcol·lecció. @ca
label: alasarjan päänimeke @fi
definition: Liittää manifestaation alasarjan nimeen joka esiintyy alasarjan osan manifestaatiossa. @fi
toolkit label: alasarjan päänimeke @fi
toolkit definition: Alasarjan nimi joka esiintyy alasarjan osan manifestaatiossa. @fi
toolkit label: hovedtittel på underserie @no
toolkit definition: Et navn på en serie som finnes på en manifestasjon av en del av en serie. @no
label: έχει κύριο τίτλο υποσειράς @el
definition: Συνδέει μια εκδήλωση με ένα όνομα μιας σειράς που εμφανίζεται σε μια εκδήλωση ενός μέρους μιας υποσειράς. @el
toolkit label: κύριος τίτλος υποσειράς @el
toolkit definition: Ένα όνομα μιας σειράς που εμφανίζεται σε μια εκδήλωση ενός μέρους μιας υποσειράς. @el
sub property of: has title of series
has element type: 3
label: van alsorozat valódi címe @hu
definition: Egy megjelenési formát hozzákapcsol egy alsorozat nevéhez, amely az alsorozat egy részének a megjelenési formáján jelenik meg. @hu
toolkit label: alsorozat valódi címe @hu
toolkit definition: Egy alsorozat neve, amely egy alsorozat egy részének a megjelenési formáján jelenik meg. @hu
has subproperty: has parallel title proper of subseries (Deprecated)
has subproperty: P30158

is analysis of (manifestation) (Deprecated)
status: Deprecated
type: Property
toolkit definition: A manifestation that has been examined to identify its components and their relations. (Deprecated)
toolkit label: analysis of (manifestation) (Deprecated)
definition: Relates a work to a manifestation that has been examined to identify its components and their relations. (Deprecated)
sub property of: is description of (manifestation) (Deprecated)
lexical alias: analysisOfManifestation.en
domain: C10001

has appellation of manifestation
status: Published
type: Property
lexical alias: appellationOfManifestation.en
definition: Relates a manifestation to a nomen that is used within a given scheme or context to refer to a manifestation.
domain: C10007
toolkit label: appellation of manifestation
toolkit definition: A nomen that is used within a given scheme or context to refer to a manifestation.
sub property of: has related nomen of manifestation
has element type: 3
sub property of: P00017
label: manifestaation nimitys @fi
definition: Liittää manifestaation nomeniin, jota käytetään viitattaessa manifestaatioon tietyssä järjestelmässä tai kontekstissa. @fi
toolkit label: manifestaation nimitys @fi
toolkit definition: Nomen, jota käytetään viitattaessa manifestaatioon tietyssä järjestelmässä tai kontekstissa. @fi
label: har betegnelse for manifestasjon @no
definition: Relaterer en manifestasjon til et nomen som er brukt i et bestemt skjema eller en bestemt sammenheng for å refere til en manifestasjon. @no
toolkit label: betegnelse for manifestasjon @no
toolkit definition: Et nomen som er brukt i et bestemt skjema eller en bestemt sammenheng for å refere til en manifestasjon. @no
label: a pour appellation de manifestation @fr
definition: Met une manifestation en relation avec un nomen qui est utilisé à l’intérieur d’un schéma ou d’un contexte donnés pour désigner une manifestation. @fr
toolkit label: appellation de manifestation @fr
toolkit definition: Nomen qui est utilisé à l’intérieur d’un schéma ou d’un contexte donnés pour désigner une manifestation. @fr
label: heeft benaming van manifestatie @nl
definition: Relateert een manifestatie aan een nomen dat is gebruikt binnen een bepaald schema of context om te verwijzen naar een manifestatie. @nl
toolkit label: benaming van manifestatie @nl
toolkit definition: Een nomen dat is gebruikt binnen een bepaald schema of context om te verwijzen naar een manifestatie. @nl
label: له تسيمة لتجسيدة @ar
definition: يربط بين تجسيدة وتسمية مستخدمة في نظام أو سياق محدد ليحيل إلى تجسيدة. @ar
toolkit label: تسيمة لتجسيدة @ar
toolkit definition: تسمية مستخدمة في نظام أو سياق محدد ليحيل إلى تجسيدة. @ar
label: té com a apel·lació de manifestació @ca
definition: Relaciona una manifestació amb un nomen que s’usa en un esquema o un context determinat per referir-se a una manifestació. @ca
toolkit label: apel·lació de manifestació @ca
toolkit definition: Nomen que s’usa en un esquema o un context determinat per referir-se a una manifestació. @ca
label: har benævnelse på manifestation @da
definition: Relaterer en manifestation til et nomen, som anvendes inden for et givet skema eller kontekst for at henvise til en manifestation. @da
toolkit label: benævnelse på manifestation @da
toolkit definition: Nomen, som anvendes inden for et givet skema eller kontekst for at henvise til en manifestation. @da
label: kehastuse nimetus @et
definition: Seostab kehastuse nomen'iga, mida antud süsteemis või kontekstis kasutatakse kehastusele viitamiseks. @et
toolkit label: kehastuse nimetus @et
toolkit definition: Nomen, mida antud süsteemis või kontekstis kasutatakse kehastusele viitamiseks. @et
label: hat Bezeichnung für eine Manifestation @de
definition: Setzt eine Manifestation in Beziehung zu einem Nomen, das in einem bestimmten Schema oder Kontext verwendet wird, um eine Manifestation zu referenzieren. @de
toolkit label: Bezeichnung für eine Manifestation @de
toolkit definition: Ein Nomen, das in einem bestimmten Schema oder Kontext verwendet wird, um eine Familie zu referenzieren. @de
label: megjelenési forma megnevezése a következő: @hu
definition: Hozzákapcsol egy megjelenési formát egy nomenhez, amelyet egy adott sémán vagy kontextuson belül használnak egy entitásra való hivatkozásra. @hu
toolkit label: megjelenési forma megnevezése @hu
toolkit definition: Egy nomen, amelyet egy adott sémában vagy kontextusban használnak a megjelenési formára történő hivatkozáshoz. @hu
label: ha come denominazione di manifestazione @it
definition: Correla una manifestazione a un nomen usato all'interno di uno specifico schema o contesto per designare una manifestazione. @it
toolkit label: denominazione di manifestazione @it
toolkit definition: Nomen usato all'interno di uno specifico schema o contesto per designare una manifestazione. @it
label: manifestācijas apzīmējums @lv
definition: Sasaista manifestāciju ar nomenu, ko lieto konkrētajā sistēmā vai kontekstā, lai norādītu uz manifestāciju. @lv
toolkit label: manifestācijas apzīmējums @lv
toolkit definition: Nomens, ko lieto konkrētajā sistēmā vai kontekstā, lai norādītu uz manifestāciju @lv
label: 有载体表现的称谓 @zh-hans
definition: 将一种载体表现与在一个指定的体系或语境中用于指称一种载体表现的一个命名关联起来。 @zh-hans
toolkit label: 载体表现的称谓 @zh-hans
toolkit definition: 在一个指定的体系或语境中用于指称一种载体表现的一个命名 @zh-hans
label: gösterimin unvanı ile ilişkilidir @tr
definition: Bir gösterimi, bir gösterimi ifade etmek için belirli bir şema veya bağlam içinde kullanılan bir isim ile ilişkilendirir. @tr
toolkit label: gösterimin unvanı @tr
toolkit definition: Belirli bir şema veya bağlam içinde bir gösterimi ifade etmek için kullanılan bir isim. @tr
label: tiene denominación de manifestación @es
definition: Relaciona una manifestación con un nomen que se utiliza dentro de un esquema o contexto determinado para referirse a una manifestación. @es
toolkit label: denominación de manifestación @es
toolkit definition: Un nomen que se utiliza dentro de un esquema o contexto determinado para referirse a una manifestación. @es
has subproperty: has access point for manifestation
has subproperty: has title of manifestation
has subproperty: has identifier for manifestation
has subproperty: P30277

has authorized access point for manifestation
status: Published
type: Property
lexical alias: authorizedAccessPointForManifestation.en
definition: Relates a manifestation to a nomen that is an access point of manifestation that is selected for preference in a specific vocabulary encoding scheme.
domain: C10007
toolkit label: authorized access point for manifestation
toolkit definition: A nomen that is an access point of manifestation that is selected for preference in a specific vocabulary encoding scheme.
sub property of: has access point for manifestation
has element type: 3
sub property of: P00020
label: manifestaation auktorisoitu hakutieto @fi
definition: Liittää manifestaation nomeniin, joka on manifestaation hakutieto, joka on valittu ensisijaiseksi tietyssä sanaston merkintäjärjestelmässä. @fi
toolkit label: manifestaation auktorisoitu hakutieto @fi
toolkit definition: Nomen, joka on manifestaation hakutieto, joka on valittu ensisijaiseksi tietyssä sanaston merkintäjärjestelmässä. @fi
label: har autorisert søkeinngang for manifestasjon @no
definition: Relaterer en manifestasjon til en foretrukket søkeinngang for manifestasjon som er valgt fra et bestemt kodeskjema for vokabular. @no
toolkit label: autorisert søkeinngang for manifestasjon @no
toolkit definition: En foretrukket søkeinngang for manifestasjon som er valgt fra et bestemt kodeskjema for vokabular. @no
label: a pour point d’accès autorisé d’une manifestation @fr
definition: Met une manifestation en relation avec un nomen qui est un point d’accès d’une manifestation faisant l’objet d’un choix privilégié dans un schéma d’encodage de vocabulaire spécifique. @fr
toolkit label: point d’accès autorisé d’une manifestation @fr
toolkit definition: Nomen qui est un point d’accès d’une manifestation faisant l’objet d’un choix privilégié dans un schéma d’encodage de vocabulaire spécifique. @fr
label: heeft geautoriseerde ingang voor manifestatie @nl
definition: Relateert een manifestatie aan een nomen dat is een ingang van manifestatie die als voorkeursterm geselecteerd is in een specifiek vocabulair coderingssysteem. @nl
toolkit label: geautoriseerde ingang voor manifestatie @nl
toolkit definition: Een nomen dat is een ingang van manifestatie die als voorkeursterm geselecteerd is in een specifiek vocabulair coderingssysteem. @nl
label: له نقطة إتاحة مقننة لتجسيدة @ar
definition: يربط بين تجسيدة ونقطة إتاحة لتجسيدة التي تم اختيارها من خطة ترميز مفردات محددة. @ar
toolkit label: نقطة إتاحة مقننة لتجسيدة @ar
toolkit definition: نقطة إتاحة لتجسيدة التي تم اختيارها من خطة ترميز مفردات محددة. @ar
label: té com a punt d’accés autoritzat de manifestació @ca
definition: Relaciona una manifestació amb un nomen que és un punt d’accés de manifestació que se selecciona com a preferent en un esquema de codificació de vocabulari específic. @ca
toolkit label: punt d’accés autoritzat de manifestació @ca
toolkit definition: Nomen que és un punt d’accés de manifestació que se selecciona com a preferent en un esquema de codificació de vocabulari específic. @ca
label: har autoriseret søgeindgang for manifestation @da
definition: Relaterer en manifestation til en søgeindgang for manifestation, som er valgt som præference i et specifikt vokabularkodningsskema. @da
toolkit label: autoriseret søgeindgang for manifestation @da
toolkit definition: Søgeindgang for manifestation, som er valgt som præference i et specifikt vokabularkodningsskema. @da
label: kehastuse normitud otsielement @et
definition: Seostab kehastuse kehastuse otsielemendiga, mis on valitud eelistatuks vastavas leksikaalses märkimissüsteemis. @et
toolkit label: kehastuse normitud otsielement @et
toolkit definition: Kehastuse otsielement, mis on valitud eelistatuks vastavas leksikaalses märkimissüsteemis. @et
label: hat normierten Sucheinstieg für eine Manifestation @de
definition: Setzt eine Manifestation in Beziehung zu einem Sucheinstieg für eine Manifestation, der in einem bestimmten Vocabulary Encoding Scheme als Vorzugsform bestimmt wird. @de
toolkit label: Normierter Sucheinstieg für eine Manifestation @de
toolkit definition: Ein Sucheinstieg für eine Manifestation, der in einem bestimmten Vocabulary Encoding Scheme als Vorzugsform bestimmt wird. @de
label: autorizált hozzáférési pontja megjelenési formához a következő: @hu
definition: Egy megjelenési forma a megjelenési forma egy olyan hozzáférési pontjához, amelynek kiválasztásához egy speciális szótárkódolási sémát részesítenek előnyben. @hu
toolkit label: autorizált hozzáférési pont megjelenési formához: @hu
toolkit definition: Egy nomen, amely egy olyan hozzáférési pont időtartam számára, amelyet egy adott szótárkódolási sémában nem részesítenek előnyben. @hu
label: ha come punto d'accesso autorizzato per manifestazione @it
definition: Correla una manifestazione a un punto d'accesso di una manifestazione scelto come preferito in uno specifico schema di codifica del vocabolario. @it
toolkit label: punto d'accesso autorizzato per manifestazione @it
toolkit definition: Punto d'accesso di una manifestazione scelto come preferito in uno specifico schema di codifica del vocabolario. @it
label: manifestācijas autoritatīvā pamatforma @lv
definition: Sasaista manifestāciju ar nomenu, kas ir manifestācijas pamatforma, kas ir izvēle no konkrētas vārdnīcas. @lv
toolkit label: manifestācijas autoritatīvā pamatforma @lv
toolkit definition: Manifestācijas pamatforma, kas ir izvēle no konkrētas vārdnīcas. @lv
label: 有载体表现的规范检索点 @zh-hans
definition: 将一种载体表现与作为一种载体表现的检索点、并在一个特定的词表编码体系中被首选的一个命名关联起来。 @zh-hans
toolkit label: 载体表现的规范检索点 @zh-hans
toolkit definition: 作为一种载体表现的检索点、并在一个特定的词表编码体系中被首选的一个命名 @zh-hans
label: gösterim için yetkili erişim noktası ile ilişkilidir @tr
definition: Bir gösterimi, belirli bir kelime kodlama şemasında tercih edilmek üzere seçilen bir örneğin erişim noktası olan bir isimle ilişkilendirir. @tr
toolkit label: gösterim için yetkili erişim noktası @tr
toolkit definition: Belirli bir kelime kodlama şemasında tercih için seçilen bir gösterimin erişim noktası olan bir isim. @tr
label: tiene un punto de acceso autorizado para la manifestación @es
definition: Relaciona una manifestación con un nomen que es un punto de acceso a la manifestación que se selecciona de preferencia en un esquema de codificación de vocabulario específico. @es
toolkit label: punto de acceso autorizado para la manifestación @es
toolkit definition: Un nomen que es un punto de acceso a la manifestación que se selecciona de preferencia en un esquema de codificación de vocabulario específico. @es
has subproperty: P30294

has groove characteristic
status: Published
definition: Relates a manifestation to a groove width of an analog disc or a groove pitch of an analog cylinder.
type: Property
domain: C10007
sub property of: has sound characteristic
lexical alias: grooveCharacteristic.en
instruction number: 3.16.5
toolkit label: groove characteristic
toolkit definition: A groove width of an analog disc or a groove pitch of an analog cylinder.
label: a pour caractéristique de sillon @fr
definition: Met une manifestation en relation avec une largeur de sillon d’un disque analogique ou un pas de sillonnage d’un cylindre analogique. @fr
toolkit label: caractéristique de sillon @fr
toolkit definition: Largeur de sillon d’un disque analogique ou pas de sillonnage d’un cylindre analogique. @fr
toolkit label: característica de ranura @es
toolkit definition: El ancho de ranura de un disco analógico o con el paso de ranura de un cilindro analógico. @es
label: har spårkarakteristika @sv
toolkit label: spårkarakteristika @sv
toolkit label: groefkenmerken @nl
toolkit definition: Een groefbreedte van een analoge schijf of groefpitch van een analoge cilinder. @nl
label: có đặc trưng đường rãnh @vi
definition: Liên kết biểu thị với chiều rộng đường rãnh của đĩa tương tự hoặc mức đương rãnh trong trục lăn tương tự. @vi
toolkit label: đặc trưng đường rãnh @vi
toolkit definition: Chiều rộng đường rãnh của đĩa tương tự hoặc mức đương rãnh trong trục lăn tương tự. @vi
label: har rillekarakteristika @da
definition: Relaterer en manifestation til en rillebredde på en analog disk eller en rilledybde på en analog cylinder. @da
toolkit label: rillekarakteristika @da
toolkit definition: Rillebredde på en analog disk eller en rilledybde på en analog cylinder. @da
label: hat Rilleneigenschaft @de
definition: Setzt eine Manifestation in Beziehung zu einer Rillenbreite einer Schallplatte oder einem Rillenabstand eines Phonographenzylinders. @de
toolkit label: Rilleneigenschaft @de
toolkit definition: Eine Rillenbreite einer Schallplatte oder ein Rillenabstand eines Phonographenzylinders. @de
label: té com a característica de solc @ca
definition: Relaciona una manifestació amb una amplada del solc d’un disc analògic o un pas del solc d’un cilindre analògic. @ca
toolkit label: característica de solc @ca
toolkit definition: Amplada del solc d’un disc analògic o un pas del solc d’un cilindre analògic. @ca
definition: Liittää manifestaation analogisen levyn uran leveyteen tai analogisen äänilieriön urajakoon. @fi
toolkit label: uran ominaisuudet @fi
toolkit definition: Analogisen levyn uran leveys tai analogisen äänilieriön urajako. @fi
toolkit label: rilleegenskaper @no
toolkit definition: En rillebredde for en analog plate eller rillevidde for en analog sylinder. @no
label: έχει χαρακτηριστικό της αύλακας @el
definition: Συνδέει μια εκδήλωση με το πλάτος μιας αύλακας ενός αναλογικού δίσκου ή το ύψος μιας αύλακας ενός αναλογικού κυλίνδρου. @el
toolkit label: χαρακτηριστικό αύλακας @el
toolkit definition: Το πλάτος μιας αύλακας ενός αναλογικού δίσκου ή το ύψος μιας αύλακας ενός αναλογικού κυλίνδρου. @el
has element type: 5
label: barázdajellemzője a következő: @hu
definition: Hozzákapcsol egy megjelenési formát egy analóg lemez vagy diszk barázdaszélességéhez, vagy egy analóg henger barázdamagasságához. @hu
toolkit label: barázdajellemzője: @hu
toolkit definition: Egy analóg lemez vagy diszk barázdaszélessége, vagy egy analóg henger barázdamagassága. @hu
label: uran ominaisuudet @fi
label: har rilleegenskaper @no
definition: Relaterer en manifestasjon til en rillebredde for en analog plate eller rillevidde for en analog sylinder. @no
label: heeft groefkenmerken @nl
definition: Relateert een manifestatie aan een groefbreedte van een analoge schijf of groefpitch van een analoge cilinder. @nl
label: له خاصية تلثيم @ar
definition: يربط بين تجسيدة وعرض المسار لقرص تناظري أو المسار لاسطوانة تناظرية. @ar
toolkit label: خاصية تلثيم @ar
toolkit definition: عرض المسار لقرص تناظري أو المسار لاسطوانة تناظرية. @ar
label: vao tunnus @et
definition: Seostab kehastuse analoogplaadi vao laiusega või analoogtrumli vao sammuga. @et
toolkit label: vao tunnus @et
toolkit definition: Analoogplaadi vao laius või analoogtrumli vao samm. @et
label: ha come caratteristica del solco @it
definition: Correla una manifestazione a un'ampiezza del solco di un disco analogico o passo del solco di un cilindro analogico. @it
toolkit label: caratteristica del solco @it
toolkit definition: Ampiezza del solco di un disco analogico o passo del solco di un cilindro analogico. @it
label: rievas raksturojums @lv
definition: Sasaista manifestāciju ar analoga diska (skaņuplates) rievas platumu vai analogā ruļļa (cilindra) rievu blīvumu. @lv
toolkit label: rievas raksturojums @lv
toolkit definition: Analoga diska (skaņuplates) rievas platums vai analogā ruļļa (cilindra) rievu blīvums. @lv
label: 有纹槽特征 @zh-hans
definition: 将一种载体表现与模拟盘的纹槽宽度或模拟筒的纹槽间距关联起来。 @zh-hans
toolkit label: 纹槽特征 @zh-hans
toolkit definition: 模拟盘的纹槽宽度或模拟筒的纹槽间距 @zh-hans
label: oluk özelliği ile ilişkilidir @tr
definition: Bir gösterimi, bir analog diskin oluk genişliği veya bir analog silindirin oluk aralığı ile ilişkilendirir. @tr
toolkit label: oluk özelliği @tr
toolkit definition: Bir analog diskin oluk genişliği veya bir analog silindirin oluk aralığı. @tr
label: tiene característica de ranura @es

has details of groove characteristic
status: Published
type: Property
lexical alias: detailsOfGrooveCharacteristic.en
definition: Relates a manifestation to details of a groove width of an analog disc or a groove pitch of an analog cylinder.
domain: C10007
instruction number: 3.16.5.4
toolkit label: details of groove characteristic
toolkit definition: Details of a groove width of an analog disc or a groove pitch of an analog cylinder.
toolkit label: detalles de ranura característica @es
toolkit definition: Detalles del ancho de una ranura de un disco analógico o un paso de ranura de un cilindro analógico. @es
sub property of: has details of sound characteristic
label: har detaljerad information om spårkaraktäristika @sv
toolkit label: detaljerad information om spårkaraktäristika @sv
toolkit label: details van groefkenmerken @nl
toolkit definition: Details van een groefbreedte van een analoge schijf of groefpitch van een analoge cilinder. @nl
label: có chi tiết của đặc trưng đường rãnh @vi
definition: Liên kết biểu thị với chi tiết của chiều rộng đường rãnh của đĩa tương tự hoặc mức đương rãnh trong trục lăn tương tự. @vi
toolkit label: chi tiết của đặc trưng đường rãnh @vi
toolkit definition: Chi tiết của chiều rộng đường rãnh của đĩa tương tự hoặc mức đương rãnh trong trục lăn tương tự. @vi
label: har detaljer om rillekarakteristika @da
definition: Relaterer en manifestation til detaljer om en rillebredde på en analog disk eller en rilledybde på en analog cylinder. @da
toolkit label: detaljer om rillekarakteristika @da
toolkit definition: Detaljer om en rillebredde på en analog disk eller en rilledybde på en analog cylinder. @da
label: hat Details zur Rilleneigenschaft @de
definition: Setzt eine Manifestation in Beziehung zu den Details zur Rillenbreite einer Schallplatte oder zum Rillenabstand eines Phonographenzylinders. @de
toolkit label: Details zur Rilleneigenschaft @de
toolkit definition: Details zur Rillenbreite einer Schallplatte oder zum Rillenabstand eines Phonographenzylinders. @de
label: té com a particularitats de característiques de solc @ca
definition: Relaciona una manifestació amb les particularitats d’una amplada del solc d’un disc analògic o un pas del solc d’un cilindre analògic. @ca
toolkit label: particularitats de característiques de solc @ca
toolkit definition: Particularitats d’una amplada del solc d’un disc analògic o un pas del solc d’un cilindre analògic. @ca
definition: Liittää manifestaation tarkempiin tietoihin analogisen levyn uran leveydestä tai äänilieriön urajaosta. @fi
toolkit label: uran ominaisuuksien tarkemmat tiedot @fi
toolkit definition: Tarkemmat tiedot analogisen levyn uran leveydestä tai äänilieriön urajaosta. @fi
toolkit label: detaljer vedrørende rilleegenskaper @no
toolkit definition: Detaljer vedrørende rillebredde for en analog plate eller rillevidde for en analog sylinder. @no
label: έχει λεπτομέρειες του χαρακτηριστικού της αύλακας @el
definition: Συνδέει μια εκδήλωση με τις λεπτομέρειες του πλάτους μιας αύλακας ενός αναλογικού δίσκου ή του ύψους μιας αύλακας ενός αναλογικού κυλίνδρου. @el
toolkit label: λεπτομέρειες του χαρακτηριστικού της αύλακας @el
toolkit definition: Λεπτομέρειες του πλάτους μιας αύλακας ενός αναλογικού δίσκου ή του ύψους μιας αύλακας ενός αναλογικού κυλίνδρου. @el
label: a pour particularités d’une caractéristique de sillon @fr
definition: Met une manifestation en relation avec des particularités d’une largeur de sillon d’un disque analogique ou d’un pas de sillonnage d’un cylindre analogique. @fr
toolkit label: particularités d’une caractéristique de sillon @fr
toolkit definition: Particularités d’une largeur de sillon d’un disque analogique ou d’un pas de sillonnage d’un cylindre analogique. @fr
has element type: 6
label: barázdajellemzők részletei a következők: @hu
definition: Hozzákapcsol egy megjelenési formát egy analóg lemez barázdaszélességének vagy egy analóg henger barázdamélységének részleteihez. @hu
toolkit label: barázdajellemzők részletei: @hu
toolkit definition: Egy analóg lemez barázdaszélességének vagy egy analóg henger barázdamélységének részletei. @hu
label: uran ominaisuuksien tarkemmat tiedot @fi
label: har detaljer vedrørende rilleegenskaper @no
definition: Relaterer en manifestasjon til detaljer vedrørende rillebredde for en analog plate eller rillevidde for en analog sylinder. @no
label: heeft details van groefkenmerken @nl
definition: Relateert een manifestatie aan details van een groefbreedte van een analoge schijf of groefpitch van een analoge cilinder. @nl
label: له تفاصيل عن خاصية تلثيم @ar
definition: يربط بين تجسيدة وتفاصيل عرض المسار لقرص تناظري أو مسار الاسطوانة التناظرية. @ar
toolkit label: تفاصيل عن خاصية تلثيم @ar
toolkit definition: تفاصيل عرض المسار لقرص تناظري أو مسار الاسطوانة التناظرية. @ar
label: vao tunnuse täpsustus @et
definition: Seostab kehastuse täpsemate andmetega analoogplaadi vao laiuse või analoogtrumli vao sammu kohta. @et
toolkit label: vao tunnuse täpsustus @et
toolkit definition: Täpsemad andmed analoogplaadi vao laiuse või analoogtrumli vao sammu kohta. @et
label: ha come particolari relativi alla caratteristica del solco @it
definition: Correla una manifestazione ai particolari relativi a una profondità del solco di un disco analogico o passo del solco di un cilindro analogico. @it
toolkit label: particolari relativi alla caratteristica del solco @it
toolkit definition: Particolari relativi a una profondità del solco di un disco analogico o passo del solco di un cilindro analogico. @it
label: detalizēti par rievu raksturojumu @lv
definition: Sasaista manifestāciju ar sīkāku informāciju par analoga diska (skaņuplates) rievu platumu vai analogā ruļļa (cilindra) rievu dziļumu. @lv
toolkit label: detalizēti par rievu raksturojumu @lv
toolkit definition: Sīkāka informācija par analoga diska (skaņuplates) rievu platumu vai analogā ruļļa (cilindra) rievu dziļumu. @lv
label: 有纹槽特征的细节 @zh-hans
definition: 将一种载体表现与模拟盘的纹槽宽度或模拟筒的纹槽间距的细节关联起来。 @zh-hans
toolkit label: 纹槽特征的细节 @zh-hans
toolkit definition: 模拟盘的纹槽宽度或模拟筒的纹槽间距的细节 @zh-hans
label: oluk özelliğinin ayrıntıları ile ilişkilidir @tr
definition: Bir gösterimi, analog bir diskin oluk genişliği veya analog bir silindirin oluk aralığıyla ilgili ayrıntılarıyla ilişkilendirir. @tr
toolkit label: oluk özelliklerinin ayrıntıları @tr
toolkit definition: Bir analog diskin oluk genişliğinin veya bir analog silindirin oluk aralığının ayrıntıları. @tr
label: tiene detalles de ranura característica @es

has base material for microfilm, microfiche, photographic film, and motion picture film (Deprecated)
status: Deprecated
type: Property
toolkit definition: The underlying physical material of a microfilm, microfiche, photographic film, or motion picture film resource. (Deprecated)
toolkit label: base material for microfilm, microfiche, photographic film, and motion picture film (Deprecated)
definition: Relates a manifestation to the underlying physical material of a microfilm, microfiche, photographic film, or motion picture film resource. (Deprecated)
sub property of: has base material
instruction number: 3.6.2
lexical alias: baseMaterialForMicrofilmMicrofichePhotographicFilmAndMotionPictureFilm.en
domain: C10007

has insert
status: Published
definition: Relates a manifestation to a manifestation that is a separate part of another manifestation.
type: Property
domain: C10007
sub property of: has part manifestation
lexical alias: insert.en
toolkit label: insert
toolkit definition: A manifestation that is a separate part of another manifestation.
label: a pour encart @fr
definition: Met une manifestation en relation avec une manifestation qui consiste en une partie distincte d’une autre manifestation. @fr
toolkit label: encart @fr
toolkit definition: Manifestation qui consiste en une partie distincte d’une autre manifestation. @fr
toolkit label: inserto @es
toolkit definition: Una manifestación con una manifestación que es una parte separada de otra manifestación. @es
instruction number: 24.5
toolkit label: ingevoegde bijlage @nl
toolkit definition: Een manifestatie die een los deel is van een andere manifestatie. @nl
label: là chèn thêm @vi
definition: Liên kết biểu thị với biểu thị có chứa tài liệu được công bố tách biệt không phải là phần cấu thành của biểu thị lớn hơn mà nó được chèn thêm vào. @vi
toolkit label: chèn thêm @vi
toolkit definition: Biểu thị có chứa tài liệu được công bố tách biệt không phải là phần cấu thành của biểu thị lớn hơn mà nó được chèn thêm vào. @vi
label: har indlæg @da
definition: Relaterer en manifestation til en manifestation, som er en separat del af en anden manifestation. @da
toolkit label: indlæg @da
toolkit definition: Manifestation, som er en separat del af en anden manifestation. @da
label: hat Beilage @de
definition: Setzt eine Manifestation in Beziehung zu einer Manifestation, die ein eigenständiger Bestandteil einer anderen Manifestation ist. @de
toolkit label: Beilage @de
toolkit definition: Eine Manifestation, die ein eigenständiger Bestandteil einer anderen Manifestation ist. @de
label: té com a encartament @ca
definition: Relaciona una manifestació amb una manifestació que és una part separada d’una altra manifestació. @ca
toolkit label: encartament @ca
toolkit definition: Manifestació que és una part separada d’una altra manifestació. @ca
definition: Liittää manifestaation manifestaatioon, joka on erillinen osa toista manifestaatiota. @fi
toolkit label: liite @fi
toolkit definition: Manifestaatio, joka on erillinen osa toista manifestaatiota. @fi
toolkit label: innlegg @no
toolkit definition: En manifestasjon som er en adskilt del av en annen manifestasjon. @no
label: είναι ένθετο @el
definition: Συνδέει μια εκδήλωση με μια εκδήλωση που συνίσταται από χωριστά εκδιδόμενο υλικό που δεν είναι ενσωματωμένο μέρος μιας μεγαλύτερης εκδήλωσης στην οποία έχει προστεθεί με ένθεση. @el
toolkit label: ένθετο @el
toolkit definition: Mια εκδήλωση που συνίσταται από χωριστά εκδιδόμενο υλικό που δεν είναι ενσωματωμένο μέρος μιας μεγαλύτερης εκδήλωσης στην οποία έχει προστεθεί με ένθεση. @el
has element type: 2
label: beillesztése a következő: @hu
definition: Hozzákapcsol egy megjelenési formát egy megjelenési formához, amely egy másik megjelenési forma külön kiadott része. @hu
toolkit label: beillesztése: @hu
toolkit definition: Egy megjelenési forma, amely egy másik megjelenési forma külön kiadott része. @hu
scope note: An insert includes a map, illustration, or advertising supplement that is not integrated with the other manifestation.
scope note: Liite käsittää esim. kartan tai kuvitus- tai mainosliitteen, joka ei ole kiinteä osa muuta manifestaatiota. @fi
label: liite @fi
label: har innlegg @no
definition: Relaterer en manifestasjon til en manifestasjon som er en adskilt del av en annen manifestasjon. @no
scope note: Et innlegg inkluderer et kart, en illustrasjon eller et annonsevedlegg som ikke er integrert i den andre manifestasjonen. @no
scope note: Un encart comprend une carte, une illustration ou un supplément publicitaire qui n’est pas intégré à l’autre manifestation. @fr
label: heeft ingevoegde bijlage @nl
definition: Relateert een manifestatie aan een manifestatie die een los deel is van een andere manifestatie. @nl
scope note: Een ingevoegde bijlage omvat een kaart, illustratie of reclamesupplement die niet geïntegreerd is in de andere manifestatie. @nl
label: له جزء مضاف @ar
definition: يربط بين تجسيدة وتجسيدة هي جزء منفصل من تجسيدة أخرى. @ar
scope note: يشتمل الجزء المضاف على خريطة، أو إيضاحية، أو ملحق إعلاني يكون غير متكامل مع التجسيدة الأخرى. @ar
toolkit label: جزء مضاف @ar
toolkit definition: تجسيدة هي جزء منفصل من تجسيدة أخرى. @ar
scope note: Un encartament inclou un mapa, una il·lustració o un suplement publicitari que no està integrat en l’altra manifestació. @ca
scope note: Indlæg omfatter et kort, en illustration eller et reklametillæg, som ikke er integreret med den anden manifestation. @da
label: vahelisa @et
definition: Seostab kehastuse kehastusega, mis on teise kehastuse eraldiseisev osa. @et
scope note: Vahelisa hõlmab nt kaarte, illustratsioone ja reklaamilisasid, mis ei moodusta teise kehastusega tervikut. @et
toolkit label: vahelisa @et
toolkit definition: Kehastus, mis on teise kehastuse eraldiseisev osa. @et
scope note: Dazu gehört eine Karte, ein Bild oder eine Werbebeilage, die/das nicht integrierter Bestandteil der anderen Manifestation ist. @de
scope note: Melléklet lehet egy térkép, illusztráció vagy reklámkiegészítő, amelyet nem ágyaztak be a másik megjelenési formába. @hu
label: ha come inserto @it
definition: Manifestazione che comprende un'altra manifestazione come parte distinta. @it
scope note: Un inserto comprende una carta geografica, una illustrazione o un supplemento pubblicitario, non integrati con l'altra manifestazione. @it
toolkit definition: Manifestazione che è una parte distinta di un'altra manifestazione. @it
label: ielikums @lv
definition: Sasaista manifestāciju ar manifestāciju, kas ir fiziski atdalāma citas manifestācijas daļa. @lv
toolkit label: ielikums @lv
toolkit definition: Manifestācija - fiziski atdalāma citas manifestācijas daļa. @lv

is inserted in
status: Published
definition: Relates a manifestation to a manifestation that includes another manifestation as a separate part.
type: Property
domain: C10007
sub property of: is part of manifestation
lexical alias: insertedIn.en
toolkit label: inserted in
toolkit definition: A manifestation that includes another manifestation as a separate part.
label: est encarté dans @fr
definition: Met une manifestation en relation avec une manifestation qui inclut une autre manifestation comme partie distincte. @fr
toolkit label: encarté dans @fr
toolkit definition: Manifestation qui inclut une autre manifestation comme partie distincte. @fr
toolkit label: insertada en @es
toolkit definition: Una manifestación que incluye otra manifestación como una parte separada. @es
instruction number: 24.5
toolkit label: ingevoegd in @nl
toolkit definition: Een manifestatie die een andere manifestatie bevat als een los onderdeel. @nl
label: được chèn vào @vi
definition: Liên kết biểu thị với biểu thị mà tài liệu được chèn vào nhưng không phải là phần cấu thành của xuất bản phẩm. @vi
toolkit label: được chèn vào @vi
toolkit definition: Biểu thị mà tài liệu được chèn vào nhưng không phải là phần cấu thành của xuất bản phẩm. @vi
label: er indlagt i @da
definition: Relaterer en manifestation til en manifestation, som omfatter en anden manifestation som en separat del. @da
toolkit label: indlagt i @da
toolkit definition: Manifestation, som omfatter en anden manifestation som en separat del. @da
label: ist beigelegt in @de
definition: Setzt eine Manifestation in Beziehung zu einer Manifestation, die eine andere Manifestation als eigenständigen Bestandteil enthält. @de
toolkit label: Beigelegt in @de
toolkit definition: Eine Manifestation, die eine andere Manifestation als eigenständigen Bestandteil enthält. @de
label: és encartat en @ca
definition: Relaciona una manifestació amb una manifestació que inclou una altra manifestació com a part separada. @ca
toolkit label: encartat en @ca
toolkit definition: Manifestació que inclou una altra manifestació com a part separada. @ca
definition: Liittää manifestaation manifestaatioon, joka sisältää toisen manifestaation erillisenä liitteenä. @fi
toolkit label: liitteenä manifestaatiossa @fi
toolkit definition: Manifestaatio, joka sisältää toisen manifestaation erillisenä liitteenä. @fi
toolkit label: lagt inn i @no
toolkit definition: En manifestasjon som inkluderer en annen manifestasjon som en adskilt del. @no
label: είναι ένθετο σε @el
definition: Συνδέει μια εκδήλωση με μια εκδήλωση στην οποία έχει προστεθεί υλικό με ένθεση το οποίο δεν είναι ενσωματωμένο μέρος της δημοσίευσης. @el
toolkit label: ένθετο σε @el
toolkit definition: Μια εκδήλωση στην οποία έχει προστεθεί υλικό με ένθεση το οποίο δεν είναι ενσωματωμένο μέρος της δημοσίευσης. @el
has element type: 2
label: beillesztve a következőbe: @hu
definition: Egy megjelenési formát hozzákapcsol egy megjelenési formához, amelybe olyan anyagot illesztettek, amely nem szerves része a kiadványnak. @hu
toolkit label: beillesztve: @hu
toolkit definition: Egy megjelenési forma, amelybe olyan anyagot illesztettek bele, amely nem szerves része a kiadványnak. @hu
scope note: An insert includes a map, illustration, or advertising supplement that is not integrated with the other manifestation.
scope note: Liite käsittää esim. kartan tai kuvitus- tai mainosliitteen, joka ei ole kiinteä osa muuta manifestaatiota. @fi
label: liitteenä manifestaatiossa @fi
label: er lagt inn i @no
definition: Relaterer en manifestasjon til en manifestasjon som inkluderer en annen manifestasjon som en adskilt del. @no
scope note: Et innlegg inkluderer et kart, en illustrasjon eller et annonsevedlegg som ikke er integrert i den andre manifestasjonen. @no
scope note: Un encart comprend une carte, une illustration ou un supplément publicitaire qui n’est pas intégré à l’autre manifestation. @fr
label: is ingevoegd in @nl
definition: Relateert een manifestatie aan een manifestatie die een andere manifestatie bevat als een los onderdeel. @nl
scope note: Een ingevoegde bijlage omvat een kaart, illustratie of reclamesupplement die niet geïntegreerd is in de andere manifestatie. @nl
label: تم إضافته في @ar
definition: يربط بين تجسيدة وتجسيدة تحتوي على تجسيدة أخرى كجزء منفصل. @ar
scope note: يشتمل الجزء المضاف على خريطة، أو إيضاحية، أو ملحق إعلاني يكون غير متكامل مع التجسيدة الأخرى. @ar
toolkit label: تم إضافته في @ar
toolkit definition: تجسيدة تحتوي على تجسيدة أخرى كجزء منفصل. @ar
scope note: Un encartament inclou un mapa, una il·lustració o un suplement publicitari que no està integrat en l’altra manifestació. @ca
scope note: Indlæg omfatter et kort, en illustration eller et reklametillæg, som ikke er integreret med den anden manifestation. @da
label: vahelisana kehastuses @et
definition: Seostab kehastuse kehastusega, mis sisaldab teist kehastust eraldiseisva osana. @et
scope note: Vahelisa hõlmab nt kaarte, illustratsioone ja reklaamilisasid, mis ei moodusta teise kehastusega tervikut. @et
toolkit label: vahelisana kehastuses @et
toolkit definition: Kehastus, mis sisaldab teist kehastust eraldiseisva osana. @et
scope note: Darunter fallen Karten, Bilder oder Werbebeilagen, die nicht integrierter Bestandteil der anderen Manifestation sind. @de
scope note: Melléklet lehet egy térkép, illusztráció vagy reklámkiegészítő, amelyet nem ágyaztak be a másik megjelenési formába. @hu
label: è inserita in @it
definition: Correla una manifestazione a una manifestazione che comprende un'altra manifestazione come parte distinta. @it
scope note: Un inserto comprende una carta geografica, una illustrazione o un supplemento pubblicitario, non integrati con l'altra manifestazione. @it
toolkit label: inserita in @it
toolkit definition: Manifestazione che comprende un'altra manifestazione come parte distinta. @it
label: ir ielikts @lv
definition: Sasaista manifestāciju ar manifestāciju, kura ietver citu manifestāciju kā fiziski atdalāmu daļu. @lv
toolkit label: ir ielikts @lv

has font size
status: Published
definition: Relates a manifestation to a size of the type that is used to represent the characters and symbols in a manifestation.
type: Property
domain: C10007
lexical alias: fontSize.en
instruction number: 3.13
toolkit label: font size
toolkit definition: A size of the type that is used to represent the characters and symbols in a manifestation.
label: a pour taille de police de caractères @fr
definition: Met une manifestation en relation avec une taille des caractères qui sont utilisés pour représenter les signes et les symboles dans une manifestation. @fr
toolkit label: taille de police de caractères @fr
toolkit definition: Taille des caractères qui sont utilisés pour représenter les signes et les symboles dans une manifestation. @fr
toolkit label: tamaño de fuente @es
toolkit definition: Un tamaño del tipo que se utiliza para representar los caracteres y símbolos de una manifestación. @es
label: har teckenstorlek @sv
toolkit label: teckenstorlek @sv
toolkit label: lettergrootte @nl
toolkit definition: Een grootte van het lettertype dat is gebruikt voor de weergave van de karakters en symbolen in een manifestatie. @nl
label: có cỡ chữ @vi
definition: Liên kết biểu thị với cỡ của chữ được dùng để trình bày ký tự hoặc ký hiệu trong biểu thị. @vi
toolkit label: cỡ chữ @vi
toolkit definition: Cỡ của chữ được dùng để trình bày ký tự hoặc ký hiệu trong biểu thị. @vi
label: har skriftstørrelse @da
definition: Relaterer en manifestation til en størrelse på den skrifttype, som anvendes til at repræsentere tegn og symboler i en manifestation. @da
toolkit label: skriftstørrelse @da
toolkit definition: Størrelse på den skrifttype, som anvendes til at repræsentere tegn og symboler i en manifestation. @da
label: hat Schriftgröße @de
definition: Setzt eine Manifestation in Beziehung zu einer Größe der Schrift, die zur Repräsentation der Zeichen und Symbole in einer Manifestation verwendet wird. @de
toolkit label: Schriftgröße @de
toolkit definition: Eine Größe der Schrift, die zur Repräsentation der Zeichen und Symbole in einer Manifestation verwendet wird. @de
label: té com a mida de font @ca
definition: Relaciona una manifestació amb una mida del tipus que s’usa per representar els caràcters i els símbols d’una manifestació. @ca
toolkit label: mida de font @ca
toolkit definition: Mida del tipus que s’usa per representar els caràcters i els símbols d’una manifestació. @ca
definition: Liittää manifestaation manifestaation merkeissä ja symboleissa käytettävään kirjasimen kokoon. @fi
toolkit label: kirjasinkoko @fi
toolkit definition: Manifestaation merkeissä ja symboleissa käytettävä kirjasimen koko. @fi
toolkit definition: En størrelse på skriften som brukes til å representere tegn og symboler i en manifestasjon. @no
label: έχει μέγεθος γραμματοσειράς @el
definition: Συνδέει μια εκδήλωση με ένα μέγεθος των τυπογραφικών στοιχείων που χρησιμοποιούνται για την αναπαράσταση των χαρακτήρων και των συμβόλων σε μια εκδήλωση. @el
toolkit label: μέγεθος γραμματοσειράς @el
toolkit definition: Ένα μέγεθος των τυπογραφικών στοιχείων που χρησιμοποιούνται για την αναπαράσταση των χαρακτήρων και των συμβόλων σε μια εκδήλωση. @el
has element type: 4
label: betűmérete a következő: @hu
definition: Hozzákapcsol egy megjelenési formát ahhoz a típusmérethez, amely a karaktereket és szimbólumokat reprezentálja egy forrásban. @hu
toolkit label: betűmérete: @hu
toolkit definition: Az a típusméret, amely a karaktereket és szimbólumokat reprezentálja egy forrásban. @hu
label: kirjasinkoko @fi
definition: Relaterer en manifestasjon til en størrelse på skriften som brukes til å representere tegn og symboler i en manifestasjon. @no
label: heeft lettergrootte @nl
definition: Relateert een manifestatie aan een grootte van het lettertype dat is gebruikt voor de weergave van de karakters en symbolen in een manifestatie. @nl
label: له حجم خط @ar
definition: يربط بين تجسيدة وحجم الخط المستخدم في تمثيل التمثيلات والرموز في تجسيدة. @ar
toolkit label: حجم خط @ar
toolkit definition: حجم الخط المستخدم في تمثيل التمثيلات والرموز في تجسيدة. @ar
label: kirja suurus @et
definition: Seostab kehastuse kehastuses sisalduvate kirjamärkide ja sümbolite esitamiseks kasutatud šrifti suurusega. @et
toolkit label: kirja suurus @et
toolkit definition: Kehastuses sisalduvate kirjamärkide ja sümbolite esitamiseks kasutatud šrifti suurus. @et
label: ha come dimensione del carattere @it
definition: Correla una manifestazione a una dimensione del carattere tipografico utilizzato per rappresentare i caratteri e i simboli in una manifestazione. @it
toolkit label: dimensione del carattere @it
toolkit definition: Dimensione del carattere tipografico utilizzato per rappresentare i caratteri e i simboli in una manifestazione. @it
label: fonta lielums @lv
definition: Sasaista manifestāciju ar rakstzīmes izmēru, ko lieto, lai parādītu simbolus un rakstzīmes resursā. @lv
toolkit label: fonta lielums @lv
toolkit definition: Rakstzīmes izmērs, ko lieto, lai parādītu simbolus un rakstzīmes resursā. @lv
label: 有字体大小 @zh-hans
definition: 将一种载体表现与在一种载体表现中用于表示字符和符号的字型的大小关联起来。 @zh-hans
toolkit label: 字体大小 @zh-hans
toolkit definition: 在一种载体表现中用于表示字符和符号的字型的大小 @zh-hans
label: yazı tipi boyutu ile ilişkilidir @tr
definition: Bir gösterimi, bir gösterimdeki karakterleri ve sembolleri temsil etmek için kullanılan türün boyutuyla ilişkilendirir. @tr
toolkit label: yazı tipi boyutu @tr
toolkit definition: Bir gösterimdeki karakterleri ve sembolleri temsil etmek için kullanılan yazı tipinin boyutu. @tr
label: tiene tamaño de fuente @es
definition: Relaciona una manifestación con un tamaño del tipo que se utiliza para representar los caracteres y símbolos de una manifestación. @es
has subproperty: P30199

has details of font size
status: Published
type: Property
lexical alias: detailsOfFontSize.en
definition: Relates a manifestation to details of a size of the type that is used to represent the characters and symbols in a manifestation.
domain: C10007
instruction number: 3.13.1.4
toolkit label: details of font size
toolkit definition: Details of a size of the type that is used to represent the characters and symbols in a manifestation.
toolkit label: detalles del tamaño de fuente @es
toolkit definition: Detalles de un tamaño del tipo que se utiliza para representar los caracteres y símbolos en una manifestación. @es
label: har detaljerad information om teckenstorlek @sv
toolkit label: detaljerad information om teckenstorlek @sv
toolkit label: details van lettergrootte @nl
toolkit definition: Details van de grootte van het lettertype gebruikt voor de weergave van de karakters en symbolen in een resource. @nl
label: có chi tiết của cỡ chữ @vi
definition: Liên kết biểu thị với chi tiết của cỡ của chữ được dùng để trình bày ký tự hoặc ký hiệu trong biểu thị. @vi
toolkit label: chi tiết của cỡ chữ @vi
toolkit definition: Chi tiết của cỡ của chữ được dùng để trình bày ký tự hoặc ký hiệu trong biểu thị. @vi
label: har detaljer om skriftstørrelse @da
definition: Relaterer en manifestation til detaljer om en størrelse på den skrifttype, som anvendes til at repræsentere tegn og symboler i en manifestation. @da
toolkit label: detaljer om skriftstørrelse @da
toolkit definition: Detaljer om en størrelse på den skrifttype, som anvendes til at repræsentere tegn og symboler i en manifestation. @da
label: hat Details zur Schriftgröße @de
definition: Setzt eine Manifestation in Beziehung zu den Details zur Größe der Schrift, die zur Repräsentation der Zeichen und Symbole in einer Manifestation verwendet wird. @de
toolkit label: Details zur Schriftgröße @de
toolkit definition: Details zur Größe der Schrift, die zur Repräsentation der Zeichen und Symbole in einer Manifestation verwendet wird. @de
label: té com a particularitats de mida de font @ca
definition: Relaciona una manifestació amb les particularitats d’una mida del tipus que s’usa per representar els caràcters i els símbols d’una manifestació. @ca
toolkit label: particularitats de mida de font @ca
toolkit definition: Particularitats d’una mida del tipus que s’usa per representar els caràcters i els símbols d’una manifestació. @ca
definition: Liittää manifestaation tarkempiin tietoihin manifestaatiossa esiintyvien merkkien ja symbolien koosta. @fi
toolkit label: kirjasinkoon tarkemmat tiedot @fi
toolkit definition: Tarkemmat tiedot manifestaatiossa esiintyvien merkkien ja symbolien koosta. @fi
toolkit label: detaljer vedrørende skriftstørrelse @no
toolkit definition: Detaljer vedrørende størrelsen på skriftensom er brukt til å representere tegn og symboler i en manifestasjon. @no
label: έχει λεπτομέρειες του μεγέθους γραμματοσειράς @el
definition: Συνδέει μια εκδήλωση με τις λεπτομέρειες ενός μεγέθους του τύπου που χρησιμοποιείται για την αναπαράσταση των χαρακτήρων και των συμβόλων σε μια εκδήλωση. @el
toolkit label: λεπτομέρειες του μεγέθους της γραμματοσειράς @el
toolkit definition: Λεπτομέρειες ενός μεγέθους του τύπου που χρησιμοποιείται για την αναπαράσταση των χαρακτήρων και των συμβόλων σε μια εκδήλωση. @el
label: a pour particularités d’une taille de police de caractères @fr
definition: Met une manifestation en relation avec des particularités d’une taille des caractères qui sont utilisés pour représenter les signes et les symboles dans une manifestation. @fr
toolkit label: particularités d’une taille de police de caractères @fr
toolkit definition: Particularités d’une taille des caractères qui sont utilisés pour représenter les signes et les symboles dans une manifestation. @fr
has element type: 6
label: betűméret részletei a következők: @hu
definition: Hozzákapcsol egy megjelenési formát egy típusméret azon részleteihez, amelyeket a karakterek és szimbólumok ábrázolásához használnak egy megjelenési formában. @hu
toolkit label: betűméret részletei: @hu
toolkit definition: Egy típusméret azon részletei, amelyeket a karakterek és szimbólumok ábrázolásához használnak egy megjelenési formában. @hu
label: kirjasinkoon tarkemmat tiedot @fi
label: har detaljer vedrørende skriftstørrelse @no
definition: Relaterer en manifestasjon til detaljer vedrørende størrelsen på skriftensom er brukt til å representere tegn og symboler i en manifestasjon. @no
label: heeft details van lettergrootte @nl
definition: Relateert een manifestatie aan details van de grootte van het lettertype gebruikt voor de weergave van de karakters en symbolen in een resource. @nl
label: له تفاصيل حجم الخط @ar
definition: يربط بين تجسيدة وتفاصيل حجم الخط المستخدم لتمثيل التمثيلات والرموز في تجسيدة. @ar
toolkit label: تفاصيل حجم الخط @ar
toolkit definition: تفاصيل حجم الخط المستخدم لتمثيل التمثيلات والرموز في تجسيدة. @ar
label: kirja suuruse täpsustus @et
definition: Seostab kehastuse täpsemate andmetega kehastuses sisalduvate kirjamärkide ja sümbolite esitamiseks kasutatud šrifti suurusega. @et
toolkit label: kirja suuruse täpsustus @et
toolkit definition: Täpsemad andmed kehastuses sisalduvate kirjamärkide ja sümbolite esitamiseks kasutatud šrifti suurusega. @et
label: ha come particolari relativi alle dimensioni del carattere @it
definition: Correla una manifestazione ai particolari relativi a delle dimensioni del carattere tipografico usato per rappresentare i caratteri e i simboli in una manifestazione. @it
toolkit label: particolari relativi alle dimensioni del carattere @it
toolkit definition: Particolari relativi a delle dimensioni del carattere tipografico usato per rappresentare i caratteri e i simboli in una manifestazione. @it
label: detalizēti par fonta lielumu @lv
definition: Sasaista manifestāciju ar sīkāku informāciju par šrifta izmēru. @lv
toolkit label: detalizēti par fonta lielumu @lv
toolkit definition: Sīkāka informācija par šrifta izmēru. @lv
label: 有字体大小细节 @zh-hans
definition: 将一种载体表现与在一种载体表现中用于表示字母和符号的字型的大小的细节关联起来。 @zh-hans
toolkit label: 字体大小细节 @zh-hans
toolkit definition: 在一种载体表现中用于表示字符和符号的字型的大小的细节 @zh-hans
label: yazı tipi boyutunun ayrıntıları ile ilişkilidir @tr
definition: Bir gösterimi, gösterimdeki karakterleri ve sembolleri temsil etmek için kullanılan yazı tipi boyutunun ayrıntılarıyla ilişkilendirir. @tr
toolkit label: yazı tipi boyutu ayrıntıları @tr
toolkit definition: Bir anlatımdaki karakterleri ve sembolleri temsil etmek için kullanılan yazı tipinin boyutunun ayrıntıları. @tr
label: tiene detalles del tamaño de fuente @es
definition: Relaciona una manifestación con detalles de un tamaño del tipo que se utiliza para representar los caracteres y símbolos en una manifestación. @es

has bibliographic format
status: Published
definition: Relates a manifestation to a proportional relationship between a whole sheet and the individual leaves that result if that sheet is left full, cut, or folded in a manifestation.
type: Property
domain: C10007
lexical alias: bibliographicFormat.en
instruction number: 3.12
toolkit label: bibliographic format
toolkit definition: A proportional relationship between a whole sheet and the individual leaves that result if that sheet is left full, cut, or folded in a manifestation.
label: a pour format bibliographique @fr
definition: Met une manifestation en relation avec une relation proportionnelle entre une feuille entière et les feuillets individuels qui sont produits lorsque cette feuille est coupée, pliée ou laissée à sa pleine grandeur dans une manifestation. @fr
toolkit label: format bibliographique @fr
toolkit definition: Relation proportionnelle entre une feuille entière et les feuillets individuels qui sont produits lorsque cette feuille est coupée, pliée ou laissée à sa pleine grandeur dans une manifestation. @fr
toolkit label: formato bibliográfico @es
toolkit definition: Una relación proporcional entre una hoja completa y las hojas individuales que resultan si esa hoja se deja completa, cortada o doblada en una manifestación. @es
label: har bokformat @sv
toolkit label: bokformat @sv
toolkit label: bibliografisch formaat @nl
toolkit definition: Een proportionele relatie tussen een heel vel en de individuele bladen die ontstaan als dat vel heel gelaten wordt, gesneden of gevouwen wordt tot een manifestatie. @nl
label: có định dạng thư mục @vi
definition: Liên kết biểu thị với mối quan hệ cân xứng giữa toàn bộ tờ trong tài nguyên in hoặc bản thảo, và các tờ in riêng lẻ sinh ra nếu tờ đó được để nguyên, cắt, hoặc gấp. @vi
toolkit label: định dạng thư mục @vi
toolkit definition: Mối quan hệ cân xứng giữa toàn bộ tờ trong tài nguyên in hoặc bản thảo, và các tờ in riêng lẻ sinh ra nếu tờ đó được để nguyên, cắt, hoặc gấp. @vi
label: har bogformat @da
definition: Relaterer en manifestation til et proportionalt forhold mellem et helt ark i en trykt ressource eller manuskriptressource, og de enkelte blade der fremkommer, hvis arket efterlades udfyldt, klippet eller foldet. @da
toolkit label: bogformat @da
toolkit definition: Proportionalt forhold mellem et helt ark i en trykt ressource eller manuskriptressource, og de enkelte blade der fremkommer, hvis arket efterlades udfyldt, klippet eller foldet. @da
label: hat bibliografisches Format @de
definition: Setzt eine Manifestation in Beziehung zu einem proportionalen Verhältnis zwischen einem ganzen Bogen und den einzelnen Blättern, die resultieren, wenn der Bogen in einer Manifestation im Ganzen gelassen, geschnitten oder gefaltet wird. @de
toolkit label: Bibliografisches Format @de
toolkit definition: Ein proportionalen Verhältnis zwischen einem ganzen Bogen und den einzelnen Blättern, die resultieren, wenn der Bogen in einer Manifestation im Ganzen gelassen, geschnitten oder gefaltet wird. @de
label: té com a format bibliogràfic @ca
definition: Relaciona una manifestació amb una relació proporcional entre un full sencer i els fulls individuals que resulten si aquest full es deixa complet, tallat o doblegat en una manifestació. @ca
toolkit label: format bibliogràfic @ca
toolkit definition: Relació proporcional entre un full sencer i els fulls individuals que resulten si aquest full es deixa complet, tallat o doblegat en una manifestació. @ca
definition: Liittää manifestaation painetussa tai käsikirjoitusaineistossa kokonaisen arkin ja yksittäisten lehtien väliseen kokosuhteeseen, joka riippuu siitä, onko arkki kokonainen, leikattu tai taitettu. @fi
toolkit label: bibliografinen koko @fi
toolkit definition: Painetussa tai käsikirjoitusaineistossa kokonaisen arkin ja erillisten lehtien välinen kokosuhde, joka riippuu siitä, onko arkki kokonainen, leikattu tai taitettu. @fi
toolkit definition: Et størrelsesforhold mellom et helt ark i en trykt eller håndskrevet ressurs og enkeltbladene som blir resultatet når arket blir brettet eller beskåret eller forblir ubrettet og ubeskåret. @no
label: έχει βιβλιογραφικό μορφότυπο @el
definition: Συνδέει μια εκδήλωση με μια αναλογική σχέση μεταξύ ενός ολόκληρου φύλλου σε έναν έντυπο ή χειρόγραφο πόρο και των μεμονωμένων φύλλων που προκύπτουν αν το συγκεκριμένο φύλλο απομένει πλήρες, κομμένο ή διπλωμένο. @el
toolkit label: βιβλιογραφικό μορφότυπο @el
toolkit definition: Μια αναλογική σχέση μεταξύ ενός ολόκληρου φύλλου σε έναν έντυπο ή χειρόγραφο πόρο και των μεμονωμένων φύλλων που προκύπτουν αν το συγκεκριμένο φύλλο απομένει πλήρες, κομμένο ή διπλωμένο. @el
has element type: 4
label: bibliográfiai formátuma a következő: @hu
definition: Hozzákapcsol egy megjelenési formát egy megjelenési forma teljes lapja és az egyes lapjai közötti aránybeli viszonyhoz, amelyek akkor érvényesek, ha a lapot teljesnek hagyják, elvágják vagy összehajtják. @hu
toolkit label: bibliográfiai formátuma: @hu
toolkit definition: Egy megjelenési forma teljes lapja és az egyes lapjai közötti aránybeli viszony, amelyek akkor érvényesek, ha a lapot teljesnek hagyják, elvágják vagy összehajtják. @hu
label: bibliografinen koko @fi
definition: Relaterer en manifestasjon til et størrelsesforhold mellom et helt ark i en trykt eller håndskrevet ressurs og enkeltbladene som blir resultatet når arket blir brettet eller beskåret eller forblir ubrettet og ubeskåret. @no
label: heeft bibliografisch formaat @nl
definition: Relateert een manifestatie aan een proportionele relatie tussen een heel vel en de individuele bladen die ontstaan als dat vel heel gelaten wordt, gesneden of gevouwen wordt tot een manifestatie. @nl
label: له شكل ببليوجرافي @ar
definition: يربط بين تجسيدة وعلاقة نسبية بين ورقة كاملة في مصدر مطبوع أو مخطوط، والأوراق الفردية التي تنتج إذا تركت الورقة كاملة، أو مقطوعة، أو مطوية. @ar
toolkit label: شكل ببليوجرافي @ar
toolkit definition: علاقة نسبية بين ورقة كاملة في مصدر مطبوع أو مخطوط، والأوراق الفردية التي تنتج إذا تركت الورقة كاملة، أو مقطوعة، أو مطوية. @ar
label: kehastuse formaat @et
definition: Seostab kehastuse trükise või käsikirja jaoks kasutatud tervikpoogna ning üksikute lehtede suuruse suhtega, mis sõltub sellest, kas poogen on lõigatud, murtud või jäetud terveks. @et
alternative label: teaviku formaat @et
toolkit label: kehastuse formaat @et
toolkit definition: Trükise või käsikirja jaoks kasutatud tervikpoogna ning üksikute lehtede suuruse suhe, mis sõltub sellest, kas poogen on lõigatud, murtud või jäetud terveks. @et
label: ha come formato bibliografico @it
definition: Correla una manifestazione a una relazione proporzionale tra un intero foglio in una risorsa a stampa e/o manoscritta e i fogli individuali che vengono prodotti se quel foglio viene lasciato nella sua interezza, tagliato o ripiegato. @it
toolkit label: formato bibliografico @it
toolkit definition: Relazione proporzionale tra un intero foglio in una risorsa a stampa e/o manoscritta e i fogli individuali che vengono prodotti se quel foglio viene lasciato nella sua interezza, tagliato o ripiegato. @it
label: iespiedformāts @lv
definition: Sasaista manifestāciju ar proporcionālo attiecību starp visu iespiesto lapu vai manuskripta resursu, un atsevišķām lapām, kas rodas, ja lapa ir atstāta pilna, sagriezta vai salocīta. @lv
toolkit label: iespiedformāts @lv
toolkit definition: Proporcionālā attiecība starp visu iespiesto lapu vai manuskripta resursu, un atsevišķām lapām, kas rodas, ja lapa ir atstāta pilna, sagriezta vai salocīta. @lv
label: 有书目格式 @zh-hans
definition: 将一种载体表现与一个整张和导致在一种载体表现中是否完整、裁切或折叠的单独页之间的比例关系关联起来。 @zh-hans
toolkit label: 书目格式 @zh-hans
toolkit definition: 导致在一种载体表现中是否完整、裁切或折叠的一个整张和单独页之间的比例关系 @zh-hans
label: bibliyografik format ile ilişkilidir @tr
definition: Bir gösterimi, bir yaprağın tamamı ile bu yaprağın dolu bırakılması, kesilmesi veya katlanması durumunda ortaya çıkan tek tek yapraklar arasındaki orantılı ilişkiyle ilişkilendirir. @tr
toolkit label: bibliyografik format @tr
toolkit definition: Bir gösterimde bir bütün sayfa ile, o sayfa tam bırakıldığında, kesildiğinde veya katlandığında oluşan tek tek yapraklar arasındaki orantılı ilişki. @tr
label: tiene formato bibliográfico @es
definition: Relaciona una manifestación con una relación proporcional entre una hoja completa y las hojas individuales que resultan si esa hoja se deja completa, cortada o doblada en una manifestación. @es
has subproperty: P30197

has details of bibliographic format
status: Published
type: Property
lexical alias: detailsOfBibliographicFormat.en
definition: Relates a manifestation to details of a proportional relationship between a whole sheet in a printed or manuscript resource and the individual leaves that result if that sheet is left full, cut, or folded.
domain: C10007
instruction number: 3.12.1.4
toolkit label: details of bibliographic format
toolkit definition: Details of a proportional relationship between a whole sheet in a printed or manuscript resource and the individual leaves that result if that sheet is left full, cut, or folded.
toolkit label: detalles de formato bibliográfico @es
toolkit definition: Detalles de una relación proporcional entre una hoja completa en un recurso impreso o manuscrito y las hojas individuales que resultan si esa hoja se deja llena, cortada o doblada. @es
label: har detaljerad information om bokformat @sv
toolkit label: detaljerad information om bokformat @sv
toolkit label: details van bibliografisch formaat @nl
toolkit definition: Details van een resultaat van het vouwen van een bedrukt vel om een katern te vormen. @nl
label: có chi tiết của định dạng thư mục @vi
definition: Liên kết biểu thị với chi tiết của mối quan hệ cân xứng giữa toàn bộ tờ trong tài nguyên in hoặc bản thảo, và tờ in riêng rẽ khi để nguyên, cắt, hoặc gấp. @vi
toolkit label: chi tiết của định dạng thư mục @vi
toolkit definition: Chi tiết của mối quan hệ cân xứng giữa toàn bộ tờ trong tài nguyên in hoặc bản thảo, và tờ in riêng rẽ khi để nguyên, cắt, hoặc gấp. @vi
label: har detaljer om bogformat @da
definition: Relaterer en manifestation til detaljer om et proportionalt forhold mellem et helt ark i en trykt ressource eller manuskriptressource, og de enkelte blade der fremkommer, hvis arket efterlades udfyldt, klippet eller foldet. @da
toolkit label: detaljer om bogformat @da
toolkit definition: Detaljer om et proportionalt forhold mellem et helt ark i en trykt ressource eller manuskriptressource, og de enkelte blade der fremkommer, hvis arket efterlades udfyldt, klippet eller foldet. @da
label: hat Details zum bibliografischen Format @de
definition: Setzt eine Manifestation in Beziehung zu den Details zu dem proportionalen Verhältnis zwischen einem ganzen Bogen in einer gedruckten oder handschriftlichen Ressource und den einzelnen Blättern, die resultieren, wenn der Bogen im Ganzen gelassen, geschnitten oder gefaltet wird. @de
toolkit label: Details zum bibliografischen Format @de
toolkit definition: Details zu dem proportionalen Verhältnis zwischen einem ganzen Bogen in einer gedruckten oder handschriftlichen Ressource und den einzelnen Blättern, die resultieren, wenn der Bogen im Ganzen gelassen, geschnitten oder gefaltet wird. @de
label: té com a particularitats de format bibliogràfic @ca
definition: Relaciona una manifestació amb les particularitats d’una relació proporcional entre un full sencer en un recurs imprès o un manuscrit i els fulls individuals que resulten si aquest full es deixa complet, tallat o doblegat. @ca
toolkit label: particularitats de format bibliogràfic @ca
toolkit definition: Particularitats d’una relació proporcional entre un full sencer en un recurs imprès o un manuscrit i els fulls individuals que resulten si aquest full es deixa complet, tallat o doblegat. @ca
definition: Liittää manifestaation tarkempiin tietoihin painetun aineiston tai käsikirjoitusaineiston kokonaisen arkin ja erillisten lehtien välisestä kokosuhteesta, joka riippuu siitä, onko arkki kokonainen, leikattu tai taitettu. @fi
toolkit label: bibliografisen koon tarkemmat tiedot @fi
toolkit definition: Tarkemmat tiedot painetun aineiston tai käsikirjoitusaineiston kokonaisen arkin ja erillisten lehtien välisestä kokosuhteesta, joka riippuu siitä, onko arkki kokonainen, leikattu tai taitettu. @fi
toolkit label: detaljer vedrørende bokformat @no
toolkit definition: Detaljer vedrørende størrelsesforholdet mellom et helt ark i en trykt eller håndskrevet ressurs og enkeltbladene som blir resultatet når arket blir brettet eller beskåret eller forblir ubrettet og ubeskåret. @no
label: έχει λεπτομέρειες του βιβλιογραφικού μορφότυπου @el
definition: Συνδέει μια εκδήλωση με τις λεπτομέρειες μιας αναλογικής σχέσης μεταξύ ενός ολόκληρου φύλλου σε έναν έντυπο ή χειρόγραφο πόρο και των μεμονωμένων φύλλων που προκύπτουν αν το συγκεκριμένο φύλλο έχει απομείνει πλήρες, κομμένο ή διπλωμένο. @el
toolkit label: λεπτομέρειες του βιβλιογραφικού μορφότυπου @el
toolkit definition: Λεπτομέρειες μιας αναλογικής σχέσης μεταξύ ενός ολόκληρου φύλλου σε έναν έντυπο ή χειρόγραφο πόρο και των μεμονωμένων φύλλων που προκύπτουν αν το συγκεκριμένο φύλλο απομένει πλήρες, κομμένο ή διπλωμένο. @el
label: a pour particularités d’un format bibliographique @fr
definition: Met une manifestation en relation avec des particularités d’une relation proportionnelle entre une feuille entière dans une ressource imprimée ou manuscrite et les feuillets individuels qui sont produits lorsque cette feuille est coupée, pliée ou laissée à sa pleine grandeur. @fr
toolkit label: particularités d’un format bibliographique @fr
toolkit definition: Particularités d’une relation proportionnelle entre une feuille entière dans une ressource imprimée ou manuscrite et les feuillets individuels qui sont produits lorsque cette feuille est coupée, pliée ou laissée à sa pleine grandeur. @fr
has element type: 6
label: bibliográfiai formátum részletei a következők: @hu
definition: Hozzákapcsol egy megjelenési formát egy aránybeli viszonyhoz, amely egy nyomtatott vagy kézírásos forrás teljes lapja és az egyes lapok között áll fent, amelyek akkkor keletkeznek, ha a lapot hagyják megtelni, elvágják vagy összehajtják. @hu
toolkit label: bibliográfiai formátum részletei: @hu
toolkit definition: Egy aránybeli viszony, amely egy nyomtatott vagy kézírásos forrás teljes lapja és az egyes lapok között áll fent, amelyek akkkor keletkeznek, ha a lapot hagyják megtelni, elvágják vagy összehajtják. @hu
label: bibliografisen koon tarkemmat tiedot @fi
label: har detaljer vedrørende bokformat @no
definition: Relaterer en manifestasjon til detaljer vedrørende størrelsesforholdet mellom et helt ark i en trykt eller håndskrevet ressurs og enkeltbladene som blir resultatet når arket blir brettet eller beskåret eller forblir ubrettet og ubeskåret. @no
label: heeft details van bibliografisch formaat @nl
definition: Relateert een manifestatie aan details van een resultaat van het vouwen van een bedrukt vel om een katern te vormen. @nl
label: له تفاصيل شكل ببليوجرافي @ar
definition: يربط بين تجسيدة وتفاصيل علاقة نسبية بين ورقة كاملة في مصدر مطبوع أو مخطوط والأوراق الفردية التي تنتج إذا تركت الورقة كاملة، أو مقطوعة، أو مطوية. @ar
toolkit label: تفاصيل شكل ببليوجرافي @ar
toolkit definition: تفاصيل علاقة نسبية بين ورقة كاملة في مصدر مطبوع أو مخطوط والأوراق الفردية التي تنتج إذا تركت الورقة كاملة، أو مقطوعة، أو مطوية. @ar
label: kehastuse formaadi täpsustus @et
definition: Seostab kehastuse täpsemate andmetega trükise või käsikirja jaoks kasutatud tervikpoogna ning üksikute lehtede suuruse suhte kohta, mis sõltub sellest, kas poogen on lõigatud, murtud või jäetud terveks. @et
alternative label: teaviku formaadi täpsustus @et
toolkit label: kehastuse formaadi täpsustus @et
toolkit definition: Täpsemad andmed trükise või käsikirja jaoks kasutatud tervikpoogna ning üksikute lehtede suuruse suhte kohta, mis sõltub sellest, kas poogen on lõigatud, murtud või jäetud terveks. @et
label: ha come particolari relativi al formato bibliografico @it
definition: Correla una manifestazione ai particolari relativi a una relazione proporzionale tra un intero foglio in una risorsa a stampa e/o manoscritta e i fogli individuali che vengono prodotti sequel foglio viene lasciato nella sua interezza, tagliato o ripiegato. @it
toolkit label: particolari relativi al formato bibliografico @it
toolkit definition: Particolari relativi a una relazione proporzionale tra un intero foglio in una risorsa a stampa e/o manoscritta e i fogli individuali che vengono prodotti se il foglio viene lasciato nella sua interezza, tagliato o ripiegato. @it
label: detalizēti par iespiedformātu @lv
definition: Sasaista manifestāciju ar sīkāku informāciju par proporcionālām attiecībām starp drukāto vai manuskripta resursu pilno lapu un atsevišķām lapām, kas rodas, ja šī lapa ir atstāta neskarta, ir sagriezta vai salocīta. @lv
toolkit label: detalizēti par iespiedformātu @lv
toolkit definition: Sīkāka informācija par proporcionālām attiecībām starp drukāto vai manuskripta resursu pilno lapu un atsevišķām lapām, kas rodas, ja šī lapa ir atstāta neskarta, ir sagriezta vai salocīta. @lv
label: 有书目格式细节 @zh-hans
definition: 将一种载体表现与导致在一种印刷或手稿资源中是否完整、裁切或折叠的一个整张和单独页之间的比例关系的细节关联起来。 @zh-hans
toolkit label: 书目格式细节 @zh-hans
toolkit definition: 导致在一种印刷或手稿资源中是否完整、裁切或折叠的一个整张和单独页之间的比例关系的细节 @zh-hans
label: bibliyografik formatın ayrıntıları ile ilişkilidir @tr
definition: Bir gösterimi, basılı veya el yazması bir kaynaktaki tüm bir sayfa ile bu sayfanın dolu bırakılması, kesilmesi veya katlanması durumunda ortaya çıkan tek tek yapraklar arasındaki orantılı ilişkinin ayrıntılaryla ilişkilendirir. @tr
toolkit label: bibliyografik formatın ayrıntıları @tr
toolkit definition: Basılı veya el yazması bir kaynaktaki tam bir sayfa ile bu sayfanın olduğu gibi bırakılması, kesilmesi veya katlanması sonucu oluşan tek yapraklar arasındaki oransal ilişkinin ayrıntıları. @tr
label: tiene detalles de formato bibliográfico @es

has binding of manifestation
status: Published
lexical alias: bindingOfManifestation.en
definition: Relates a manifestation to a work that is a binding of a manifestation.
toolkit label: binding of manifestation
toolkit definition: A work that is a binding of a manifestation.
type: Property
domain: C10007
sub property of: has related work of manifestation
has element type: 2
label: manifestaation sidos @fi
definition: Liittää manifestaation teokseen, joka on manifestaation sidos. @fi
toolkit label: manifestaation sidos @fi
toolkit definition: Teos, joka on manifestaation sidos. @fi
label: har innbinding for manifestasjon @no
definition: Relaterer en manifestasjon til et verk som er en innbinding av en manifestasjon. @no
toolkit label: innbinding for manifestasjon @no
toolkit definition: Et verk som er en innbinding av en manifestasjon. @no
label: a pour reliure d’une manifestation @fr
definition: Met une manifestation en relation avec une œuvre qui consiste en une reliure d’une manifestation. @fr
toolkit label: reliure d’une manifestation @fr
toolkit definition: Œuvre qui consiste en une reliure d’une manifestation. @fr
label: heeft bindwijze van manifestatie @nl
definition: Relateert een manifestatie aan een werk dat een band is van een manifestatie. @nl
toolkit label: band van manifestatie @nl
toolkit definition: Een werk dat een band is van een manifestatie. @nl
label: له تجليد لتجسيدة @ar
definition: يربط بين تجسيدة وعمل يعد تجليدًا لتجسيدة. @ar
toolkit label: تجليد لتجسيدة @ar
toolkit definition: عمل يعد تجليدًا لتجسيدة. @ar
label: té com a enquadernació d’una manifestació @ca
definition: Relaciona una manifestació amb una obra que és una enquadernació d’una manifestació. @ca
toolkit label: enquadernació d’una manifestació @ca
toolkit definition: Obra que és una enquadernació d’una manifestació. @ca
label: har indbinding af manifestation @da
definition: Relaterer en manifestation til et værk, som er en indbinding af en manifestation. @da
toolkit label: indbinding af manifestation @da
toolkit definition: Værk, som er en indbinding af en manifestation. @da
label: kehastuse köide @et
definition: Seostab kehastuse teosega, mis on kehastuse köide. @et
toolkit label: kehastuse köide @et
toolkit definition: Teos, mis on kehastuse köide. @et
label: hat Einband einer Manifestation @de
definition: Setzt eine Manifestation in Beziehung zu einem Werk, bei dem es sich um den Einband einer Manifestation handelt. @de
toolkit label: Einband einer Manifestation @de
toolkit definition: Ein Werk, bei dem es sich um den Einband einer Manifestation handelt. @de
label: megjelenési forma alkotórésze a következő: @hu
definition: Hozzákapcsol egy megjelenési formát egy műhöz, amely egy megjelenési forma kötése. @hu
toolkit label: megjelenési forma alkotóeleme @hu
toolkit definition: Egy mű, amely egy megjelenési forma kötése. @hu
label: ha come legatura di manifestazione @it
definition: Correla una manifestazione a un'opera che è una legatura di una manifestazione. @it
toolkit label: legatura di manifestazione @it
toolkit definition: Opera che consiste di una legatura di una manifestazione. @it
label: manifestācijas iesējums @lv
definition: Sasaista manifestāciju ar darbu, kas ir manifestācijas iesējums. @lv
toolkit label: manifestācijas iesējums @lv
toolkit definition: Darbs, kas ir manifestācijas iesējums. @lv
label: 有载体表现的装订 @zh-hans
definition: 将一种载体表现与作为一种载体表现之装订的一种作品关联起来。 @zh-hans
toolkit label: 载体表现的装订 @zh-hans
toolkit definition: 作为一种载体表现之装订的一种作品 @zh-hans
label: gösterimin ciltlenmesi ile ilişkilidir @tr
definition: Bir gösterimi, bir gösterimin bağlayıcısı olan bir eserle ilişkilendirir. @tr
toolkit label: gösterimin ciltlenmesi @tr
toolkit definition: Bir gösterimin bağlantısı olan bir eser. @tr
label: tiene vinculación de manifestación @es
definition: Relaciona una manifestación con una obra que es vinculante de una manifestación. @es
toolkit label: vinculación de manifestación @es
toolkit definition: Una obra que es vinculante de una manifestación. @es
has subproperty: P30310

has book designer agent
status: Published
definition: Relates a manifestation to an agent who is responsible for creating a manifestation by being responsible for the entire graphic design of a book, including arrangement of type and illustration, choice of materials, and process used.
type: Property
domain: C10007
lexical alias: bookDesignerAgent.en
toolkit label: book designer agent
toolkit definition: An agent who is responsible for creating a manifestation by being responsible for the entire graphic design of a book, including arrangement of type and illustration, choice of materials, and process used.
label: a pour agent maquettiste de livre @fr
definition: Met une manifestation en relation avec un agent qui est responsable de la création d’une manifestation en étant responsable de toute la conception graphique d’un livre, y compris la composition typographique, l’arrangement des illustrations, le choix des matériaux et le procédé utilisé. @fr
toolkit label: agent maquettiste de livre @fr
toolkit definition: Agent qui est responsable de la création d’une manifestation en étant responsable de toute la conception graphique d’un livre, y compris la composition typographique, l’arrangement des illustrations, le choix des matériaux et le procédé utilisé. @fr
toolkit label: agente diseñador de libros @es
toolkit definition: Un agente que es responsable de crear una manifestación al ser responsable de todo el diseño gráfico de un libro, incluida la disposición del tipo y la ilustración, la elección de los materiales y el proceso utilizado. @es
instruction number: 18.5
toolkit label: boekontwerper-actor @nl
toolkit definition: Een actor die verantwoordelijk is voor het creëren van een manifestatie door verantwoordelijk te zijn voor het gehele grafische ontwerp van een boek, inclusief de indeling van het zetsel en illustratie, keuze van materialen en gebruikt procedé. @nl
label: có người thiết kế sách @vi
definition: Liên kết biểu thị với tác nhân có liên quan tới chế tạo biểu thị theo trách nhiệm thiết kế đồ hoạ tổng thể của sách, bao gồm cả sắp xếp chữ in và minh hoạ, lựa chọn vật liệu, và quy trình sử dụng. @vi
toolkit label: người thiết kế sách @vi
toolkit definition: Tác nhân có liên quan tới chế tạo biểu thị theo trách nhiệm thiết kế đồ hoạ tổng thể của sách, bao gồm cả sắp xếp chữ in và minh hoạ, lựa chọn vật liệu, và quy trình sử dụng. @vi
label: har agent, som er bogdesigner @da
definition: Relaterer en manifestation til en agent, som er involveret i fremstillingen af en manifestation ved at være ansvarlig for hele det grafiske design af en bog, inkl. opsætning af tekst og illustrationer, materialevalg og anvendt proces. @da
toolkit label: agent, som er bogdesigner @da
toolkit definition: Agent, som er involveret i fremstillingen af en manifestation ved at være ansvarlig for hele det grafiske design af en bog, inkl. opsætning af tekst og illustrationer, materialevalg og anvendt proces. @da
label: hat Buchgestalterin/Buchgestalter (Akteur) @de
definition: Setzt eine Manifestation in Beziehung zu einem Akteur, der für die Herstellung einer Manifestation verantwortlich ist, indem er für das gesamte grafische Design eines Buchs, einschließlich Schriftbild, Bildgestaltung, Materialwahl und angewandter Verfahren, verantwortlich ist. @de
toolkit label: Buchgestalterin/Buchgestalter (Akteur) @de
toolkit definition: Ein Akteur, der für die Herstellung einer Manifestation verantwortlich ist, indem er für das gesamte grafische Design eines Buchs, einschließlich Schriftbild, Bildgestaltung, Materialwahl und angewandter Verfahren, verantwortlich ist. @de
label: té com a agent dissenyador gràfic @ca
definition: Relaciona una manifestació amb un agent que és responsable de la creació d’una manifestació amb la responsabilitat de tot el disseny gràfic d’un llibre, inclosa la composició tipogràfica i la il·lustració, la tria dels materials i el procés usat. @ca
toolkit label: agent dissenyador gràfic @ca
toolkit definition: Agent que és responsable de la creació d’una manifestació amb la responsabilitat de tot el disseny gràfic d’un llibre, inclosa la composició tipogràfica i la il·lustració, la tria dels materials i el procés usat. @ca
definition: Liittää manifestaation toimijaan, joka on vastuussa manifestaation valmistamisesta vastaamalla kirjan graafisesta suunnittelusta, taitosta, materiaalien valinnasta ja käytettävistä valmistusmenetelmistä. @fi
toolkit label: graafinen suunnittelija (toimija) @fi
toolkit definition: Toimija, joka on vastuussa manifestaation valmistamisesta vastaamalla kirjan graafisesta suunnittelusta, taitosta, materiaalien valinnasta ja käytettävistä valmistusmenetelmistä. @fi
toolkit label: bokdesigner (agent) @no
toolkit definition: En agent som er involvert i framstillingen av en manifestasjon ved å ha ansvar for hele den grafiske utformingen av en bok, inkludert oppsett av skrifttype og illustrasjoner, valg av materialer og hvilke prosesser som brukes. @no
label: έχει σχεδιαστή βιβλίου @el
definition: Συνδέει μια εκδήλωση με έναν φορέα που εμπλέκεται στην κατασκευή μιας εκδήλωσης μέσω της ευθύνης για το σύνολο του γραφικού σχεδιασμού ενός βιβλίου, περιλαμβανομένης της οργάνωσης των τυπογραφικών στοιχείων και της εικονογράφησης, της επιλογής του υλικού και της χρησιμοποιούμενης επεξεργασίας. @el
toolkit label: σχεδιαστής βιβλίου @el
toolkit definition: Ένας φορέας που εμπλέκεται στην κατασκευή μιας εκδήλωσης μέσω της ευθύνης για το σύνολο του γραφικού σχεδιασμού ενός βιβλίου, περιλαμβανομένης της οργάνωσης των τυπογραφικών στοιχείων και της εικονογράφησης, της επιλογής του υλικού και της χρησιμοποιούμενης επεξεργασίας. @el
has element type: 2
label: könyvtervező ágense a következő: @hu
definition: Hozzákapcsol egy megjelenési formát egy ágenshez, amely felelős egy megjelenési forma gyártásáért oly módon, hogy felelős egy könyv teljes grafikai tervezéséért, beleértve a nyomdai betűtípus és az illusztrációk elrendezését, az anyagválasztást és az alkalmazott eljárást. @hu
toolkit label: könyvtervező ágens: @hu
toolkit definition: Egy ágens, amely felelős egy megjelenési forma gyártásáért oly módon, hogy felelős egy könyv teljes grafikai tervezéséért, beleértve a nyomdai betűtípus és az illusztrációk elrendezését, az anyagválasztást és az alkalmazott eljárást. @hu
alternative label: book designer
alternative label: graafinen suunnittelija @fi
label: graafinen suunnittelija (toimija) @fi
label: har bokdesigner (agent) @no
definition: Relaterer en manifestasjon til en agent som er involvert i framstillingen av en manifestasjon ved å ha ansvar for hele den grafiske utformingen av en bok, inkludert oppsett av skrifttype og illustrasjoner, valg av materialer og hvilke prosesser som brukes. @no
alternative label: bokdesigner @no
alternative label: maquettiste de livre @fr
label: heeft boekontwerper-actor @nl
definition: Relateert een manifestatie aan een actor die verantwoordelijk is voor het creëren van een manifestatie door verantwoordelijk te zijn voor het gehele grafische ontwerp van een boek, inclusief de indeling van het zetsel en illustratie, keuze van materialen en gebruikt procedé. @nl
label: له وكيل مصمم كتاب @ar
definition: يربط بين تجسيدة ووكيل مسئول عن تصنيع تجسيدة بالتصميم الجرافيكي الكامل لكتاب، بما في ذلك توضيب حروف الطباعة، والإيضاحيات، واختيار المواد، والعمليات المستخدمة. @ar
alternative label: مصمم كتاب @ar
toolkit label: وكيل مصمم كتاب @ar
toolkit definition: وكيل مسئول عن تصنيع تجسيدة بالتصميم الجرافيكي الكامل لكتاب، بما في ذلك توضيب حروف الطباعة، والإيضاحيات، واختيار المواد، والعمليات المستخدمة. @ar
alternative label: dissenyador gràfic @ca
alternative label: bogdesigner @da
label: raamatukujundaja (tegija) @et
definition: Seostab kehastuse tegijaga, kes osaleb kehastuse valmistamises, vastutades raamatu graafilise kujunduse eest, sealhulgas trükiteksti ja illustratsioonide paigutuse, materjalide valiku ja valmistamismenetluste eest. @et
alternative label: raamatukujundaja @et
toolkit label: raamatukujundaja (tegija) @et
toolkit definition: Tegija, kes osaleb kehastuse valmistamises, vastutades raamatu graafilise kujunduse eest, sealhulgas trükiteksti ja illustratsioonide paigutuse, materjalide valiku ja valmistamismenetluste eest. @et
alternative label: könyvtervező: @hu
label: ha come grafico agent @it
definition: Correla una manifestazione all'agente coinvolto nella manifattura di una manifestazione, come responsabile dell'intero progetto grafico di un libro, compresi la disposizione dei caratteri tipografici e delle illustrazioni, la scelta dei materiali e il procedimento utilizzato. @it
alternative label: grafico @it
toolkit label: grafico agente @it
toolkit definition: Agente coinvolto nella manifattura di una manifestazione, come responsabile dell'intero progetto grafico di un libro, compresi la disposizione dei caratteri tipografici e delle illustrazioni, la scelta dei materiali e il procedimento utilizzato. @it
label: grāmatas dizaina autors (aģents) @lv
definition: Sasaista manifestāciju ar aģentu, kas iesaistīts manifestācijas ražošanā, atbildot par grāmatas grafisko dizainu, tajā skaitā par izkārtojuma veidu un ilustrācijām, materiālu izvēli un tehnoloģisko procesu. @lv
toolkit label: grāmatas dizaina autors (aģents) @lv
toolkit definition: Aģents, kas iesaistīts manifestācijas ražošanā, atbildot par grāmatas grafisko dizainu, tajā skaitā par izkārtojuma veidu un ilustrācijām, materiālu izvēli un tehnoloģisko procesu. @lv
sub property of: has creator agent of manifestation
alternative label: Buchgestalter @de
toolkit label: 图书设计者行为者 @zh-hans

has book designer collective agent
status: Published
lexical alias: bookDesignerCollectiveAgent.en
definition: Relates a manifestation to a collective agent who is responsible for creating a manifestation by being responsible for the entire graphic design of a book, including arrangement of type and illustration, choice of materials, and process used.
toolkit label: book designer collective agent
toolkit definition: A collective agent who is responsible for creating a manifestation by being responsible for the entire graphic design of a book, including arrangement of type and illustration, choice of materials, and process used.
type: Property
domain: C10007
has element type: 2
sub property of: has book designer agent
label: graafinen suunnittelija (yhteistoimija) @fi
definition: Liittää manifestaation yhteistoimijaan, joka on vastuussa manifestaation valmistamisesta vastaamalla kirjan graafisesta suunnittelusta, taitosta, materiaalien valinnasta ja käytettävistä valmistusmenetelmistä. @fi
toolkit label: graafinen suunnittelija (yhteistoimija) @fi
toolkit definition: Yhteistoimija, joka on vastuussa manifestaation valmistamisesta vastaamalla kirjan graafisesta suunnittelusta, taitosta, materiaalien valinnasta ja käytettävistä valmistusmenetelmistä. @fi
label: har bokdesigner (kollektiv agent) @no
definition: Relaterer en manifestasjon til en kollektiv agent som er involvert i framstillingen av en manifestasjon ved å ha ansvar for hele den grafiske utformingen av en bok, inkludert oppsett av skrifttype og illustrasjoner, valg av materialer og hvilke prosesser som brukes. @no
toolkit label: bokdesigner (kollektiv agent) @no
toolkit definition: En kollektiv agent som er involvert i framstillingen av en manifestasjon ved å ha ansvar for hele den grafiske utformingen av en bok, inkludert oppsett av skrifttype og illustrasjoner, valg av materialer og hvilke prosesser som brukes. @no
label: a pour agent collectif maquettiste de livre @fr
definition: Met une manifestation en relation avec un agent collectif qui est responsable de la création d’une manifestation en étant responsable de toute la conception graphique d’un livre, y compris la composition typographique, l’arrangement des illustrations, le choix des matériaux et le procédé utilisé. @fr
toolkit label: agent collectif maquettiste de livre @fr
toolkit definition: Agent collectif qui est responsable de la création d’une manifestation en étant responsable de toute la conception graphique d’un livre, y compris la composition typographique, l’arrangement des illustrations, le choix des matériaux et le procédé utilisé. @fr
label: heeft boekontwerper-collectieve actor @nl
definition: Relateert een manifestatie aan een collectieve actor die verantwoordelijk is voor het creëren van een manifestatie door verantwoordelijk te zijn voor het gehele grafische ontwerp van een boek, inclusief de indeling van het zetsel en illustratie, keuze van materialen en gebruikt procedé. @nl
toolkit label: boekontwerper-collectieve actor @nl
toolkit definition: Een collectieve actor die verantwoordelijk is voor het creëren van een manifestatie door verantwoordelijk te zijn voor het gehele grafische ontwerp van een boek, inclusief de indeling van het zetsel en illustratie, keuze van materialen en gebruikt procedé. @nl
label: له وكيل جماعي مصمم كتاب @ar
definition: يربط بين تجسيدة ووكيل جماعي مسئول عن تصنيع تجسيدة بالتصميم الجرافيكي الكامل لكتاب، بما في ذلك توضيب حروف الطباعة، والإيضاحيات، واختيار المواد، والعمليات المستخدمة. @ar
toolkit label: وكيل جماعي مصمم كتاب @ar
toolkit definition: وكيل جماعي مسئول عن تصنيع تجسيدة بالتصميم الجرافيكي الكامل لكتاب، بما في ذلك توضيب حروف الطباعة، والإيضاحيات، واختيار المواد، والعمليات المستخدمة. @ar
label: té com a agent col·lectiu dissenyador gràfic @ca
definition: Relaciona una manifestació amb un agent col·lectiu que és responsable de la creació d’una manifestació amb la responsabilitat de tot el disseny gràfic d’un llibre, inclosa la composició tipogràfica i la il·lustració, la tria dels materials i el procés utilitzat. @ca
toolkit label: agent col·lectiu dissenyador gràfic @ca
toolkit definition: Agent col·lectiu que és responsable de la creació d’una manifestació amb la responsabilitat de tot el disseny gràfic d’un llibre, inclosa la composició tipogràfica i la il·lustració, la tria dels materials i el procés utilitzat. @ca
label: har kollektiv agent, som er bogdesigner @da
definition: Relaterer en manifestation til en kollektiv agent, som er involveret i fremstillingen af en manifestation ved at være ansvarlig for hele det grafiske design af en bog, inkl. opsætning af tekst og illustrationer, materialevalg og anvendt proces. @da
toolkit label: kollektiv agent, som er bogdesigner @da
toolkit definition: Kollektiv agent, som er involveret i fremstillingen af en manifestation ved at være ansvarlig for hele det grafiske design af en bog, inkl. opsætning af tekst og illustrationer, materialevalg og anvendt proces. @da
label: raamatukujundaja (kollektiiv) @et
definition: Seostab kehastuse kollektiiviga, kes osaleb kehastuse valmistamises, vastutades raamatu graafilise kujunduse eest, sealhulgas trükiteksti ja illustratsioonide paigutuse, materjalide valiku ja valmistamismenetluste eest. @et
toolkit label: raamatukujundaja (kollektiiv) @et
toolkit definition: Kollektiiv, kes osaleb kehastuse valmistamises, vastutades raamatu graafilise kujunduse eest, sealhulgas trükiteksti ja illustratsioonide paigutuse, materjalide valiku ja valmistamismenetluste eest. @et
label: hat Buchgestalterin/Buchgestalter (Gemeinschaftlicher Akteur) @de
definition: Setzt eine Manifestation in Beziehung zu einem gemeinschaftlichen Akteur, der für die Herstellung einer Manifestation verantwortlich ist, indem er für das gesamte grafische Design eines Buchs, einschließlich Schriftbild, Bildgestaltung, Materialwahl und angewandter Verfahren, verantwortlich ist. @de
toolkit label: Buchgestalterin/Buchgestalter (Gemeinschaftlicher Akteur) @de
toolkit definition: Ein gemeinschaftlicher Akteur, der für die Herstellung einer Manifestation verantwortlich ist, indem er für das gesamte grafische Design eines Buchs, einschließlich Schriftbild, Bildgestaltung, Materialwahl und angewandter Verfahren, verantwortlich ist. @de
label: könyvtervező kollektív ágense a következő: @hu
definition: Hozzákapcsol egy megjelenési formát egy kollektív ágenshez, amely felelős egy megjelenési forma gyártásáért oly módon, hogy felelős egy könyv teljes grafikai tervezéséért, beleértve a nyomdai betűtípus és az illusztrációk elrendezését, az anyagválasztást és az alkalmazott eljárást. @hu
toolkit label: könyvtervező kollektív ágens: @hu
toolkit definition: Egy kollektív ágens, amely felelős egy megjelenési forma gyártásáért oly módon, hogy felelős egy könyv teljes grafikai tervezéséért, beleértve a nyomdai betűtípus és az illusztrációk elrendezését, az anyagválasztást és az alkalmazott eljárást. @hu
label: ha come grafico agente collettivo @it
definition: Correla una manifestazione all'agente collettivo coinvolto nella manifattura di una manifestazione, come responsabile dell'intero progetto grafico di un libro, compresi la disposizione dei caratteri tipografici e delle illustrazioni, la scelta dei materiali e il procedimento utilizzato. @it
toolkit label: grafico agente collettivo @it
toolkit definition: Agente collettivo coinvolto nella manifattura di una manifestazione, come responsabile dell'intero progetto grafico di un libro, compresi la disposizione dei caratteri tipografici e delle illustrazioni, la scelta dei materiali e il procedimento utilizzato. @it
label: grāmatas dizaina autors (grupa) @lv
definition: Sasaista manifestāciju ar grupu, kas iesaistīta manifestācijas ražošanā, atbildot par grāmatas grafisko dizainu, tajā skaitā par izkārtojuma veidu un ilustrācijām, materiālu izvēli un tehnoloģisko procesu. @lv
toolkit label: grāmatas dizaina autors (grupa) @lv
toolkit definition: Grupa, kas iesaistīta manifestācijas ražošanā, atbildot par grāmatas grafisko dizainu, tajā skaitā par izkārtojuma veidu un ilustrācijām, materiālu izvēli un tehnoloģisko procesu. @lv
sub property of: has creator collective agent of manifestation
label: 有图书设计者集体行为者 @zh-hans
definition: 将一种载体表现与通过负责图书的整体图形设计（包括字体和插图的编排、材料的选取和工艺流程的使用等）对载体表现创建负责的一个集体行为者关联起来。 @zh-hans
toolkit label: 图书设计者集体行为者 @zh-hans
toolkit definition: 通过负责图书的整体图形设计（包括字体和插图的编排、材料的选取和工艺流程的使用等）对载体表现创建负责的一个集体行为者 @zh-hans
label: kitap tasarımcısı kolektif temsilci ile ilişkilidir @tr
definition: Bir gösterimi, tür ve çizim düzenlemesi, malzeme seçimi ve kullanılan süreç dahil olmak üzere bir kitabın tüm grafik tasarımından sorumlu olarak bir gösterim yaratmaktan sorumlu olan kolektif bir temsilciyle ilişkilendirir. @tr
toolkit label: kitap tasarımcısı kolektif temsilcisi @tr
toolkit definition: Tür ve çizim düzenlemesi, malzeme seçimi ve kullanılan süreç dahil olmak üzere bir kitabın tüm grafik tasarımından sorumlu olarak bir gösterim yaratmaktan sorumlu olan kolektif bir temsilci. @tr
label: tiene agente colectivo diseñador de libros @es
definition: Relaciona una manifestación con un agente colectivo que es responsable de crear una manifestación al ser responsable de todo el diseño gráfico de un libro, incluida la disposición del tipo y la ilustración, la elección de los materiales y el proceso utilizado. @es
toolkit label: agente colectivo diseñador de libros @es
toolkit definition: Un agente colectivo que es responsable de crear una manifestación al ser responsable de todo el diseño gráfico de un libro, incluida la disposición del tipo y la ilustración, la elección de los materiales y el proceso utilizado. @es
has subproperty: has book designer corporate body
has subproperty: has book designer family
has subproperty: P30378

has book designer corporate body
status: Published
lexical alias: bookDesignerCorporateBody.en
definition: Relates a manifestation to a corporate body who is responsible for creating a manifestation by being responsible for the entire graphic design of a book, including arrangement of type and illustration, choice of materials, and process used.
toolkit label: book designer corporate body
toolkit definition: A corporate body who is responsible for creating a manifestation by being responsible for the entire graphic design of a book, including arrangement of type and illustration, choice of materials, and process used.
type: Property
domain: C10007
has element type: 2
sub property of: has book designer collective agent
label: graafinen suunnittelija (yhteisö) @fi
definition: Liittää manifestaation yhteisöön, joka on vastuussa manifestaation valmistamisesta vastaamalla kirjan graafisesta suunnittelusta, taitosta, materiaalien valinnasta ja käytettävistä valmistusmenetelmistä. @fi
toolkit label: graafinen suunnittelija (yhteisö) @fi
toolkit definition: Yhteisö, joka on vastuussa manifestaation valmistamisesta vastaamalla kirjan graafisesta suunnittelusta, taitosta, materiaalien valinnasta ja käytettävistä valmistusmenetelmistä. @fi
label: har bokdesigner (korporasjon) @no
definition: Relaterer en manifestasjon til en korporasjon som er involvert i framstillingen av en manifestasjon ved å ha ansvar for hele den grafiske utformingen av en bok, inkludert oppsett av skrifttype og illustrasjoner, valg av materialer og hvilke prosesser som brukes. @no
toolkit label: bokdesigner (korporasjon) @no
toolkit definition: En korporasjon som er involvert i framstillingen av en manifestasjon ved å ha ansvar for hele den grafiske utformingen av en bok, inkludert oppsett av skrifttype og illustrasjoner, valg av materialer og hvilke prosesser som brukes. @no
label: a pour collectivité maquettiste de livre @fr
definition: Met une manifestation en relation avec une collectivité qui est responsable de la création d’une manifestation en étant responsable de toute la conception graphique d’un livre, y compris la composition typographique, l’arrangement des illustrations, le choix des matériaux et le procédé utilisé. @fr
toolkit label: collectivité maquettiste de livre @fr
toolkit definition: Collectivité qui est responsable de la création d’une manifestation en étant responsable de toute la conception graphique d’un livre, y compris la composition typographique, l’arrangement des illustrations, le choix des matériaux et le procédé utilisé. @fr
label: heeft boekontwerper-corporatie @nl
definition: Relateert een manifestatie aan een corporatie die verantwoordelijk is voor het creëren van een manifestatie door verantwoordelijk te zijn voor het gehele grafische ontwerp van een boek, inclusief de indeling van het zetsel en illustratie, keuze van materialen en gebruikt procedé. @nl
toolkit label: boekontwerper-corporatie @nl
toolkit definition: Een corporatie die verantwoordelijk is voor het creëren van een manifestatie door verantwoordelijk te zijn voor het gehele grafische ontwerp van een boek, inclusief de indeling van het zetsel en illustratie, keuze van materialen en gebruikt procedé. @nl
label: له هيئة مصممة كتاب @ar
definition: يربط بين تجسيدة وهيئة مسئولة عن تصنيع تجسيدة بالتصميم الجرافيكي الكامل لكتاب، بما في ذلك توضيب حروف الطباعة، والإيضاحيات، واختيار المواد، والعمليات المستخدمة. @ar
toolkit label: هيئة مصممة كتاب @ar
toolkit definition: هيئة مسئولة عن تصنيع تجسيدة بالتصميم الجرافيكي الكامل لكتاب، بما في ذلك توضيب حروف الطباعة، والإيضاحيات، واختيار المواد، والعمليات المستخدمة. @ar
label: té com a entitat corporativa dissenyadora gràfica @ca
definition: Relaciona una manifestació amb una entitat corporativa que és responsable de la creaació d’una manifestació amb la responsabilitat de tot el disseny gràfic d’un llibre, inclosa la composició tipogràfica i la il·lustració, la tria dels materials i el procés utilitzat. @ca
toolkit label: entitat corporativa dissenyadora gràfica @ca
toolkit definition: Entitat corporativa que és responsable de la creació d’una manifestació amb la responsabilitat de tot el disseny gràfic d’un llibre, inclosa la composició tipogràfica i la il·lustració, la tria dels materials i el procés utilitzat. @ca
label: har korporation, som er bogdesigner @da
definition: Relaterer en manifestation til en korporation, som er involveret i fremstillingen af en manifestation ved at være ansvarlig for hele det grafiske design af en bog, inkl. opsætning af tekst og illustrationer, materialevalg og anvendt proces. @da
toolkit label: korporation, som er bogdesigner @da
toolkit definition: Korporation, som er involveret i fremstillingen af en manifestation ved at være ansvarlig for hele det grafiske design af en bog, inkl. opsætning af tekst og illustrationer, materialevalg og anvendt proces. @da
label: raamatukujundaja (asutus) @et
definition: Seostab kehastuse asutusega, kes osaleb kehastuse valmistamises, vastutades raamatu graafilise kujunduse eest, sealhulgas trükiteksti ja illustratsioonide paigutuse, materjalide valiku ja valmistamismenetluste eest. @et
toolkit label: raamatukujundaja (asutus) @et
toolkit definition: Asutus, kes osaleb kehastuse valmistamises, vastutades raamatu graafilise kujunduse eest, sealhulgas trükiteksti ja illustratsioonide paigutuse, materjalide valiku ja valmistamismenetluste eest. @et
label: hat Buchgestalterin/Buchgestalter (Körperschaft) @de
definition: Setzt eine Manifestation in Beziehung zu einer Körperschaft, die für die Herstellung einer Manifestation verantwortlich ist, indem sie für das gesamte grafische Design eines Buchs, einschließlich Schriftbild, Bildgestaltung, Materialwahl und angewandter Verfahren, verantwortlich ist. @de
toolkit label: Buchgestalterin/Buchgestalter (Körperschaft) @de
toolkit definition: Eine Körperschaft, die für die Herstellung einer Manifestation verantwortlich ist, indem sie für das gesamte grafische Design eines Buchs, einschließlich Schriftbild, Bildgestaltung, Materialwahl und angewandter Verfahren, verantwortlich ist. @de
label: könyvtervező testülete a következő: @hu
definition: Hozzákapcsol egy megjelenési formát egy testülethez, amely felelős egy megjelenési forma gyártásáért oly módon, hogy felelős egy könyv teljes grafikai tervezéséért, beleértve a nyomdai betűtípus és az illusztrációk elrendezését, az anyagválasztást és az alkalmazott eljárást. @hu
toolkit label: könyvtervező testület: @hu
toolkit definition: Egy testület, amely felelős egy megjelenési forma gyártásáért oly módon, hogy felelős egy könyv teljes grafikai tervezéséért, beleértve a nyomdai betűtípus és az illusztrációk elrendezését, az anyagválasztást és az alkalmazott eljárást. @hu
label: ha come grafico ente @it
definition: Correla una manifestazione all'ente coinvolto nella manifattura di una manifestazione, come responsabile dell'intero progetto grafico di un libro, compresi la disposizione dei caratteri tipografici e delle illustrazioni, la scelta dei materiali e il procedimento utilizzato. @it
toolkit label: grafico ente @it
toolkit definition: Ente coinvolto nella nella manifattura di una manifestazione, come responsabile dell'intero progetto grafico di un libro, compresi la disposizione dei caratteri tipografici e delle illustrazioni, la scelta dei materiali e il procedimento utilizzato. @it
label: grāmatas dizaina autors (institūcija) @lv
definition: Sasaista manifestāciju ar institūciju, kas iesaistīta manifestācijas ražošanā, atbildot par grāmatas grafisko dizainu, tajā skaitā par izkārtojuma veidu un ilustrācijām, materiālu izvēli un tehnoloģisko procesu. @lv
toolkit label: grāmatas dizaina autors (institūcija) @lv
toolkit definition: Institūcija, kas iesaistīta manifestācijas ražošanā, atbildot par grāmatas grafisko dizainu, tajā skaitā par izkārtojuma veidu un ilustrācijām, materiālu izvēli un tehnoloģisko procesu. @lv
sub property of: has creator corporate body of manifestation
label: 有图书设计者团体 @zh-hans
definition: 将一种载体表现与通过负责图书的整体图形设计（包括字体和插图的编排、材料的选取和工艺流程的使用等）对载体表现创建负责的一个团体关联起来。 @zh-hans
toolkit label: 图书设计者团体 @zh-hans
toolkit definition: 通过负责图书的整体图形设计（包括字体和插图的编排、材料的选取和工艺流程的使用等）对载体表现创建负责的一个团体 @zh-hans
label: kitap tasarımcısı tüzel kişi ile ilişkilidir @tr
definition: Bir gösterimi, tür ve resim düzenlemesi, malzeme seçimi ve kullanılan süreç de dahil olmak üzere bir kitabın tüm grafik tasarımından sorumlu olarak bir gösterim oluşturmaktan sorumlu olan bir tüzel kişiyle ilişkilendirir. @tr
toolkit label: kitap tasarımcısı tüzel kişisi @tr
toolkit definition: Tür ve resim düzenlemesi, malzeme seçimi ve kullanılan süreç dahil olmak üzere bir kitabın tüm grafik tasarımından sorumlu olarak bir gösterim yaratmaktan sorumlu olan bir tüzel kişi. @tr
label: tiene cuerpo corporativo diseñador de libros @es
definition: Relaciona una manifestación con un cuerpo corporativo que es responsable de crear una manifestación al ser responsable de todo el diseño gráfico de un libro, incluida la disposición del tipo y la ilustración, la elección de los materiales y el proceso utilizado. @es
toolkit label: cuerpo corporativo diseñador de libros @es
toolkit definition: Un cuerpo corporativo que es responsable de crear una manifestación al ser responsable de todo el diseño gráfico de un libro, incluida la disposición del tipo y la ilustración, la elección de los materiales y el proceso utilizado. @es
has subproperty: P30407

has book designer family
status: Published
lexical alias: bookDesignerFamily.en
definition: Relates a manifestation to a family who is responsible for creating a manifestation by being responsible for the entire graphic design of a book, including arrangement of type and illustration, choice of materials, and process used.
toolkit label: book designer family
toolkit definition: A family who is responsible for creating a manifestation by being responsible for the entire graphic design of a book, including arrangement of type and illustration, choice of materials, and process used.
type: Property
domain: C10007
has element type: 2
sub property of: has book designer collective agent
label: graafinen suunnittelija (suku) @fi
definition: Liittää manifestaation sukuun, joka on vastuussa manifestaation valmistamisesta vastaamalla kirjan graafisesta suunnittelusta, taitosta, materiaalien valinnasta ja käytettävistä valmistusmenetelmistä. @fi
toolkit label: graafinen suunnittelija (suku) @fi
toolkit definition: Suku, joka on vastuussa manifestaation valmistamisesta vastaamalla kirjan graafisesta suunnittelusta, taitosta, materiaalien valinnasta ja käytettävistä valmistusmenetelmistä. @fi
label: har bokdesigner (familie) @no
definition: Relaterer en manifestasjon til en familie som er involvert i framstillingen av en manifestasjon ved å ha ansvar for hele den grafiske utformingen av en bok, inkludert oppsett av skrifttype og illustrasjoner, valg av materialer og hvilke prosesser som brukes. @no
toolkit label: bokdesigner (familie) @no
toolkit definition: En familie som er involvert i framstillingen av en manifestasjon ved å ha ansvar for hele den grafiske utformingen av en bok, inkludert oppsett av skrifttype og illustrasjoner, valg av materialer og hvilke prosesser som brukes. @no
label: a pour famille maquettiste de livre @fr
definition: Met une manifestation en relation avec une famille qui est responsable de la création d’une manifestation en étant responsable de toute la conception graphique d’un livre, y compris la composition typographique, l’arrangement des illustrations, le choix des matériaux et le procédé utilisé. @fr
toolkit label: famille maquettiste de livre @fr
toolkit definition: Famille qui est responsable de la création d’une manifestation en étant responsable de toute la conception graphique d’un livre, y compris la composition typographique, l’arrangement des illustrations, le choix des matériaux et le procédé utilisé. @fr
label: heeft boekontwerper-familie @nl
definition: Relateert een manifestatie aan een familie die verantwoordelijk is voor het creëren van een manifestatie door verantwoordelijk te zijn voor het gehele grafische ontwerp van een boek, inclusief de indeling van het zetsel en illustratie, keuze van materialen en gebruikt procedé. @nl
toolkit label: boekontwerper-familie @nl
toolkit definition: Een familie die verantwoordelijk is voor het creëren van een manifestatie door verantwoordelijk te zijn voor het gehele grafische ontwerp van een boek, inclusief de indeling van het zetsel en illustratie, keuze van materialen en gebruikt procedé. @nl
label: له عائلة مصممة كتاب @ar
definition: يربط بين تجسيدة وعائلة مسئولة عن تصنيع تجسيدة بالتصميم الجرافيكي الكامل لكتاب، بما في ذلك توضيب حروف الطباعة، والإيضاحيات، واختيار المواد، والعمليات المستخدمة. @ar
toolkit label: عائلة مصممة كتاب @ar
toolkit definition: عائلة مسئولة عن تصنيع تجسيدة بالتصميم الجرافيكي الكامل لكتاب، بما في ذلك توضيب حروف الطباعة، والإيضاحيات، واختيار المواد، والعمليات المستخدمة. @ar
label: té com a família dissenyadora gràfica @ca
definition: Relaciona una manifestació amb una família que és responsable de la creació d’una manifestació amb la responsabilitat de tot el disseny gràfic d’un llibre, inclosa la composició tipogràfica i la il·lustració, la tria dels materials i el procés utilitzat. @ca
toolkit label: família dissenyadora gràfica @ca
toolkit definition: Família que és responsable de la creació d’una manifestació amb la responsabilitat de tot el disseny gràfic d’un llibre, inclosa la composició tipogràfica i la il·lustració, la tria dels materials i el procés utilitzat. @ca
label: har familie, som er bogdesigner @da
definition: Relaterer en manifestation til en familie, som er involveret i fremstillingen af en manifestation ved at være ansvarlig for hele det grafiske design af en bog, inkl. opsætning af tekst og illustrationer, materialevalg og anvendt proces. @da
toolkit label: familie, som er bogdesigner @da
toolkit definition: Familie, som er involveret i fremstillingen af en manifestation ved at være ansvarlig for hele det grafiske design af en bog, inkl. opsætning af tekst og illustrationer, materialevalg og anvendt proces. @da
label: raamatukujundaja (perekond) @et
definition: Seostab kehastuse perekonnaga, kes osaleb kehastuse valmistamises, vastutades raamatu graafilise kujunduse eest, sealhulgas trükiteksti ja illustratsioonide paigutuse, materjalide valiku ja valmistamismenetluste eest. @et
toolkit label: raamatukujundaja (perekond) @et
toolkit definition: Perekond, kes osaleb kehastuse valmistamises, vastutades raamatu graafilise kujunduse eest, sealhulgas trükiteksti ja illustratsioonide paigutuse, materjalide valiku ja valmistamismenetluste eest. @et
label: hat Buchgestalterin/Buchgestalter (Familie) @de
definition: Setzt eine Manifestation in Beziehung zu einer Familie, die für die Herstellung einer Manifestation verantwortlich ist, indem sie für das gesamte grafische Design eines Buchs, einschließlich Schriftbild, Bildgestaltung, Materialwahl und angewandter Verfahren, verantwortlich ist. @de
toolkit label: Buchgestalterin/Buchgestalter (Familie) @de
toolkit definition: Eine Familie, die für die Herstellung einer Manifestation verantwortlich ist, indem sie für das gesamte grafische Design eines Buchs, einschließlich Schriftbild, Bildgestaltung, Materialwahl und angewandter Verfahren, verantwortlich ist. @de
label: könyvtervező családja a következő: @hu
definition: Hozzákapcsol egy megjelenési formát egy családhoz, amely felelős egy megjelenési forma gyártásáért oly módon, hogy felelős egy könyv teljes grafikai tervezéséért, beleértve a nyomdai betűtípus és az illusztrációk elrendezését, az anyagválasztást és az alkalmazott eljárást. @hu
toolkit label: könyvtervező család: @hu
toolkit definition: Egy család, amely felelős egy megjelenési forma gyártásáért oly módon, hogy felelős egy könyv teljes grafikai tervezéséért, beleértve a nyomdai betűtípus és az illusztrációk elrendezését, az anyagválasztást és az alkalmazott eljárást. @hu
label: ha come grafico famiglia @it
definition: Correla una manifestazione alla famiglia coinvolta nella manifattura di una manifestazione, come responsabile dell'intero progetto grafica di un libro, compresi la disposizione dei caratteri tipografici e delle illustrazioni, la scelta dei materiali e il procedimento utilizzato. @it
toolkit label: grafico famiglia @it
toolkit definition: Famiglia coinvolta nella manifattura di una manifestazione, come responsabile dell'intero progetto grafica di un libro, compresi la disposizione dei caratteri tipografici e delle illustrazioni, la scelta dei materiali e il procedimento utilizzato. @it
label: grāmatas dizaina autors (dzimta/ģimene) @lv
definition: Sasaista manifestāciju ar dzimtu/ģimeni, kas iesaistīta manifestācijas ražošanā, atbildot par grāmatas grafisko dizainu, tajā skaitā par izkārtojuma veidu un ilustrācijām, materiālu izvēli un tehnoloģisko procesu. @lv
toolkit label: grāmatas dizaina autors (dzimta/ģimene) @lv
toolkit definition: Dzimta/ģimene, kas iesaistīta manifestācijas ražošanā, atbildot par grāmatas grafisko dizainu, tajā skaitā par izkārtojuma veidu un ilustrācijām, materiālu izvēli un tehnoloģisko procesu. @lv
sub property of: has creator family of manifestation
label: 有图书设计者家族 @zh-hans
definition: 将一种载体表现与通过负责图书的整体图形设计（包括字体和插图的编排、材料的选取和工艺流程的使用等）对载体表现创建负责的一个家族关联起来。 @zh-hans
toolkit label: 图书设计者家族 @zh-hans
toolkit definition: 通过负责图书的整体图形设计（包括字体和插图的编排、材料的选取和工艺流程的使用等）对载体表现创建负责的一个家族 @zh-hans
label: kitap tasarımcı aile ile ilişkilidir @tr
definition: Bir gösterimi; türün ayarlanması ve gösterimi, materyal seçimi ve kullanılan işlem dahil bir kitabın bütün grafik tasarımından sorumlu olarak bir gösterim yaratmakla sorumlu aileyle ilişkilendirir. @tr
toolkit label: kitap tasarımcısı ailesi @tr
toolkit definition: Türün ayarlanması ve gösterimi, materyal seçimi ve kullanılan işlem dahil bir kitabın bütün grafik tasarımından sorumlu olarak bir gösterim yaratmakla sorumlu aile. @tr
label: tiene familia diseñadora de libros @es
definition: Relaciona una manifestación con una familia que es responsable de crear una manifestación al ser responsable de todo el diseño gráfico de un libro, incluyendo la disposición de tipo e ilustración, elección de materiales y el proceso utilizado. @es
toolkit label: familia diseñadora de libros @es
toolkit definition: Una familia que es responsable de crear una manifestación al ser responsable de todo el diseño gráfico de un libro, incluyendo la disposición de tipo e ilustración, elección de materiales y el proceso utilizado. @es
has subproperty: P30436

has book designer person
status: Published
lexical alias: bookDesignerPerson.en
definition: Relates a manifestation to a person who is responsible for creating a manifestation by being responsible for the entire graphic design of a book, including arrangement of type and illustration, choice of materials, and process used.
toolkit label: book designer person
toolkit definition: A person who is responsible for creating a manifestation by being responsible for the entire graphic design of a book, including arrangement of type and illustration, choice of materials, and process used.
type: Property
domain: C10007
has element type: 2
sub property of: has book designer agent
label: graafinen suunnittelija (henkilö) @fi
definition: Liittää manifestaation henkilöön, joka on vastuussa manifestaation valmistamisesta vastaamalla kirjan graafisesta suunnittelusta, taitosta, materiaalien valinnasta ja käytettävistä valmistusmenetelmistä. @fi
toolkit label: graafinen suunnittelija (henkilö) @fi
toolkit definition: Henkilö, joka on vastuussa manifestaation valmistamisesta vastaamalla kirjan graafisesta suunnittelusta, taitosta, materiaalien valinnasta ja käytettävistä valmistusmenetelmistä. @fi
label: har bokdesigner (person) @no
definition: Relaterer en manifestasjon til en person som er involvert i framstillingen av en manifestasjon ved å ha ansvar for hele den grafiske utformingen av en bok, inkludert oppsett av skrifttype og illustrasjoner, valg av materialer og hvilke prosesser som brukes. @no
toolkit label: bokdesigner (person) @no
toolkit definition: En person som er involvert i framstillingen av en manifestasjon ved å ha ansvar for hele den grafiske utformingen av en bok, inkludert oppsett av skrifttype og illustrasjoner, valg av materialer og hvilke prosesser som brukes. @no
label: a pour personne maquettiste de livre @fr
definition: Met une manifestation en relation avec une personne qui est responsable de la création d’une manifestation en étant responsable de toute la conception graphique d’un livre, y compris la composition typographique, l’arrangement des illustrations, le choix des matériaux et le procédé utilisé. @fr
toolkit label: personne maquettiste de livre @fr
toolkit definition: Personne qui est responsable de la création d’une manifestation en étant responsable de toute la conception graphique d’un livre, y compris la composition typographique, l’arrangement des illustrations, le choix des matériaux et le procédé utilisé. @fr
label: heeft boekontwerper-persoon @nl
definition: Relateert een manifestatie aan een persoon die verantwoordelijk is voor het creëren van een manifestatie door verantwoordelijk te zijn voor het gehele grafische ontwerp van een boek, inclusief de indeling van het zetsel en illustratie, keuze van materialen en gebruikt procedé. @nl
toolkit label: boekontwerper-persoon @nl
toolkit definition: Een persoon die verantwoordelijk is voor het creëren van een manifestatie door verantwoordelijk te zijn voor het gehele grafische ontwerp van een boek, inclusief de indeling van het zetsel en illustratie, keuze van materialen en gebruikt procedé. @nl
label: له شخص مصمم كتاب @ar
definition: يربط بين تجسيدة وشخص مسئول عن تصنيع تجسيدة بالتصميم الجرافيكي الكامل لكتاب، بما في ذلك توضيب حروف الطباعة، والإيضاحيات، واختيار المواد، والعمليات المستخدمة. @ar
toolkit label: شخص مصمم كتاب @ar
toolkit definition: شخص مسئول عن تصنيع تجسيدة بالتصميم الجرافيكي الكامل لكتاب، بما في ذلك توضيب حروف الطباعة، والإيضاحيات، واختيار المواد، والعمليات المستخدمة. @ar
label: té com a persona dissenyadora gràfica @ca
definition: Relaciona una manifestació amb una persona que és responsable de la creació d’una manifestació amb la responsabilitat de tot el disseny gràfic d’un llibre, inclosa la composició tipogràfica i la il·lustració, la tria dels materials i el procés utilitzat. @ca
toolkit label: persona dissenyadora gràfica @ca
toolkit definition: Persona que és responsable de la creació d’una manifestació amb la responsabilitat de tot el disseny gràfic d’un llibre, inclosa la composició tipogràfica i la il·lustració, la tria dels materials i el procés utilitzat. @ca
label: har person, som er bogdesigner @da
definition: Relaterer en manifestation til en person, som er involveret i fremstillingen af en manifestation ved at være ansvarlig for hele det grafiske design af en bog, inkl. opsætning af tekst og illustrationer, materialevalg og anvendt proces. @da
toolkit label: person, som er bogdesigner @da
toolkit definition: Person, som er involveret i fremstillingen af en manifestation ved at være ansvarlig for hele det grafiske design af en bog, inkl. opsætning af tekst og illustrationer, materialevalg og anvendt proces. @da
label: raamatukujundaja (isik) @et
definition: Seostab kehastuse isikuga, kes osaleb kehastuse valmistamises, vastutades raamatu graafilise kujunduse eest, sealhulgas trükiteksti ja illustratsioonide paigutuse, materjalide valiku ja valmistamismenetluste eest. @et
toolkit label: raamatukujundaja (isik) @et
toolkit definition: Isik, kes osaleb kehastuse valmistamises, vastutades raamatu graafilise kujunduse eest, sealhulgas trükiteksti ja illustratsioonide paigutuse, materjalide valiku ja valmistamismenetluste eest. @et
label: hat Buchgestalterin/Buchgestalter (Person) @de
definition: Setzt eine Manifestation in Beziehung zu einer Person, die für die Herstellung einer Manifestation verantwortlich ist, indem sie für das gesamte grafische Design eines Buchs, einschließlich Schriftbild, Bildgestaltung, Materialwahl und angewandter Verfahren, verantwortlich ist. @de
toolkit label: Buchgestalterin/Buchgestalter (Person) @de
toolkit definition: Eine Person, die für die Herstellung einer Manifestation verantwortlich ist, indem sie für das gesamte grafische Design eines Buchs, einschließlich Schriftbild, Bildgestaltung, Materialwahl und angewandter Verfahren, verantwortlich ist. @de
label: könyvtervező személye a következő: @hu
definition: Hozzákapcsol egy megjelenési formát egy személyhez, aki felelős egy megjelenési forma gyártásáért oly módon, hogy felelős egy könyv teljes grafikai tervezéséért, beleértve a nyomdai betűtípus és az illusztrációk elrendezését, az anyagválasztást és az alkalmazott eljárást. @hu
toolkit label: könyvtervező személy: @hu
toolkit definition: Egy személy, aki felelős egy megjelenési forma gyártásáért oly módon, hogy felelős egy könyv teljes grafikai tervezéséért, beleértve a nyomdai betűtípus és az illusztrációk elrendezését, az anyagválasztást és az alkalmazott eljárást. @hu
label: ha come grafico persona @it
definition: Correla una manifestazione alla persona coinvolta nella manifattura di una manifestazione, come responsabile dell'intero progetto grafico di un libro, compresi la disposizione dei caratteri tipografici e delle illustrazioni, la scelta dei materiali e il procedimento utilizzato. @it
toolkit label: grafico persona @it
toolkit definition: Persona coinvolta nella manifattura di una manifestazione, come responsabile dell'intero progetto grafico di un libro, compresi la disposizione dei caratteri tipografici e delle illustrazioni, la scelta dei materiali e il procedimento utilizzato. @it
label: grāmatas dizaina autors (persona) @lv
definition: Sasaista manifestāciju ar personu, kura iesaistīta manifestācijas ražošanā, atbildot par grāmatas grafisko dizainu, tajā skaitā par izkārtojuma veidu un ilustrācijām, materiālu izvēli un tehnoloģisko procesu. @lv
toolkit label: grāmatas dizaina autors (persona) @lv
toolkit definition: Persona, kura iesaistīta manifestācijas ražošanā, atbildot par grāmatas grafisko dizainu, tajā skaitā par izkārtojuma veidu un ilustrācijām, materiālu izvēli un tehnoloģisko procesu. @lv
sub property of: has creator person of manifestation
label: 有图书设计者个人 @zh-hans
definition: 将一种载体表现与通过负责图书的整体图形设计（包括字体和插图的编排、材料的选取和工艺流程的使用等）对载体表现创建负责的一个个人关联起来。 @zh-hans
toolkit label: 图书设计者个人 @zh-hans
toolkit definition: 通过负责图书的整体图形设计（包括字体和插图的编排、材料的选取和工艺流程的使用等）对载体表现创建负责的一个个人 @zh-hans
label: kitap tasarımcısı ile ilişkilidir @tr
definition: Bir gösterimi, yazı ve illüstrasyon düzenlemesi, malzeme seçimi ve kullanılan süreç de dahil olmak üzere bir kitabın tüm grafik tasarımından sorumlu olarak bir öğenin oluşturulmasından sorumlu olan bir kişiyle ilişkilendirir. @tr
toolkit label: kitap tasarımcısı @tr
toolkit definition: Yazı ve illüstrasyon düzenlemesi, malzeme seçimi ve kullanılan süreç de dahil olmak üzere bir kitabın tüm grafik tasarımından sorumlu olarak bir gösterim oluşturmaktan sorumlu olan kişi. @tr
label: tiene persona diseñadora de libros @es
definition: Relaciona una manifestación con una persona que es responsable de crear una manifestación al ser responsable de todo el diseño gráfico de un libro, incluida la disposición del tipo y la ilustración, la elección de los materiales y el proceso utilizado. @es
toolkit label: persona diseñadora de libros @es
toolkit definition: Una persona que es responsable de crear una manifestación al ser responsable de todo el diseño gráfico de un libro, incluida la disposición del tipo y la ilustración, la elección de los materiales y el proceso utilizado. @es
has subproperty: P30349

has braille embosser agent
status: Published
definition: Relates a manifestation to an agent who is responsible for manufacturing a manifestation by embossing braille cells using a stylus, special embossing printer, or other device.
type: Property
domain: C10007
sub property of: has manufacturer agent
lexical alias: brailleEmbosserAgent.en
toolkit label: braille embosser agent
toolkit definition: An agent who is responsible for manufacturing a manifestation by embossing braille cells using a stylus, special embossing printer, or other device.
label: a pour agent producteur braille @fr
definition: Met une manifestation en relation avec un agent qui est responsable de la fabrication d’une manifestation par l’embossage de cellules braille au moyen d’un poinçon, d’une imprimante spéciale ou d’un autre appareil. @fr
toolkit label: agent producteur braille @fr
toolkit definition: Agent qui est responsable de la fabrication d’une manifestation par l’embossage de cellules braille au moyen d’un poinçon, d’une imprimante spéciale ou d’un autre appareil. @fr
toolkit label: agente de estampado braille @es
toolkit definition: Un agente que es responsable de fabricar una manifestación grabando celdas braille usando un lápiz óptico, una impresora de estampado especial u otro dispositivo. @es
instruction number: 18.5
toolkit label: brailleerder-actor @nl
toolkit definition: Een actor die verantwoordelijk is voor de vervaardiging van een manifestatie middels het brailleren met gebruik van een stylus, een speciale stansmachine of ander hulpmiddel. @nl
label: có người chạm nổi chữ braille @vi
definition: Liên kết biểu thị với tác nhân có liên quan tới chế tạo biểu thị theo trách nhiệm dập nổi các ô chữ braille sử dụng bút trâm, máy tin nổi đặc biệt, hoặc thiết bị khác. @vi
toolkit label: người chạm nổi chữ braille @vi
toolkit definition: Tác nhân có liên quan tới chế tạo biểu thị theo trách nhiệm dập nổi các ô chữ braille sử dụng bút trâm, máy tin nổi đặc biệt, hoặc thiết bị khác. @vi
label: har agent, som er punktskriftspræger @da
definition: Relaterer en manifestation til en agent, som er involveret i fremstillingen af en manifestation ved at præge punktskriftsceller vha. en stift, særlig prægeprinter eller andet apparatur. @da
toolkit label: agent, som er punktskriftspræger @da
toolkit definition: Agent, som er involveret i fremstillingen af en manifestation ved at præge punktskriftsceller vha. en stift, særlig prægeprinter eller andet apparatur. @da
label: hat Brailleschriftprägerin/Brailleschriftpräger (Akteur) @de
definition: Setzt eine Manifestation in Beziehung zu einem Akteur, der für die Herstellung einer Manifestation in Form von Braillezeichen verantwortlich ist, indem er einen Griffel, einen speziellen Brailledrucker oder ein anderes Gerät zum Prägen verwendet. @de
toolkit label: Brailleschriftprägerin/Brailleschriftpräger (Akteur) @de
toolkit definition: Ein Akteur, der für die Herstellung einer Manifestation in Form von Braillezeichen verantwortlich ist, indem er einen Griffel, einen speziellen Brailledrucker oder ein anderes Gerät zum Prägen verwendet. @de
label: té com a agent estampador braille @ca
definition: Relaciona una manifestació amb un agent que és responsable de la fabricació d’una manifestació amb el repujat de punts braille amb un punxó, una impressora especial d’estampar o un altre mecanisme. @ca
toolkit label: agent estampador braille @ca
toolkit definition: Agent que és responsable de la fabricació d’una manifestació amb el repujat de punts braille amb un punxó, una impressora especial d’estampar o un altre mecanisme. @ca
definition: Liittää manifestaation toimijaan, joka on vastuussa manifestaation valmistamisesta tuottamalla pistekirjoitusmerkkejä piirtimen, erityistulostimen tai muun laitteen avulla. @fi
toolkit label: pistekirjoituksen tekijä (toimija) @fi
toolkit definition: Toimijaan, joka on vastuussa manifestaation valmistamisesta tuottamalla pistekirjoitusmerkkejä piirtimen, erityistulostimen tai muun laitteen avulla. @fi
toolkit label: punktskriftpreger (agent) @no
toolkit definition: En agent som er involvert i framstillingen av en manifestasjon ved å prege brailleceller ved hjelp av pren, punktskriftmaskin eller annen innretning. @no
label: έχει τυπογράφο Μπράιγ @el
definition: Συνδέει μια εκδήλωση με έναν φορέα που εμπλέκεται στην κατασκευή μιας εκδήλωσης κατασκευάζοντας μια ανάγλυφη εκτύπωση μπράιγ χρησιμοποιώντας έναν ειδικό εκτυπωτή ανάγλυφης εκτύπωσης ή άλλη συσκευή. @el
toolkit label: τυπογράφος μπράιγ @el
toolkit definition: Ένας φορέας που εμπλέκεται στην κατασκευή μιας εκδήλωσης κατασκευάζοντας μια ανάγλυφη εκτύπωση μπράιγ χρησιμοποιώντας έναν ειδικό εκτυπωτή ανάγλυφης εκτύπωσης ή άλλη συσκευή. @el
has element type: 2
label: Braille-dombornyomó ágense a következő: @hu
definition: Hozzákapcsol egy megjelenési formát egy ágenshez, amely felelős egy megjelenési forma gyártásáért oly módon, hogy domborítja a Braille-cellákat íróvessző, speciális domborítónyomtató vagy más készülék használatával. @hu
toolkit label: Braille-dombornyomó ágens: @hu
toolkit definition: Egy ágens, amely felelős egy megjelenési forma gyártásáért oly módon, hogy domborítja a Braille-cellákat íróvessző, speciális domborítónyomtató vagy más készülék használatával. @hu
alternative label: braille embosser
alternative label: pistekirjoituksen valmistaja @fi
label: pistekirjoituksen tekijä (toimija) @fi
label: har punktskriftpreger (agent) @no
definition: Relaterer en manifestasjon til en agent som er involvert i framstillingen av en manifestasjon ved å prege brailleceller ved hjelp av pren, punktskriftmaskin eller annen innretning. @no
alternative label: punktskriftpreger @no
alternative label: producteur braille @fr
label: heeft brailleerder-actor @nl
definition: Relateert een manifestatie aan een actor die verantwoordelijk is voor de vervaardiging van een manifestatie middels het brailleren met gebruik van een stylus, een speciale stansmachine of ander hulpmiddel. @nl
label: له وكيل موازي مجسد بطريقة برايل @ar
definition: يربط بين تجسيدة ووكيل مسئول عن تصنيع تجسيدة بالطباعة بطريقة خلايا نقش برايل باستخدام قلم نقش، أو طابعة نقش خاصة، أو أي أداة أخرى. @ar
alternative label: مجسد بطريقة برايل @ar
toolkit label: وكيل موازي مجسد بطريقة برايل @ar
toolkit definition: وكيل مسئول عن تصنيع تجسيدة بالطباعة بطريقة خلايا نقش برايل باستخدام قلم نقش، أو طابعة نقش خاصة، أو أي أداة أخرى. @ar
alternative label: estampador braille @ca
alternative label: braillepræger @da
label: punktkirja kirjutaja (tegija) @et
definition: Seostab kehastuse tegijaga, kes osaleb kehastuse valmistamises, tehes punktkirjamärke spetsiaalse kirjutusvahendi, punktkirjaprinteri või muu seadmega. @et
alternative label: punktkirja kirjutaja @et
toolkit label: punktkirja kirjutaja (tegija) @et
toolkit definition: Tegija, kes osaleb kehastuse valmistamises, tehes punktkirjamärke spetsiaalse kirjutusvahendi, punktkirjaprinteri või muu seadmega. @et
alternative label: Braille-dombornyomó: @hu
label: ha come goffratore braille agente @it
definition: Correla una manifestazione all'agente coinvolto nella manifattura di una manifestazione tramite la goffratura di celle braille, utilizzando uno stilo, una stampante speciale per goffratura, o altro dispositivo. @it
alternative label: goffratore braille @it
toolkit label: goffratore braille agente @it
toolkit definition: Agente coinvolto nella manifattura di una manifestazione tramite la goffratura di celle braille, utilizzando uno stilo, una stampante speciale per goffratura, o altro dispositivo. @it
label: Braila raksta iespiedējs (aģents) @lv
definition: Sasaista manifestāciju ar aģentu, kas iesaistīts manifestācijas ražošanā, iespiežot Braila raksta matricas, izmantojot irbuli, īpašu ciļņa iespieduma printeri vai citu ierīci. @lv
toolkit label: Braila raksta iespiedējs (aģents) @lv
toolkit definition: Aģents, kas iesaistīts manifestācijas ražošanā, iespiežot Braila raksta matricas, izmantojot irbuli, īpašu ciļņa iespieduma printeri vai citu ierīci. @lv
alternative label: Brailleschriftpräger @de
toolkit label: 布莱叶盲文点字制作者行为者 @zh-hans

has braille embosser collective agent
status: Published
lexical alias: brailleEmbosserCollectiveAgent.en
definition: Relates a manifestation to a collective agent who is responsible for manufacturing a manifestation by embossing braille cells using a stylus, special embossing printer, or other device.
toolkit label: braille embosser collective agent
toolkit definition: A collective agent who is responsible for manufacturing a manifestation by embossing braille cells using a stylus, special embossing printer, or other device.
type: Property
domain: C10007
has element type: 2
sub property of: has manufacturer collective agent
sub property of: has braille embosser agent
label: pistekirjoituksen tekijä (yhteistoimija) @fi
definition: Liittää manifestaation yhteistoimijaan, joka on vastuussa manifestaation valmistamisesta tuottamalla pistekirjoitusmerkkejä piirtimen, erityistulostimen tai muun laitteen avulla. @fi
toolkit label: pistekirjoituksen tekijä (yhteistoimija) @fi
toolkit definition: Yhteistoimija, joka on vastuussa manifestaation valmistamisesta tuottamalla pistekirjoitusmerkkejä piirtimen, erityistulostimen tai muun laitteen avulla. @fi
label: har punktskriftpreger (kollektiv agent) @no
definition: Relaterer en manifestasjon til en kollektiv agent som er involvert i framstillingen av en manifestasjon ved å prege brailleceller ved hjelp av pren, punktskriftmaskin eller annen innretning. @no
toolkit label: punktskriftpreger (kollektiv agent) @no
toolkit definition: En kollektiv agent som er involvert i framstillingen av en manifestasjon ved å prege brailleceller ved hjelp av pren, punktskriftmaskin eller annen innretning. @no
label: a pour agent collectif producteur braille @fr
definition: Met une manifestation en relation avec un agent collectif qui est responsable de la fabrication d’une manifestation par l’embossage de cellules braille au moyen d’un poinçon, d’une imprimante spéciale ou d’un autre appareil. @fr
toolkit label: agent collectif producteur braille @fr
toolkit definition: Agent collectif qui est responsable de la fabrication d’une manifestation par l’embossage de cellules braille au moyen d’un poinçon, d’une imprimante spéciale ou d’un autre appareil. @fr
label: heeft brailleerder-collectieve actor @nl
definition: Relateert een manifestatie aan een collectieve actor die verantwoordelijk is voor het vervaardigen van een manifestatie middels het brailleren met gebruik van een stylus, een speciale stansmachine of ander hulpmiddel. @nl
toolkit label: brailleerder-collectieve actor @nl
toolkit definition: Een collectieve actor die verantwoordelijk is voor het vervaardigen van een manifestatie middels het brailleren met gebruik van een stylus, een speciale stansmachine of ander hulpmiddel. @nl
label: له وكيل جماعي مجسد بطرية برايل @ar
definition: يربط بين تجسيدة ووكيل جماعي مسئول عن تصنيع تجسيدة بالطباعة بطريقة خلايا نقش برايل باستخدام قلم نقش، أو طابعة نقش خاصة، أو أي أداة أخرى. @ar
toolkit label: وكيل جماعي مجسد بطريقة برايل @ar
toolkit definition: وكيل جماعي مسئول عن تصنيع تجسيدة بالطباعة بطريقة خلايا نقش برايل باستخدام قلم نقش، أو طابعة نقش خاصة، أو أي أداة أخرى. @ar
label: té com a agent col·lectiu estampador braille @ca
definition: Relaciona una manifestació amb un agent col·lectiu que és responsable de la fabricació d’una manifestació amb el repujat de punts braille amb un punxó, una impressora especial d’estampar o un altre mecanisme. @ca
toolkit label: agent col·lectiu estampador braille @ca
toolkit definition: Agent col·lectiu que és responsable de la fabricació d’una manifestació amb el repujat de punts braille amb un punxó, una impressora especial d’estampar o un altre mecanisme. @ca
label: har kollektiv agent, som er punktskriftspræger @da
definition: Relaterer en manifestation til en kollektiv agent, som er involveret i fremstillingen af en manifestation ved at præge punktskriftsceller vha. en stift, særlig prægeprinter eller andet apparatur. @da
toolkit label: kollektiv agent, som er punktskriftspræger @da
toolkit definition: Kollektiv agent, som er involveret i fremstillingen af en manifestation ved at præge punktskriftsceller vha. en stift, særlig prægeprinter eller andet apparatur. @da
label: punktkirja kirjutaja (kollektiiv) @et
definition: Seostab kehastuse kollektiiviga, kes osaleb kehastuse valmistamises, tehes punktkirjamärke spetsiaalse kirjutusvahendi, punktkirjaprinteri või muu seadmega. @et
toolkit label: punktkirja kirjutaja (kollektiiv) @et
toolkit definition: Kollektiiv, kes osaleb kehastuse valmistamises, tehes punktkirjamärke spetsiaalse kirjutusvahendi, punktkirjaprinteri või muu seadmega. @et
label: hat Brailleschriftprägerin/Brailleschriftpräger (Gemeinschaftlicher Akteur) @de
definition: Setzt eine Manifestation in Beziehung zu einem gemeinschaftlichen Akteur, der für die Herstellung einer Manifestation in Form von Braillezeichen verantwortlich ist, indem er einen Griffel, einen speziellen Brailledrucker oder ein anderes Gerät zum Prägen verwendet. @de
toolkit label: Brailleschriftprägerin/Brailleschriftpräger (Gemeinschaftlicher Akteur) @de
toolkit definition: Ein gemeinschaftlicher Akteur, der für die Herstellung einer Manifestation in Form von Braillezeichen verantwortlich ist, indem er einen Griffel, einen speziellen Brailledrucker oder ein anderes Gerät zum Prägen verwendet. @de
label: Braille-dombornyomó kollektív ágense a következő: @hu
definition: Hozzákapcsol egy megjelenési formát egy kollektív ágenshez, amely egy megjelenési forma gyártásáért felelős oly módon, hogy domborítja a Braille-cellákat íróvessző, speciális domborítónyomtató vagy más készülék használatával. @hu
toolkit label: Braille-dombornyomó kollektív ágens. @hu
toolkit definition: Egy kollektív ágens, amely egy megjelenési forma gyártásáért felelős oly módon, hogy domborítja a Braille-cellákat íróvessző, speciális domborítónyomtató vagy más készülék használatával. @hu
label: ha come goffratore braille agente collettivo @it
definition: Correla una manifestazione all'agente collettivo coinvolto nella manifattura di una manifestazione tramite goffratura di celle braille, utilizzando uno stilo, una stampante speciale per goffratura, o altro dispositivo. @it
toolkit label: goffratore braille agente collettivo @it
toolkit definition: Agente collettivo coinvolto nella manifattura di una manifestazione tramite goffratura di celle braille, utilizzando uno stilo, una stampante speciale per goffratura, o altro dispositivo. @it
label: Braila raksta iespiedējs (grupa) @lv
definition: Sasaista manifestāciju ar grupu, kas iesaistīta manifestācijas ražošanā, iespiežot Braila raksta matricas, izmantojot irbuli, īpašu ciļņa iespieduma printeri vai citu ierīci. @lv
toolkit label: Braila raksta iespiedējs (grupa) @lv
toolkit definition: Grupa, kas iesaistīta manifestācijas ražošanā, iespiežot Braila raksta matricas, izmantojot irbuli, īpašu ciļņa iespieduma printeri vai citu ierīci. @lv
label: 有布莱叶盲文点字制作者集体行为者 @zh-hans
definition: 将一种载体表现与涉及通过使用刻写针、专门的压纹机或其他设备压印布莱叶盲文而对一种载体表现的生产负责的一个集体行为者关联起来。 @zh-hans
toolkit label: 布莱叶盲文点字制作者集体行为者 @zh-hans
toolkit definition: 涉及通过使用刻写针、专门的压纹机或其他设备压印布莱叶盲文而对一种载体表现的生产负责的一个集体行为者 @zh-hans
label: braille kabartmacısı kolektif temsilci ile ilişkilidir @tr
definition: Bir çizimi, bir ekran kalemi, özel kabartma yazıcısı veya başka bir cihaz kullanarak braille hücrelerini kabartma yaparak bir gösterimi üretmekten sorumlu kolektif bir temsilciyle ilişkilendirir. @tr
toolkit label: braille kabartmacısı kolektif temsilcisi @tr
toolkit definition: Kalem, özel kabartma yazıcı veya başka bir cihaz kullanarak braille hücrelerini kabartma yaparak bir gösterim oluşturmaktan sorumlu kolektif bir temsilci. @tr
label: tiene agente colectivo impresor de braille @es
definition: Relaciona una manifestación con un agente colectivo que es responsable de fabricar una manifestación grabando celdas braille usando un lápiz, una impresora especial de estampado u otro dispositivo. @es
toolkit label: agente colectivo impresor de braille @es
toolkit definition: Un agente colectivo que es responsable de fabricar una manifestación grabando celdas braille usando un lápiz, una impresora especial de estampado u otro dispositivo. @es
has subproperty: has braille embosser corporate body
has subproperty: has braille embosser family
has subproperty: P30380

has braille embosser corporate body
status: Published
lexical alias: brailleEmbosserCorporateBody.en
definition: Relates a manifestation to a corporate body who is responsible for manufacturing a manifestation by embossing braille cells using a stylus, special embossing printer, or other device.
toolkit label: braille embosser corporate body
toolkit definition: A corporate body who is responsible for manufacturing a manifestation by embossing braille cells using a stylus, special embossing printer, or other device.
type: Property
domain: C10007
has element type: 2
sub property of: has manufacturer corporate body
sub property of: has braille embosser collective agent
label: pistekirjoituksen tekijä (yhteisö) @fi
definition: Liittää manifestaation yhteisöön, joka on vastuussa manifestaation valmistamisesta tuottamalla pistekirjoitusmerkkejä piirtimen, erityistulostimen tai muun laitteen avulla. @fi
toolkit label: pistekirjoituksen tekijä (yhteisö) @fi
toolkit definition: Yhteisö, joka on vastuussa manifestaation valmistamisesta tuottamalla pistekirjoitusmerkkejä piirtimen, erityistulostimen tai muun laitteen avulla. @fi
label: har punktskriftpreger (korporasjon) @no
definition: Relaterer en manifestasjon til en korporasjon som er involvert i framstillingen av en manifestasjon ved å prege brailleceller ved hjelp av pren, punktskriftmaskin eller annen innretning. @no
toolkit label: punktskriftpreger (korporasjon) @no
toolkit definition: En korporasjon som er involvert i framstillingen av en manifestasjon ved å prege brailleceller ved hjelp av pren, punktskriftmaskin eller annen innretning. @no
label: a pour collectivité productrice braille @fr
definition: Met une manifestation en relation avec une collectivité qui est responsable de la fabrication d’une manifestation par l’embossage de cellules braille au moyen d’un poinçon, d’une imprimante spéciale ou d’un autre appareil. @fr
toolkit label: collectivité productrice braille @fr
toolkit definition: Collectivité qui est responsable de la fabrication d’une manifestation par l’embossage de cellules braille au moyen d’un poinçon, d’une imprimante spéciale ou d’un autre appareil. @fr
label: heeft brailleerder-corporatie @nl
definition: Relateert een manifestatie aan een corporatie die verantwoordelijk is voor het vervaardigen van een manifestatie middels het brailleren met gebruik van een stylus, een speciale stansmachine of ander hulpmiddel. @nl
toolkit label: brailleerder-corporatie @nl
toolkit definition: Een corporatie die verantwoordelijk is voor het vervaardigen van een manifestatie middels het brailleren met gebruik van een stylus, een speciale stansmachine of ander hulpmiddel. @nl
label: له هيئة مجسدة بطريقة برايل @ar
definition: يربط بين تجسيدة وهيئة مسئولة عن تصنيع تجسيدة بالطباعة بطريقة خلايا نقش برايل باستخدام قلم نقش، أو طابعة نقش خاصة، أو أي أداة أخرى. @ar
toolkit label: هيئة مجسدة بطريقة برايل @ar
toolkit definition: هيئة مسئولة عن تصنيع تجسيدة بالطباعة بطريقة خلايا نقش برايل باستخدام قلم نقش، أو طابعة نقش خاصة، أو أي أداة أخرى. @ar
label: té com a entitat corporativa estampadora braille @ca
definition: Relaciona una manifestació amb una entitat corporativa que és responsable de la fabricació d’una manifestació amb el repujat de punts braille amb un punxó, una impressora especial d’estampar o un altre mecanisme. @ca
toolkit label: entitat corporativa estampadora braille @ca
toolkit definition: Entitat corporativa que és responsable de la fabricació d’una manifestació amb el repujat de punts braille amb un punxó, una impressora especial d’estampar o un altre mecanisme. @ca
label: har korporation, som er punktskriftspræger @da
definition: Relaterer en manifestation til en korporation, som er involveret i fremstillingen af en manifestation ved at præge punktskriftsceller vha. en stift, særlig prægeprinter eller andet apparatur. @da
toolkit label: korporation, som er punktskriftspræger @da
toolkit definition: Korporation, som er involveret i fremstillingen af en manifestation ved at præge punktskriftsceller vha. en stift, særlig prægeprinter eller andet apparatur. @da
label: punktkirja kirjutaja (asutus) @et
definition: Seostab kehastuse asutusega, kes osaleb kehastuse valmistamises, tehes punktkirjamärke spetsiaalse kirjutusvahendi, punktkirjaprinteri või muu seadmega. @et
toolkit label: punktkirja kirjutaja (asutus) @et
toolkit definition: Asutus, kes osaleb kehastuse valmistamises, tehes punktkirjamärke spetsiaalse kirjutusvahendi, punktkirjaprinteri või muu seadmega. @et
label: hat Brailleschriftprägerin/Brailleschriftpräger (Körperschaft) @de
definition: Setzt eine Manifestation in Beziehung zu einer Körperschaft, die für die Herstellung einer Manifestation in Form von Braillezeichen verantwortlich ist, indem sie einen Griffel, einen speziellen Brailledrucker oder ein anderes Gerät zum Prägen verwendet. @de
toolkit label: Brailleschriftprägerin/Brailleschriftpräger (Körperschaft) @de
toolkit definition: Eine Körperschaft, die für die Herstellung einer Manifestation in Form von Braillezeichen verantwortlich ist, indem sie einen Griffel, einen speziellen Brailledrucker oder ein anderes Gerät zum Prägen verwendet. @de
label: Braille-dombornyomó testülete a következő: @hu
definition: Hozzákapcsol egy megjelenési formát egy testülethez, amely felelős egy megjelenési forma gyártásáért oly módon, hogy domborítja a Braille-cellákat íróvessző, speciális domborítónyomtató vagy más készülék használatával. @hu
toolkit label: Braille-dombornyomó testület: @hu
toolkit definition: Egy testület, amely felelős egy megjelenési forma gyártásáért oly módon, hogy domborítja a Braille-cellákat íróvessző, speciális domborítónyomtató vagy más készülék használatával. @hu
label: ha come goffratore braille ente @it
definition: Correla una manifestazione all'ente coinvolto nella manifattura di una manifestazione, tramite goffratura di celle braille, utilizzando uno stilo, una stampante speciale per goffratura, o altro dispositivo. @it
toolkit label: goffratore braille ente @it
toolkit definition: Ente coinvolto nella manifattura di una manifestazione, tramite goffratura di celle braille, utilizzando uno stilo, una stampante speciale per goffratura, o altro dispositivo. @it
label: Braila raksta iespiedējs (institūcija) @lv
definition: Sasaista manifestāciju ar institūciju, kas iesaistīta manifestācijas ražošanā, iespiežot Braila raksta matricas, izmantojot irbuli, īpašu ciļņa iespieduma printeri vai citu ierīci. @lv
toolkit label: Braila raksta iespiedējs (institūcija) @lv
toolkit definition: Institūcija, kas iesaistīta manifestācijas ražošanā, iespiežot Braila raksta matricas, izmantojot irbuli, īpašu ciļņa iespieduma printeri vai citu ierīci. @lv
label: 有布莱叶盲文点字制作者团体 @zh-hans
definition: 将一种载体表现与涉及通过使用刻写针、专门的压纹机或其他设备压印布莱叶盲文而对一种载体表现的生产负责的一个团体关联起来。 @zh-hans
toolkit label: 布莱叶盲文点字制作者团体 @zh-hans
toolkit definition: 涉及通过使用刻写针、专门的压纹机或其他设备压印布莱叶盲文而对一种载体表现的生产负责的一个团体 @zh-hans
label: braille kabartmacısı tüzel kişi ile ilişkilidir @tr
definition: Bir gösterimi, bir kalem, özel kabartmalı yazıcı veya başka bir cihaz kullanarak braille hücrelerini kabartmak suretiyle bir gösterim üretmekten sorumlu olan tüzel kişilikle ilişkilendirir. @tr
toolkit label: braille kabartmacısı tüzel kişisi @tr
toolkit definition: Kalem, özel kabartma yazıcı veya başka bir cihaz kullanarak braille hücrelerini kabartma yaparak bir gösterim üretmekten sorumlu bir tüzel kişi. @tr
label: tiene cuerpo corporativo impresor de braille @es
definition: Relaciona una manifestación con un cuerpo corporativo que es responsable de fabricar una manifestación grabando celdas braille usando un lápiz óptico, una impresora especial de estampado u otro dispositivo. @es
toolkit label: cuerpo corporativo impresor de braille @es
toolkit definition: Un cuerpo corporativo que es responsable de fabricar una manifestación grabando celdas braille usando un lápiz óptico, una impresora especial de estampado u otro dispositivo. @es
has subproperty: P30409

has braille embosser family
status: Published
lexical alias: brailleEmbosserFamily.en
definition: Relates a manifestation to a family who is responsible for manufacturing a manifestation by embossing braille cells using a stylus, special embossing printer, or other device.
toolkit label: braille embosser family
toolkit definition: A family who is responsible for manufacturing a manifestation by embossing braille cells using a stylus, special embossing printer, or other device.
type: Property
domain: C10007
has element type: 2
sub property of: has manufacturer family
sub property of: has braille embosser collective agent
label: pistekirjoituksen tekijä (suku) @fi
definition: Liittää manifestaation sukuun, joka on vastuussa manifestaation valmistamisesta tuottamalla pistekirjoitusmerkkejä piirtimen, erityistulostimen tai muun laitteen avulla. @fi
toolkit label: pistekirjoituksen tekijä (suku) @fi
toolkit definition: Suku, joka on vastuussa manifestaation valmistamisesta tuottamalla pistekirjoitusmerkkejä piirtimen, erityistulostimen tai muun laitteen avulla. @fi
label: har punktskriftpreger (familie) @no
definition: Relaterer en manifestasjon til en familie som er involvert i framstillingen av en manifestasjon ved å prege brailleceller ved hjelp av pren, punktskriftmaskin eller annen innretning. @no
toolkit label: punktskriftpreger (familie) @no
toolkit definition: En familie som er involvert i framstillingen av en manifestasjon ved å prege brailleceller ved hjelp av pren, punktskriftmaskin eller annen innretning. @no
label: a pour famille productrice braille @fr
definition: Met une manifestation en relation avec une famille qui est responsable de la fabrication d’une manifestation par l’embossage de cellules braille au moyen d’un poinçon, d’une imprimante spéciale ou d’un autre appareil. @fr
toolkit label: famille productrice braille @fr
toolkit definition: Famille qui est responsable de la fabrication d’une manifestation par l’embossage de cellules braille au moyen d’un poinçon, d’une imprimante spéciale ou d’un autre appareil. @fr
label: heeft brailleerder-familie @nl
definition: Relateert een manifestatie aan een familie die verantwoordelijk is voor het vervaardigen van een manifestatie middels het brailleren met gebruik van een stylus, een speciale stansmachine of ander hulpmiddel. @nl
toolkit label: brailleerder-familie @nl
toolkit definition: Een familie die verantwoordelijk is voor het vervaardigen van een manifestatie middels het brailleren met gebruik van een stylus, een speciale stansmachine of ander hulpmiddel. @nl
label: له عائلة مجسدة بطريقة برايل @ar
definition: يربط بين تجسيدة وعائلة مسئولة عن تصنيع تجسيدة بالطباعة بطريقة خلايا نقش برايل باستخدام قلم نقش، أو طابعة نقش خاصة، أو أي أداة أخرى. @ar
toolkit label: عائلة مجسدة بطريقة برايل @ar
toolkit definition: عائلة مسئولة عن تصنيع تجسيدة بالطباعة بطريقة خلايا نقش برايل باستخدام قلم نقش، أو طابعة نقش خاصة، أو أي أداة أخرى. @ar
label: té com a família estampadora braille @ca
definition: Relaciona una manifestació amb una família que és responsable de la fabricació d’una manifestació amb el repujat de punts braille amb un punxó, una impressora especial d’estampar o un altre mecanisme. @ca
toolkit label: família estampadora braille @ca
toolkit definition: Família que és responsable de la fabricació d’una manifestació amb el repujat de punts braille amb un punxó, una impressora especial d’estampar o un altre mecanisme. @ca
label: har familie, som er punktskriftspræger @da
definition: Relaterer en manifestation til en familie, som er involveret i fremstillingen af en manifestation ved at præge punktskriftsceller vha. en stift, særlig prægeprinter eller andet apparatur. @da
toolkit label: familie, som er punktskriftspræger @da
toolkit definition: Familie, som er involveret i fremstillingen af en manifestation ved at præge punktskriftsceller vha. en stift, særlig prægeprinter eller andet apparatur. @da
label: punktkirja kirjutaja (perekond) @et
definition: Seostab kehastuse perekonnaga, kes osaleb kehastuse valmistamises, tehes punktkirjamärke spetsiaalse kirjutusvahendi, punktkirjaprinteri või muu seadmega. @et
toolkit label: punktkirja kirjutaja (perekond) @et
toolkit definition: Perekond, kes osaleb kehastuse valmistamises, tehes punktkirjamärke spetsiaalse kirjutusvahendi, punktkirjaprinteri või muu seadmega. @et
label: hat Brailleschriftprägerin/Brailleschriftpräger (Familie) @de
definition: Setzt eine Manifestation in Beziehung zu einer Familie, die für die Herstellung einer Manifestation in Form von Braillezeichen verantwortlich ist, indem sie einen Griffel, einen speziellen Brailledrucker oder ein anderes Gerät zum Prägen verwendet. @de
toolkit label: Brailleschriftprägerin/Brailleschriftpräger (Familie) @de
toolkit definition: Eine Familie, die für die Herstellung einer Manifestation in Form von Braillezeichen verantwortlich ist, indem sie einen Griffel, einen speziellen Brailledrucker oder ein anderes Gerät zum Prägen verwendet. @de
label: Braille-dombornyomó családja a következő: @hu
definition: Hozzákapcsol egy megjelenési formát egy családhoz, amely felelős egy megjelenési forma gyártásáért oly módon, hogy domborítja a Braille-cellákat íróvessző, speciális domborítónyomtató vagy más készülék használatával. @hu
toolkit label: Braille-dombornyomó család: @hu
toolkit definition: Egy család, amely felelős egy megjelenési forma gyártásáért oly módon, hogy domborítja a Braille-cellákat íróvessző, speciális domborítónyomtató vagy más készülék használatával. @hu
label: ha come goffratore braille famiglia @it
definition: Correla una manifestazione alla famiglia coinvolta nella manifattura di una manifestazione, tramite goffratura di celle braille, utilizzando uno stilo, una stampante speciale per goffratura, o altro dispositivo. @it
toolkit label: goffratore braille famiglia @it
toolkit definition: Famiglia coinvolta nella manifattura di una manifestazione, tramite goffratura di celle braille, utilizzando uno stilo, una stampante speciale per goffratura, o altro dispositivo. @it
label: Braila raksta iespiedējs (dzimta/ģimene) @lv
definition: Sasaista manifestāciju ar dzimtu/ģimeni, kas iesaistīta manifestācijas ražošanā, iespiežot Braila raksta matricas, izmantojot irbuli, īpašu ciļņa iespieduma printeri vai citu ierīci. @lv
toolkit label: Braila raksta iespiedējs (dzimta/ģimene) @lv
toolkit definition: Dzimta/ģimene, kas iesaistīta manifestācijas ražošanā, iespiežot Braila raksta matricas, izmantojot irbuli, īpašu ciļņa iespieduma printeri vai citu ierīci. @lv
label: 有布莱叶盲文点字制作者家族 @zh-hans
definition: 将一种载体表现与涉及通过使用刻写针、专门的压纹机或其他设备压印布莱叶盲文而对一种载体表现的生产负责的一个家族关联起来。 @zh-hans
toolkit label: 布莱叶盲文点字制作者家族 @zh-hans
toolkit definition: 涉及通过使用刻写针、专门的压纹机或其他设备压印布莱叶盲文而对一种载体表现的生产负责的一个家族 @zh-hans
label: braille kabartmacısı aile ile ilişkilidir @tr
definition: Bir gösterimi; bir taş kalem, özel kabartma yazıcısı veya başka bir cihaz kullanarak braille hücrelerini kabartarak bir gösterim üretmekle sorumlu aileyle ilişkilendirir. @tr
toolkit label: braille kabartmacısı ailesi @tr
toolkit definition: Bir taş kalem, özel kabartma yazıcısı veya başka bir cihaz kullanarak braille hücrelerini kabartarak bir gösterim üretmekle sorumlu aile. @tr
label: tiene familia grabadora en relieve de braille de @es
definition: Relaciona una manifestación con una familia que es responsable de crear una manifestación al grabar en relieve celdas braille utilizando un stylus, impresora especial de grabado en relieve u otro dispositivo. @es
toolkit label: familia grabadora en relieve de braille de @es
toolkit definition: Una familia que es responsable de crear una manifestación al grabar en relieve celdas braille utilizando un stylus, impresora especial de grabado en relieve u otro dispositivo. @es
has subproperty: P30438

has braille embosser person
status: Published
lexical alias: brailleEmbosserPerson.en
definition: Relates a manifestation to a person who is responsible for manufacturing a manifestation by embossing braille cells using a stylus, special embossing printer, or other device.
toolkit label: braille embosser person
toolkit definition: A person who is responsible for manufacturing a manifestation by embossing braille cells using a stylus, special embossing printer, or other device.
type: Property
domain: C10007
has element type: 2
sub property of: has manufacturer person
sub property of: has braille embosser agent
label: pistekirjoituksen tekijä (henkilö) @fi
definition: Liittää manifestaation henkilöön, joka on vastuussa manifestaation valmistamisesta tuottamalla pistekirjoitusmerkkejä piirtimen, erityistulostimen tai muun laitteen avulla. @fi
toolkit label: pistekirjoituksen tekijä (henkilö) @fi
toolkit definition: Henkilö, joka on vastuussa manifestaation valmistamisesta tuottamalla pistekirjoitusmerkkejä piirtimen, erityistulostimen tai muun laitteen avulla. @fi
label: har punktskriftpreger (person) @no
definition: Relaterer en manifestasjon til en person som er involvert i framstillingen av en manifestasjon ved å prege brailleceller ved hjelp av pren, punktskriftmaskin eller annen innretning. @no
toolkit label: punktskriftpreger (person) @no
toolkit definition: En person som er involvert i framstillingen av en manifestasjon ved å prege brailleceller ved hjelp av pren, punktskriftmaskin eller annen innretning. @no
label: a pour personne productrice braille @fr
definition: Met une manifestation en relation avec une personne qui est responsable de la fabrication d’une manifestation par l’embossage de cellules braille au moyen d’un poinçon, d’une imprimante spéciale ou d’un autre appareil. @fr
toolkit label: personne productrice braille @fr
toolkit definition: Personne qui est responsable de la fabrication d’une manifestation par l’embossage de cellules braille au moyen d’un poinçon, d’une imprimante spéciale ou d’un autre appareil. @fr
label: heeft brailleerder-persoon @nl
definition: Relateert een manifestatie aan een persoon die verantwoordelijk is voor het vervaardigen van een manifestatie middels het brailleren met gebruik van een stylus, een speciale stansmachine of ander hulpmiddel. @nl
toolkit label: brailleerder-persoon @nl
toolkit definition: Een persoon die verantwoordelijk is voor het vervaardigen van een manifestatie middels het brailleren met gebruik van een stylus, een speciale stansmachine of ander hulpmiddel. @nl
label: له شخص مجسد بطريقة برايل @ar
definition: يربط بين تجسيدة وشخص مسئول عن تصنيع تجسيدة بالطباعة بطريقة خلايا نقش برايل باستخدام قلم نقش، أو طابعة نقش خاصة، أو أي أداة أخرى. @ar
toolkit label: شخص مجسد بطريقة برايل @ar
toolkit definition: شخص مسئول عن تصنيع تجسيدة بالطباعة بطريقة خلايا نقش برايل باستخدام قلم نقش، أو طابعة نقش خاصة، أو أي أداة أخرى. @ar
label: té com a persona estampadora braille @ca
definition: Relaciona una manifestació amb una persona que és responsable de la fabricació d’una manifestació amb el repujat de punts braille amb un punxó, una impressora especial d’estampar o un altre mecanisme. @ca
toolkit label: persona estampadora braille @ca
toolkit definition: Persona que és responsable de la fabricació d’una manifestació amb el repujat de punts braille amb un punxó, una impressora especial d’estampar o un altre mecanisme. @ca
label: har person, som er punktskriftspræger @da
definition: Relaterer en manifestation til en person, som er involveret i fremstillingen af en manifestation ved at præge punktskriftsceller vha. en stift, særlig prægeprinter eller andet apparatur. @da
toolkit label: person, som er punktskriftspræger @da
toolkit definition: Person, som er involveret i fremstillingen af en manifestation ved at præge punktskriftsceller vha. en stift, særlig prægeprinter eller andet apparatur. @da
label: punktkirja kirjutaja (isik) @et
definition: Seostab kehastuse isikuga, kes osaleb kehastuse valmistamises, tehes punktkirjamärke spetsiaalse kirjutusvahendi, punktkirjaprinteri või muu seadmega. @et
toolkit label: punktkirja kirjutaja (isik) @et
toolkit definition: Isik, kes osaleb kehastuse valmistamises, tehes punktkirjamärke spetsiaalse kirjutusvahendi, punktkirjaprinteri või muu seadmega. @et
label: hat Brailleschriftprägerin/Brailleschriftpräger (Person) @de
definition: Setzt eine Manifestation in Beziehung zu einer Person, die für die Herstellung einer Manifestation in Form von Braillezeichen verantwortlich ist, indem sie einen Griffel, einen speziellen Brailledrucker oder ein anderes Gerät zum Prägen verwendet. @de
toolkit label: Brailleschriftprägerin/Brailleschriftpräger (Person) @de
toolkit definition: Eine Person, die für die Herstellung einer Manifestation in Form von Braillezeichen verantwortlich ist, indem sie einen Griffel, einen speziellen Brailledrucker oder ein anderes Gerät zum Prägen verwendet. @de
label: Braille-dombornyomó személye a következő: @hu
definition: Hozzákapcsol egy megjelenési formát egy személyhez, aki felelős egy megjelenési forma gyártásáért oly módon, hogy domborítja a Braille-cellákat íróvessző, speciális domborítónyomtató vagy más készülék használatával. @hu
toolkit label: Braille-dombornyomó személy: @hu
toolkit definition: Egy személy, aki felelős egy megjelenési forma gyártásáért oly módon, hogy domborítja a Braille-cellákat íróvessző, speciális domborítónyomtató vagy más készülék használatával. @hu
label: ha come goffratore braille persona @it
definition: Correla una manifestazione alla persona coinvolta nella manifattura di una manifestazione, tramite goffratura di celle braille, utilizzando uno stilo, una stampante speciale per goffratura, o altro dispositivo. @it
toolkit label: goffratore braille persona @it
toolkit definition: Persona coinvolta nella manifattura di una manifestazione, tramite goffratura di celle braille, utilizzando uno stilo, una stampante speciale per goffratura, o altro dispositivo. @it
label: Braila raksta iespiedējs (persona) @lv
definition: Sasaista manifestāciju ar personu, kura iesaistīta manifestācijas ražošanā, iespiežot Braila raksta matricas, izmantojot irbuli, īpašu ciļņa iespieduma printeri vai citu ierīci. @lv
toolkit label: Braila raksta iespiedējs (persona) @lv
toolkit definition: Persona, kura iesaistīta manifestācijas ražošanā, iespiežot Braila raksta matricas, izmantojot irbuli, īpašu ciļņa iespieduma printeri vai citu ierīci. @lv
label: 有布莱叶盲文点字制作者个人 @zh-hans
definition: 将一种载体表现与涉及通过使用刻写针、专门的压纹机或其他设备压印布莱叶盲文而对一种载体表现的生产负责的一个个人关联起来。 @zh-hans
toolkit label: 布莱叶盲文点字制作者个人 @zh-hans
toolkit definition: 涉及通过使用刻写针、专门的压纹机或其他设备压印布莱叶盲文而对一种载体表现的生产负责的一个个人 @zh-hans
label: braille kabartmacısı ile ilişkilidir @tr
definition: Bir gösterimi, kalem, özel kabartmalı yazıcı veya başka bir cihaz kullanarak braille hücrelerini kabartarak bir öğeyi üretmekten sorumlu olan bir kişiyle ilişkilendirir. @tr
toolkit label: braille kabartmacısı @tr
toolkit definition: Bir gösterimi, bir kalem, özel bir kabartma yazıcı veya başka bir cihaz kullanarak Braille hücrelerini kabartma yöntemiyle üretmekten sorumlu olan kişi. @tr
label: tiene persona impresora de braille @es
definition: Relaciona una manifestación con una persona que es responsable de fabricar una manifestación estampando celdas braille usando un lápiz óptico, una impresora especial de estampación u otro dispositivo. @es
toolkit label: persona impresora de braille @es
toolkit definition: Una persona que es responsable de fabricar una manifestación estampando celdas braille usando un lápiz óptico, una impresora especial de estampación u otro dispositivo. @es
has subproperty: P30351

has broadcaster agent
status: Published
definition: Relates a manifestation to an agent who is responsible for broadcasting a manifestation to an audience via radio, television, webcast, or other transmission media.
type: Property
domain: C10007
sub property of: has publisher agent
lexical alias: broadcasterAgent.en
toolkit label: broadcaster agent
toolkit definition: An agent who is responsible for broadcasting a manifestation to an audience via radio, television, webcast, or other transmission media.
label: a pour agent diffuseur audiovisuel @fr
definition: Met une manifestation en relation avec un agent qui est responsable de la diffusion d’une manifestation à un public par la radio, la télévision, la webdiffusion ou d’autres moyens de transmission. @fr
toolkit label: agent diffuseur audiovisuel @fr
toolkit definition: Agent qui est responsable de la diffusion d’une manifestation à un public par la radio, la télévision, la webdiffusion ou d’autres moyens de transmission. @fr
toolkit label: agente locutor @es
toolkit definition: Un agente que es responsable de transmitir una manifestación a una audiencia a través de radio, televisión, webcast u otros medios de transmisión. @es
instruction number: 18.5
toolkit label: uitzender-actor @nl
toolkit definition: Een actor die betrokken is bij het uitzenden van een manifestatie aan een publiek via radio, televisie, webcast of andere uitzendmedia. @nl
label: có người phát sóng @vi
definition: Liên kết biểu thị với tác nhân có liên quan tới phát sóng biểu thị tới khán giả qua truyền thanh, truyền hình, trên web, v.v... @vi
toolkit label: người phát sóng @vi
toolkit definition: Tác nhân có liên quan tới phát sóng biểu thị tới khán giả qua truyền thanh, truyền hình, trên web, v.v... @vi
label: har agent, som er broadcaster @da
definition: Relaterer en manifestation til en agent, som er involveret i transmissionen af en manifestation til et publikum via radio, tv, webcast etc. @da
toolkit label: agent, som er broadcaster @da
toolkit definition: Agent, som er involveret i transmissionen af en manifestation til et publikum via radio, tv, webcast etc. @da
label: hat Senderin/Sender (Akteur) @de
definition: Setzt eine Manifestation in Beziehung zu einem Akteur, der für die Ausstrahlung einer Manifestation über Hörfunk, Fernsehen oder Webcast oder andere Übertragungsmedien verantwortlich ist. @de
toolkit label: Senderin/Sender (Akteur) @de
toolkit definition: Ein Akteur, der für die Ausstrahlung einer Manifestation über Hörfunk, Fernsehen oder Webcast oder andere Übertragungsmedien verantwortlich ist. @de
label: té com a agent de difusió @ca
definition: Relaciona una manifestació amb un agent que és responsable de la difusió d’una manifestació a uns destinataris mitjançant la ràdio, la televisió, el web o un altre mitjà de transmissió. @ca
toolkit label: agent de difusió @ca
toolkit definition: Agent que és responsable de la difusió d’una manifestació a uns destinataris mitjançant la ràdio, la televisió, el web o un altre mitjà de transmissió. @ca
definition: Liittää manifestaation toimijaan, joka on vastuussa manifestaation lähettämisestä yleisölle radiossa, televisiossa, suoratoistolähetyksenä tai muuna lähetysmediana. @fi
toolkit label: lähetyksestä vastaava toimija @fi
toolkit definition: Toimija, joka on vastuussa manifestaation lähettämisestä yleisölle radiossa, televisiossa, suoratoistolähetyksenä tai muuna lähetysmediana. @fi
toolkit label: kringkaster (agent) @no
toolkit definition: En agent som er involvert i å kringkaste en manifestasjon til et publikum via radio, fjernsyn, webcast, etc. @no
label: έχει εκφωνητή @el
definition: Συνδέει μια εκδήλωση με έναν φορέα που εμπλέκεται στην εκπομπή μιας εκδήλωσης προς ένα ακροατήριο μέσω ραδιοφώνου, τηλεόρασης, διαδικτυακής μετάδοσης κ.λπ. @el
toolkit label: εκφωνητής @el
toolkit definition: Ένας φορέας που εμπλέκεται στην εκπομπή μιας εκδήλωσης προς ένα ακροατήριο μέσω ραδιοφώνου, τηλεόρασης, διαδικτυακής μετάδοσης κ.λπ. @el
has element type: 2
label: műsorszolgáltató ágense a következő: @hu
definition: Hozzákapcsol egy megjelenési formát egy ágenshez, amely egy megjelenési forma rádión, televízión, webközvetítésen, vagy egyéb adatátviteli médiumon keresztüli közönséghez történő műsorszórásáért felelős. @hu
toolkit label: műsorszolgáltató ágens: @hu
toolkit definition: Egy ágens, amely egy megjelenési forma rádión, televízión, webközvetítésen, vagy egyéb adatátviteli médiumon keresztüli közönséghez történő műsorszórásáért felelős. @hu
alternative label: broadcaster
alternative label: lähetyksestä vastaava @fi
label: lähetyksestä vastaava toimija @fi
label: har kringkaster (agent) @no
definition: Relaterer en manifestasjon til en agent som er involvert i å kringkaste en manifestasjon til et publikum via radio, fjernsyn, webcast, etc. @no
alternative label: kringkaster @no
alternative label: diffuseur audiovisuel @fr
label: heeft uitzender-actor @nl
definition: Relateert een manifestatie aan een actor die betrokken is bij het uitzenden van een manifestatie aan een publiek via radio, televisie, webcast of andere uitzendmedia. @nl
label: له وكيل مسئول بث @ar
definition: يربط بين تجسيدة ووكيل مسئول عن بث تجسيدة لجمهور ما عبر الإذاعة، أو التلفزيون، أو البث عبر الانترنت، إلخ. @ar
alternative label: مسئول بث @ar
toolkit label: وكيل مسئول بث @ar
toolkit definition: وكيل مسئول عن بث تجسيدة لجمهور ما عبر الإذاعة، أو التلفزيون، أو البث عبر الانترنت، إلخ. @ar
alternative label: entitat de difusió @ca
label: leviedastaja (tegija) @et
definition: Seostab kehastuse tegijaga, kes tegeleb kehastuse levitamisega avalikkusele raadio, televisiooni, veebi vms kaudu. @et
alternative label: leviedastaja @et
toolkit label: leviedastaja (tegija) @et
toolkit definition: Tegija, kes tegeleb kehastuse levitamisega avalikkusele raadio, televisiooni, veebi vms kaudu. @et
alternative label: műsorszolgáltató: @hu
label: ha come emittente agente @it
definition: Correla una manifestazione all'agente coinvolto nella trasmissione di una manifestazione a un pubblico via radio, televisione, webcast, etc. @it
alternative label: emittente @it
toolkit label: emittente agente @it
toolkit definition: Agente coinvolto nella trasmissione di una manifestazione a un pubblico via radio, televisione, webcast, etc. @it
label: raidorganizācija (aģents) @lv
definition: Sasaista manifestāciju ar aģentu, kas iesaistīts manifestācijas pārraidē, izmantojot radio, televīziju, tīmekļa apraidi u.tml. @lv
toolkit label: raidorganizācija (aģents) @lv
toolkit definition: Aģents, kas iesaistīts manifestācijas pārraidē, izmantojot radio, televīziju, tīmekļa apraidi u.tml. @lv
alternative label: Sender @de
alternative label: 广播者 @zh-hans
toolkit label: 广播者行为者 @zh-hans

has broadcaster collective agent
status: Published
lexical alias: broadcasterCollectiveAgent.en
definition: Relates a manifestation to a collective agent who is responsible for broadcasting a manifestation to an audience via radio, television, webcast, or other transmission media.
toolkit label: broadcaster collective agent
toolkit definition: A collective agent who is responsible for broadcasting a manifestation to an audience via radio, television, webcast, or other transmission media.
type: Property
domain: C10007
has element type: 2
sub property of: has publisher collective agent
sub property of: has broadcaster agent
label: lähetyksestä vastaava yhteistoimija @fi
definition: Liittää manifestaation yhteistoimijaan, joka on vastuussa manifestaation lähettämisestä yleisölle radiossa, televisiossa, suoratoistolähetyksenä tai muuna lähestysmediana. @fi
toolkit label: lähetyksestä vastaava yhteistoimija @fi
toolkit definition: Yhteistoimija, joka on vastuussa manifestaation lähettämisestä yleisölle radiossa, televisiossa, suoratoistolähetyksenä tai muuna lähetysmediana. @fi
label: har kringkaster (kollektiv agent) @no
definition: Relaterer en manifestasjon til en kollektiv agent som er involvert i å kringkaste en manifestasjon til et publikum via radio, fjernsyn, webcast, etc. @no
toolkit label: kringkaster (kollektiv agent) @no
toolkit definition: En kollektiv agent som er involvert i å kringkaste en manifestasjon til et publikum via radio, fjernsyn, webcast, etc. @no
label: a pour agent collectif diffuseur audiovisuel @fr
definition: Met une manifestation en relation avec un agent collectif qui est responsable de la diffusion d’une manifestation à un public par la radio, la télévision, la webdiffusion ou d’autres moyens de transmission. @fr
toolkit label: agent collectif diffuseur audiovisuel @fr
toolkit definition: Agent collectif qui est responsable de la diffusion d’une manifestation à un public par la radio, la télévision, la webdiffusion ou d’autres moyens de transmission. @fr
label: heeft uitzender-collectieve actor @nl
definition: Relateert een manifestatie aan een collectieve actor die verantwoordelijk is voor het uitzenden van een manifestatie aan een publiek via radio, televisie, webcast of andere uitzendmedia. @nl
toolkit label: uitzender-collectieve actor @nl
toolkit definition: Een collectieve actor die verantwoordelijk is voor het uitzenden van een manifestatie aan een publiek via radio, televisie, webcast of andere uitzendmedia. @nl
label: له وكيل جماعي مسئول بث @ar
definition: يربط بين تجسيدة ووكيل جماعي مسئول بث تجسيدة لجمهور ما عبر الإذاعة، أو التلفزيون، أو البث عبر الانترنت، إلخ. @ar
toolkit label: وكيل جماعي مسئول بث @ar
toolkit definition: وكيل جماعي مسئول بث تجسيدة لجمهور ما عبر الإذاعة، أو التلفزيون، أو البث عبر الانترنت، إلخ. @ar
label: té com a agent col·lectiu de difusió @ca
definition: Relaciona una manifestació amb un agent col·lectiu que és responsable de la difusió d’una manifestació a uns destinataris mitjançant la ràdio, la televisió, el web o un altre mitjà de transmissió. @ca
toolkit label: agent col·lectiu de difusió @ca
toolkit definition: Agent col·lectiu que és responsable de la difusió d’una manifestació a uns destinataris mitjançant la ràdio, la televisió, el web o un altre mitjà de transmissió. @ca
label: har kollektiv agent, som er broadcaster @da
definition: Relaterer en manifestation til en kollektiv agent, som er involveret i transmissionen af en manifestation til et publikum via radio, tv, webcast etc. @da
toolkit label: kollektiv agent, som er broadcaster @da
toolkit definition: Kollektiv agent, som er involveret i transmissionen af en manifestation til et publikum via radio, tv, webcast etc. @da
label: leviedastaja (kollektiiv) @et
definition: Seostab kehastuse kollektiiviga, kes tegeleb kehastuse levitamisega avalikkusele raadio, televisiooni, veebi vms kaudu. @et
toolkit label: leviedastaja (kollektiiv) @et
toolkit definition: Kollektiiv, kes tegeleb kehastuse levitamisega avalikkusele raadio, televisiooni, veebi vms kaudu. @et
label: hat Senderin/Sender (Gemeinschaftlicher Akteur) @de
definition: Setzt eine Manifestation in Beziehung zu einem gemeinschaftlichen Akteur, der für die Ausstrahlung einer Manifestation über Hörfunk, Fernsehen oder Webcast oder andere Übertragungsmedien verantwortlich ist. @de
toolkit label: Senderin/Sender (Gemeinschaftlicher Akteur) @de
toolkit definition: Ein gemeinschaftlichen Akteur, der für die Ausstrahlung einer Manifestation über Hörfunk, Fernsehen oder Webcast oder andere Übertragungsmedien verantwortlich ist. @de
label: műsorszolgáltató kollektív ágense a következő: @hu
definition: Hozzákapcsol egy megjelenési formát egy kollektív ágenshez, amely egy megjelenési forma rádión, televízión, webközvetítésen, vagy egyéb adatátviteli médiumon keresztüli közönséghez történő műsorszórásáért felelős. @hu
toolkit label: műsorszolgáltató kollektív ágens: @hu
toolkit definition: Egy kollektív ágens, amely egy megjelenési forma rádión, televízión, webközvetítésen, vagy egyéb adatátviteli médiumon keresztüli közönséghez történő műsorszórásáért felelős. @hu
label: ha come emittente agente collettivo @it
definition: Correla una manifestazione all'agente collettivo coinvolto nella trasmissione di una manifestazione a un pubblico via radio, televisione, web, etc. @it
toolkit label: emittente agente collettivo @it
toolkit definition: Agente collettivo coinvolto nella trasmissione di una manifestazione a un pubblico via radio, televisione, web, etc. @it
label: raidorganizācija (grupa) @lv
definition: Sasaista manifestāciju ar grupu, kas iesaistīta manifestācijas pārraidē, izmantojot radio, televīziju, tīmekļa apraidi u.tml. @lv
toolkit label: raidorganizācija (grupa) @lv
toolkit definition: Grupa, kas iesaistīta manifestācijas pārraidē, izmantojot radio, televīziju, tīmekļa apraidi u.tml. @lv
label: 有广播者集体行为者 @zh-hans
definition: 将一种载体表现与负责通过广播、电视、网络广播或其他传输媒介向受众广播载体表现的一个集体行为者关联起来。 @zh-hans
toolkit label: 广播者集体行为者 @zh-hans
toolkit definition: 负责通过广播、电视、网络广播或其他传输媒介向受众广播载体表现的一个集体行为者 @zh-hans
label: yayıncı kolektif temsilci ile ilişkilidir @tr
definition: Bir gösterimi radyo, televizyon, web yayını veya diğer iletim ortamları yoluyla bir izleyici kitlesine yayınlamaktan sorumlu kolektif bir temsilciyle ilişkilendirir. @tr
toolkit label: yayıncı kolektif temsilcisi @tr
toolkit definition: Radyo, televizyon, web yayını veya diğer iletim ortamları aracılığıyla bir kitleye bir gösterimi yayınlamaktan sorumlu kolektif bir temsilci. @tr
label: tiene agente colectivo de emisoras @es
definition: Relaciona una manifestación con un agente colectivo que es responsable de transmitir una manifestación a una audiencia vía radio, televisión, webcast u otros medios de transmisión. @es
toolkit label: agente colectivo de emisoras @es
toolkit definition: Un agente colectivo que es responsable de transmitir una manifestación a una audiencia vía radio, televisión, webcast u otros medios de transmisión. @es
has subproperty: has broadcaster corporate body
has subproperty: has broadcaster family
has subproperty: P30376

has broadcaster corporate body
status: Published
lexical alias: broadcasterCorporateBody.en
definition: Relates a manifestation to a corporate body who is responsible for broadcasting a manifestation to an audience via radio, television, webcast, or other transmission media.
toolkit label: broadcaster corporate body
toolkit definition: A corporate body who is responsible for broadcasting a manifestation to an audience via radio, television, webcast, or other transmission media.
type: Property
domain: C10007
has element type: 2
sub property of: has publisher corporate body
sub property of: has broadcaster collective agent
label: lähetyksestä vastaava yhteisö @fi
definition: Liittää manifestaation yhteisöön, joka on vastuussa manifestaation lähettämisestä yleisölle radiossa, televisiossa, suoratoistolähetyksenä tai muuna lähetysmediana. @fi
toolkit label: lähetyksestä vastaava yhteisö @fi
toolkit definition: Yhteisö, joka on vastuussa manifestaation lähettämisestä yleisölle radiossa, televisiossa, suoratoistolähetyksenä tai muuna lähetysmediana. @fi
label: har kringkaster (korporasjon) @no
definition: Relaterer en manifestasjon til en korporasjon som er involvert i å kringkaste en manifestasjon til et publikum via radio, fjernsyn, webcast, etc. @no
toolkit label: kringkaster (korporasjon) @no
toolkit definition: En korporasjon som er involvert i å kringkaste en manifestasjon til et publikum via radio, fjernsyn, webcast, etc. @no
label: a pour collectivité diffuseuse audiovisuelle @fr
definition: Met une manifestation en relation avec une collectivité qui est responsable de la diffusion d’une manifestation à un public par la radio, la télévision, la webdiffusion ou d’autres moyens de transmission. @fr
toolkit label: collectivité diffuseuse audiovisuelle @fr
toolkit definition: Collectivité qui est responsable de la diffusion d’une manifestation à un public par la radio, la télévision, la webdiffusion ou d’autres moyens de transmission. @fr
label: heeft uitzender-corporatie @nl
definition: Relateert een manifestatie aan een corporatie die verantwoordelijk is voor het uitzenden van een manifestatie aan een publiek via radio, televisie, webcast of andere uitzendmedia. @nl
toolkit label: uitzender-corporatie @nl
toolkit definition: Een corporatie die verantwoordelijk is voor het uitzenden van een manifestatie aan een publiek via radio, televisie, webcast of andere uitzendmedia. @nl
label: له هيئة مسئولة بث @ar
definition: يربط بين تجسيدة وهيئة مسئولة بث تجسيدة لجمهور ما عبر الإذاعة، أو التلفزيون، أو البث عبر الانترنت، إلخ. @ar
toolkit label: هيئة مسئولة بث @ar
toolkit definition: هيئة مسئولة بث تجسيدة لجمهور ما عبر الإذاعة، أو التلفزيون، أو البث عبر الانترنت، إلخ. @ar
label: té com a entitat corporativa de difusió @ca
definition: Relaciona una manifestació amb una entitat corporativa que és responsable de la difusió d’una manifestació a uns destinataris mitjançant la ràdio, la televisió, el web o un altre mitjà de transmissió. @ca
toolkit label: entitat corporativa de difusió @ca
toolkit definition: Entitat corporativa que és responsable de la difusió d’una manifestació a uns destinataris mitjançant la ràdio, la televisió, el web o un altre mitjà de transmissió. @ca
label: har korporation, som er broadcaster @da
definition: Relaterer en manifestation til en korporation, som er involveret i transmissionen af en manifestation til et publikum via radio, tv, webcast etc. @da
toolkit label: korporation, som er broadcaster @da
toolkit definition: Korporation, som er involveret i transmissionen af en manifestation til et publikum via radio, tv, webcast etc. @da
label: leviedastaja (asutus) @et
definition: Seostab kehastuse asutusega, kes tegeleb kehastuse levitamisega avalikkusele raadio, televisiooni, veebi vms kaudu. @et
toolkit label: leviedastaja (asutus) @et
toolkit definition: Asutus, kes tegeleb kehastuse levitamisega avalikkusele raadio, televisiooni, veebi vms kaudu. @et
label: hat Senderin/Sender (Körperschaft) @de
definition: Setzt eine Manifestation in Beziehung zu einer Körperschaft, die für die Ausstrahlung einer Manifestation über Hörfunk, Fernsehen oder Webcast oder andere Übertragungsmedien verantwortlich ist. @de
toolkit label: Senderin/Sender (Körperschaft) @de
toolkit definition: Eine Körperschaft, die für die Ausstrahlung einer Manifestation über Hörfunk, Fernsehen oder Webcast oder andere Übertragungsmedien verantwortlich ist. @de
label: műsorszolgáltató testülete a következő: @hu
definition: Hozzákapcsol egy megjelenési formát egy testülethez, amely egy megjelenési forma rádión, televízión, webközvetítésen, vagy egyéb adatátviteli médiumon keresztüli közönséghez történő műsorszórásáért felelős. @hu
toolkit label: műsorszolgáltató testület: @hu
toolkit definition: Egy testület, amely egy megjelenési forma rádión, televízión, webközvetítésen, vagy egyéb adatátviteli médiumon keresztüli közönséghez történő műsorszórásáért felelős. @hu
label: ha come emittente ente @it
definition: Correla una manifestazione all'ente coinvolto nella trasmissione di una manifestazione a un pubblico via radio, televisione, webcast, etc. @it
toolkit label: emittente ente @it
toolkit definition: Ente coinvolto nella trasmissione di una manifestazione a un pubblico via radio, televisione, web, etc. @it
label: raidorganizācija (institūcija) @lv
definition: Sasaista manifestāciju ar institūciju, kas iesaistīta manifestācijas pārraidē, izmantojot radio, televīziju, tīmekļa apraidi u.tml. @lv
toolkit label: raidorganizācija (institūcija) @lv
toolkit definition: Institūcija, kas iesaistīta manifestācijas pārraidē, izmantojot radio, televīziju, tīmekļa apraidi u.tml. @lv
label: 有广播者团体 @zh-hans
definition: 将一种载体表现与负责通过广播、电视、网络广播或其他传输媒介向受众广播载体表现的一个团体关联起来。 @zh-hans
toolkit label: 广播者团体 @zh-hans
toolkit definition: 负责通过广播、电视、网络广播或其他传输媒介向受众广播载体表现的一个团体 @zh-hans
label: yayıncı tüzel kişi ile ilişkilidir @tr
definition: Bir gösterimi, radyo, televizyon, web yayını veya diğer iletim ortamları yoluyla bir dinleyici kitlesine yayınlamaktan sorumlu olan bir tüzel kişiyle ilişkilendirir. @tr
toolkit label: yayıncı tüzel kişisi @tr
toolkit definition: Radyo, televizyon, web yayını veya diğer iletim ortamları aracılığıyla bir kitleye bir gösterimi yayınlamaktan sorumlu bir tüzel kişi. @tr
label: tiene cuerpo corporativo de radiodifusión @es
definition: Relaciona una manifestación con un cuerpo corporativo que es responsable de transmitir una manifestación a una audiencia a través de radio, televisión, webcast u otros medios de transmisión. @es
toolkit label: cuerpo corporativo de radiodifusión @es
toolkit definition: Un cuerpo corporativo que es responsable de transmitir una manifestación a una audiencia a través de radio, televisión, webcast u otros medios de transmisión. @es
has subproperty: P30405

has broadcaster family
status: Published
lexical alias: broadcasterFamily.en
definition: Relates a manifestation to a family who is responsible for broadcasting a manifestation to an audience via radio, television, webcast, or other transmission media.
toolkit label: broadcaster family
toolkit definition: A family who is responsible for broadcasting a manifestation to an audience via radio, television, webcast, or other transmission media.
type: Property
domain: C10007
has element type: 2
sub property of: has publisher family
sub property of: has broadcaster collective agent
label: lähetyksestä vastaava suku @fi
definition: Liittää manifestaation sukuun, joka on vastuussa manifestaation lähettämisestä yleisölle radiossa, televisiossa, suoratoistolähetyksenä tai muuna lähetysmediana. @fi
toolkit label: lähetyksestä vastaava suku @fi
toolkit definition: Suku, joka on vastuussa manifestaation lähettämisestä yleisölle radiossa, televisiossa, suoratoistolähetyksenä tai muuna lähetysmediana. @fi
label: har kringkaster (familie) @no
definition: Relaterer en manifestasjon til en familie som er involvert i å kringkaste en manifestasjon til et publikum via radio, fjernsyn, webcast, etc. @no
toolkit label: kringkaster (familie) @no
toolkit definition: En familie som er involvert i å kringkaste en manifestasjon til et publikum via radio, fjernsyn, webcast, etc. @no
label: a pour famille diffuseuse audiovisuelle @fr
definition: Met une manifestation en relation avec une famille qui est responsable de la diffusion d’une manifestation à un public par la radio, la télévision, la webdiffusion ou d’autres moyens de transmission. @fr
toolkit label: famille diffuseuse audiovisuelle @fr
toolkit definition: Famille qui est responsable de la diffusion d’une manifestation à un public par la radio, la télévision, la webdiffusion ou d’autres moyens de transmission. @fr
label: heeft uitzender-familie @nl
definition: Relateert een manifestatie aan een familie die verantwoordelijk is voor het uitzenden van een manifestatie aan een publiek via radio, televisie, webcast of andere uitzendmedia. @nl
toolkit label: uitzender-familie @nl
toolkit definition: Een familie die verantwoordelijk is voor het uitzenden van een manifestatie aan een publiek via radio, televisie, webcast of andere uitzendmedia. @nl
label: له عائلة مسئولة بث @ar
definition: يربط بين تجسيدة وعائلة مسئولة بث تجسيدة لجمهور ما عبر الإذاعة، أو التلفزيون، أو البث عبر الانترنت، إلخ. @ar
toolkit label: عائلة مسئولة بث @ar
toolkit definition: عائلة مسئولة بث تجسيدة لجمهور ما عبر الإذاعة، أو التلفزيون، أو البث عبر الانترنت، إلخ. @ar
label: té com a família de difusió @ca
definition: Relaciona una manifestació amb una família que és responsable de la difusió d’una manifestació a uns destinataris mitjançant la ràdio, la televisió, el web o un altre mitjà de transmissió. @ca
toolkit label: família de difusió @ca
toolkit definition: Família que és responsable de la difusió d’una manifestació a uns destinataris mitjançant la ràdio, la televisió, el web o un altre mitjà de transmissió. @ca
label: har familie, som er broadcaster @da
definition: Relaterer en manifestation til en familie, som er involveret i transmissionen af en manifestation til et publikum via radio, tv, webcast etc. @da
toolkit label: familie, som er broadcaster @da
toolkit definition: Familie, som er involveret i transmissionen af en manifestation til et publikum via radio, tv, webcast etc. @da
label: leviedastaja (perekond) @et
definition: Seostab kehastuse perekonnaga, kes tegeleb kehastuse levitamisega avalikkusele raadio, televisiooni, veebi vms kaudu. @et
toolkit label: leviedastaja (perekond) @et
toolkit definition: Perekond, kes tegeleb kehastuse levitamisega avalikkusele raadio, televisiooni, veebi vms kaudu. @et
label: hat Senderin/Sender (Familie) @de
definition: Setzt eine Manifestation in Beziehung zu einer Familie, die für die Ausstrahlung einer Manifestation über Hörfunk, Fernsehen oder Webcast oder andere Übertragungsmedien verantwortlich ist. @de
toolkit label: Senderin/Sender (Familie) @de
toolkit definition: Eine Familie, die für die Ausstrahlung einer Manifestation über Hörfunk, Fernsehen oder Webcast oder andere Übertragungsmedien verantwortlich ist. @de
label: műsorszolgáltató családja a következő: @hu
definition: Hozzákapcsol egy megjelenési formát egy családhoz, amely egy megjelenési forma rádión, televízión, webközvetítésen, vagy egyéb adatátviteli médiumon keresztüli közönséghez történő műsorszórásááért felelős. @hu
toolkit label: műsorszolgáltató család: @hu
toolkit definition: Egy család, amely egy megjelenési forma rádión, televízión, webközvetítésen, vagy egyéb adatátviteli médiumon keresztüli közönséghez történő műsorszórásááért felelős. @hu
label: ha come emittente famiglia @it
definition: Correla una manifestazione alla famiglia coinvolta nella trasmissione di una manifestazione a un pubblico via radio, televisione, web, etc. @it
toolkit label: emittente famiglia @it
toolkit definition: Famiglia coinvolta nella trasmissione di una manifestazione a un pubblico via radio, televisione, web, etc. @it
label: raidorganizācija (dzimta/ģimene) @lv
definition: Sasaista manifestāciju ar dzimtu/ģimeni, kas iesaistīta manifestācijas pārraidē, izmantojot radio, televīziju, tīmekļa apraidi u.tml. @lv
toolkit label: raidorganizācija (dzimta/ģimene) @lv
toolkit definition: Dzimta/ģimene, kas iesaistīta manifestācijas pārraidē, izmantojot radio, televīziju, tīmekļa apraidi u.tml. @lv
label: 有广播者家族 @zh-hans
definition: 将一种载体表现与负责通过广播、电视、网络广播或其他传输媒介向受众广播载体表现的一个家族关联起来。 @zh-hans
toolkit label: 广播者家族 @zh-hans
toolkit definition: 负责通过广播、电视、网络广播或其他传输媒介向受众广播载体表现的一个家族 @zh-hans
label: yayıncı aile ile ilişkilidir @tr
definition: Bir gösterimi; radyo, televizyon, internet canlı yayınları, veya diğer iletim ortamları sayesinde izleyicilere gösterim yayınlamaktan sorumlu aileyle ilişkilendirir. @tr
toolkit label: yayıncı ailesi @tr
toolkit definition: Radyo, televizyon, internet canlı yayınları, veya diğer iletim ortamları sayesinde izleyicilere gösterim yayınlamaktan sorumlu aile. @tr
label: tiene familia transmisora @es
definition: Relaciona una manifestación con una familia que es responsable de transmitir una manifestación a una audiencia vía radio, televisión, webcast u otros medios de transmisión. @es
toolkit label: familia transmisora @es
toolkit definition: Una familia que es responsable de transmitir una manifestación a una audiencia vía radio, televisión, webcast u otros medios de transmisión. @es
has subproperty: P30434

has broadcaster person
status: Published
lexical alias: broadcasterPerson.en
definition: Relates a manifestation to a person who is responsible for broadcasting a manifestation to an audience via radio, television, webcast, or other transmission media.
toolkit label: broadcaster person
toolkit definition: A person who is responsible for broadcasting a manifestation to an audience via radio, television, webcast, or other transmission media.
type: Property
domain: C10007
has element type: 2
sub property of: has publisher person
sub property of: has broadcaster agent
label: lähetyksestä vastaava henkilö @fi
definition: Liittää manifestaation henkilöön, joka on vastuussa manifestaation lähettämisestä yleisölle radiossa, televisiossa, suoratoistolähetyksenä tai muuna lähetysmediana. @fi
toolkit label: lähetyksestä vastaava henkilö @fi
toolkit definition: Henkilö, joka on vastuussa manifestaation lähettämisestä yleisölle radiossa, televisiossa, suoratoistolähetyksenä tai muuna lähetysmediana. @fi
label: har kringkaster (person) @no
definition: Relaterer en manifestasjon til en person som er involvert i å kringkaste en manifestasjon til et publikum via radio, fjernsyn, webcast, etc. @no
toolkit label: kringkaster (person) @no
toolkit definition: En person som er involvert i å kringkaste en manifestasjon til et publikum via radio, fjernsyn, webcast, etc. @no
label: a pour personne diffuseuse audiovisuelle @fr
definition: Met une manifestation en relation avec une personne qui est responsable de la diffusion d’une manifestation à un public par la radio, la télévision, la webdiffusion ou d’autres moyens de transmission. @fr
toolkit label: personne diffuseuse audiovisuelle @fr
toolkit definition: Personne qui est responsable de la diffusion d’une manifestation à un public par la radio, la télévision, la webdiffusion ou d’autres moyens de transmission. @fr
label: heeft uitzender-persoon @nl
definition: Relateert een manifestatie aan een persoon die verantwoordelijk is voor het uitzenden van een manifestatie aan een publiek via radio, televisie, webcast of andere uitzendmedia. @nl
toolkit label: uitzender-persoon @nl
toolkit definition: Een persoon die verantwoordelijk is voor het uitzenden van een manifestatie aan een publiek via radio, televisie, webcast of andere uitzendmedia. @nl
label: له شخص مسئول بث @ar
definition: يربط بين تجسيدة وشخص مسئول بث تجسيدة لجمهور ما عبر الإذاعة، أو التلفزيون، أو البث عبر الانترنت، إلخ. @ar
toolkit label: شخص مسئول بث @ar
toolkit definition: شخص مسئول بث تجسيدة لجمهور ما عبر الإذاعة، أو التلفزيون، أو البث عبر الانترنت، إلخ. @ar
label: té com a persona de difusió @ca
definition: Relaciona una manifestació amb una persona que és responsable de la difusió d’una manifestació a uns destinataris mitjançant la ràdio, la televisió, el web o un altre mitjà de transmissió. @ca
toolkit label: persona de difusió @ca
toolkit definition: Persona que és responsable de la difusió d’una manifestació a uns destinataris mitjançant la ràdio, la televisió, el web o un altre mitjà de transmissió. @ca
label: har person, som er broadcaster @da
definition: Relaterer en manifestation til en person, som er involveret i transmissionen af en manifestation til et publikum via radio, tv, webcast etc. @da
toolkit label: person, som er broadcaster @da
toolkit definition: Person, som er involveret i transmissionen af en manifestation til et publikum via radio, tv, webcast etc. @da
label: leviedastaja (isik) @et
definition: Seostab kehastuse isikuga, kes tegeleb kehastuse levitamisega avalikkusele raadio, televisiooni, veebi vms kaudu. @et
toolkit label: leviedastaja (isik) @et
toolkit definition: Isik, kes tegeleb kehastuse levitamisega avalikkusele raadio, televisiooni, veebi vms kaudu. @et
label: hat Senderin/Sender (Person) @de
definition: Setzt eine Manifestation in Beziehung zu einer Person, die für die Ausstrahlung einer Manifestation über Hörfunk, Fernsehen oder Webcast oder andere Übertragungsmedien verantwortlich ist. @de
toolkit label: Senderin/Sender (Person) @de
toolkit definition: Eine Person, die für die Ausstrahlung einer Manifestation über Hörfunk, Fernsehen oder Webcast oder andere Übertragungsmedien verantwortlich ist. @de
label: műsorszolgáltató személye a következő: @hu
definition: Hozzákapcsol egy megjelenési formát egy személyhez, aki egy megjelenési forma rádión, televízión, webközvetítésen, vagy egyéb adatátviteli médiumon keresztüli közönséghez történő műsorszórásáért felelős. @hu
toolkit label: műsorszolgáltató személy: @hu
toolkit definition: Egy személy, aki egy megjelenési forma rádión, televízión, webközvetítésen, vagy egyéb adatátviteli médiumon keresztüli közönséghez történő műsorszórásáért felelős. @hu
label: ha come emittente persona @it
definition: Correla una manifestazione alla persona coinvolta nella trasmissione di una manifestazione a un pubblico via radio, televisione, webcast, etc. @it
toolkit label: emittente persona @it
toolkit definition: Persona coinvolta nella trasmissione di una manifestazione a un pubblico via radio, televisione, webcast, etc. @it
label: raidorganizācija (persona) @lv
definition: Sasaista manifestāciju ar personu, kura iesaistīta manifestācijas pārraidē, izmantojot radio, televīziju, tīmekļa apraidi u.tml. @lv
toolkit label: raidorganizācija (persona) @lv
toolkit definition: Persona, kura iesaistīta manifestācijas pārraidē, izmantojot radio, televīziju, tīmekļa apraidi u.tml. @lv
label: 有广播者个人 @zh-hans
definition: 将一种载体表现与负责通过广播、电视、网络广播或其他传输媒介向受众广播载体表现的个人关联起来。 @zh-hans
toolkit label: 广播者个人 @zh-hans
toolkit definition: 负责通过广播、电视、网络广播或其他传输媒介向受众广播载体表现的个人 @zh-hans
label: yayıncı ile ilişkilidir @tr
definition: Bir gösterimi, radyo, televizyon, web yayını veya diğer iletim ortamları aracılığıyla bir izleyici kitlesine bir gösteriyi yayınlamaktan sorumlu olan bir kişiyle ilişkilendirir. @tr
toolkit label: yayıncı @tr
toolkit definition: Bir gösterimin radyo, televizyon, web yayını veya diğer iletim ortamları aracılığıyla bir izleyici kitlesine yayınlanmasından sorumlu olan kişi. @tr
label: tiene persona locutora @es
definition: Relaciona una manifestación con una persona que es responsable de transmitir una manifestación a una audiencia a través de radio, televisión, webcast u otros medios de transmisión. @es
toolkit label: persona locutora @es
toolkit definition: Una persona que es responsable de transmitir una manifestación a una audiencia a través de radio, televisión, webcast u otros medios de transmisión. @es
has subproperty: P30347

has caster agent
status: Published
definition: Relates a manifestation to an agent who is responsible for creating a manifestation by pouring a liquid or molten substance into a mold and leaving it to solidify to take the shape of the mold.
type: Property
domain: C10007
lexical alias: casterAgent.en
toolkit label: caster agent
toolkit definition: An agent who is responsible for creating a manifestation by pouring a liquid or molten substance into a mold and leaving it to solidify to take the shape of the mold.
label: a pour agent fondeur @fr
definition: Met une manifestation en relation avec un agent qui est responsable de la création d’une manifestation en versant un liquide ou une substance fondue dans un moule et en laissant ce liquide ou cette substance se solidifier pour prendre la forme du moule. @fr
toolkit label: agent fondeur @fr
toolkit definition: Agent qui est responsable de la création d’une manifestation en versant un liquide ou une substance fondue dans un moule et en laissant ce liquide ou cette substance se solidifier pour prendre la forme du moule. @fr
toolkit label: agente de lanzamiento @es
toolkit definition: Un agente que se encarga de crear una manifestación vertiendo un líquido o sustancia fundida en un molde y dejándolo solidificar para tomar la forma del molde. @es
instruction number: 18.5
toolkit label: gieter-actor @nl
toolkit definition: Een actor die verantwoordelijk is voor het creëren van een manifestatie middels het gieten van een vloeistof of gesmolten substantie in een mal en die te laten stollen in de vorm van die mal. @nl
label: có người đúc @vi
definition: Liên kết biểu thị với tác nhân có liên quan tới chế tạo biểu thị theo trách nhiệm rót chất lỏng hoặc nấu chảy vào khuôn và để đông đặc nhằm tạo hình dạng theo khuôn. @vi
toolkit label: người đúc @vi
toolkit definition: Tác nhân có liên quan tới chế tạo biểu thị theo trách nhiệm rót chất lỏng hoặc nấu chảy vào khuôn và để đông đặc nhằm tạo hình dạng theo khuôn. @vi
label: har agent, som er støber @da
definition: Relaterer en manifestation til en agent, som er involveret i fremstillingen af en manifestation ved at hælde en væske eller et varmt, flydende stof i en form og lade det størkne, så det tager facon efter formen. @da
toolkit label: agent, som er støber @da
toolkit definition: Agent, som er involveret i fremstillingen af en manifestation ved at hælde en væske eller et varmt, flydende stof i en form og lade det størkne, så det tager facon efter formen. @da
label: hat Formgießerin/Formgießer (Akteur) @de
definition: Setzt eine Manifestation in Beziehung zu einem Akteur, der für die Herstellung einer Manifestation verantwortlich ist, indem er eine Flüssigkeit oder eine geschmolzenen Substanz in eine Form gießt, die in der Gießform verbleibt, bis sie ausgehärtet ist. @de
toolkit label: Formgießerin/Formgießer (Akteur) @de
toolkit definition: Ein Akteur, der für die Herstellung einer Manifestation verantwortlich ist, indem er eine Flüssigkeit oder eine geschmolzenen Substanz in eine Form gießt, die in der Gießform verbleibt, bis sie ausgehärtet ist. @de
label: té com a agent emmotllador @ca
definition: Relaciona una manifestació amb un agent que és responsable de la creació d’una manifestació mitjançant l’abocament d’un líquid o una substància fosa en un motlle tot deixant que se solidifiqui perquè prengui la forma del motlle. @ca
toolkit label: agent emmotllador @ca
toolkit definition: Agent que és responsable de la creació d’una manifestació mitjançant l’abocament d’un líquid o una substància fosa en un motlle tot deixant que se solidifiqui perquè prengui la forma del motlle. @ca
definition: Liittää manifestaation toimijaan, joka on vastuussa manifestaation valmistamisesta muovaamalla sulatettua tai nestemäistä ainetta muotin avulla. @fi
toolkit label: valaja (toimija) @fi
toolkit definition: Toimija, joka on vastuussa manifestaation valmistamisesta muovaamalla sulatettua tai nestemäistä ainetta muotin avulla. @fi
toolkit label: støper (agent) @no
toolkit definition: En agent som er involvert i framstillingen av en manifestasjon ved å helle et flytende eller smeltet stoff i en støpeform og la det stivne i denne formen. @no
label: έχει χύτευση @el
definition: Συνδέει μια εκδήλωση με έναν φορέα που εμπλέκεται στην κατασκευή μιας εκδήλωσης μέσω της έκχυσης υγρής ή τηγμένης ουσίας αφήνοντάς την να στερεοποιηθεί για να πάρει το σχήμα του καλουπιού. @el
toolkit label: χύτευση @el
toolkit definition: Ένας φορέας ο οποίος εμπλέκεται στην κατασκευή μιας εκδήλωσης μέσω της έκχυσης υγρής ή τηγμένης ουσίας αφήνοντάς την να στερεοποιηθεί για να πάρει το σχήμα του καλουπιού. @el
has element type: 2
label: öntvénykészítő ágense a következő: @hu
definition: Hozzákapcsol egy megjelenési formát egy ágenshez, amely felelős egy megjelenési forma gyártásáért oly módon, hogy folyékony vagy olvasztott anyagot önt egy öntőformába és hagyja, hogy az megszilárduljon és az öntőforma formáját felvegye. @hu
toolkit label: öntvénykészítő ágens: @hu
toolkit definition: Egy ágens, amely felelős egy megjelenési forma gyártásáért oly módon, hogy folyékony vagy olvasztott anyagot önt egy öntőformába és hagyja, hogy az megszilárduljon és az öntőforma formáját felvegye. @hu
alternative label: caster
alternative label: valaja @fi
label: valaja (toimija) @fi
label: har støper (agent) @no
definition: Relaterer en manifestasjon til en agent som er involvert i framstillingen av en manifestasjon ved å helle et flytende eller smeltet stoff i en støpeform og la det stivne i denne formen. @no
alternative label: støper @no
alternative label: fondeur @fr
label: heeft gieter-actor @nl
definition: Relateert een manifestatie aan een actor die verantwoordelijk is voor het creëren van een manifestatie middels het gieten van een vloeistof of gesmolten substantie in een mal en die te laten stollen in de vorm van die mal. @nl
label: له وكيل صب @ar
definition: يربط بين تجسيدة ووكيل مسئول عن تصنيع تجسيدة بصب السائل أو المادة المذابة في القالب وتركه حتى يجف ليأخذ شكل القالب. @ar
alternative label: مسئول صب @ar
toolkit label: وكيل صب @ar
toolkit definition: وكيل مسئول عن تصنيع تجسيدة بصب السائل أو المادة المذابة في القالب وتركه حتى يجف ليأخذ شكل القالب. @ar
alternative label: emmotllador @ca
alternative label: støber @da
label: valaja (tegija) @et
definition: Seostab kehastuse tegijaga, kes osaleb kehastuse valmistamises, valades vedela või sulatatud materjali valuvormi, kus materjal tahkub, võttes valuvormi kuju. @et
toolkit label: valaja (tegija) @et
toolkit definition: Tegija, kes osaleb kehastuse valmistamises, valades vedela või sulatatud materjali valuvormi, kus materjal tahkub, võttes valuvormi kuju. @et
alternative label: öntvénykészítő: @hu
label: ha come fonditore agente @it
definition: Correla una manifestazione all'agente coinvolto nella manifattura di una manifestazione tramite il versamento di una sostanza liquida o fusa in uno stampo e lasciandola solidificare fino ad assumere la forma dello stampo. @it
alternative label: fonditore @it
toolkit label: fonditore agente @it
toolkit definition: Agente coinvolto nella manifattura di una manifestazione tramite il versamento di una sostanza liquida o fusa in uno stampo e lasciandola solidificare fino ad assumere la forma dello stampo. @it
label: lējējs (aģents) @lv
definition: Sasaista manifestāciju ar aģentu, kas iesaistīts manifestācijas ražošanā, lejot veidnē šķidru vai izkausētu vielu un atstājot to sacietēt, lai tā iegūtu veidnes formu. @lv
toolkit label: lējējs (aģents) @lv
toolkit definition: Aģents, kas iesaistīts manifestācijas ražošanā, lejot veidnē šķidru vai izkausētu vielu un atstājot to sacietēt, lai tā iegūtu veidnes formu. @lv
sub property of: has creator agent of manifestation
alternative label: Formgießer @de
alternative label: 铸造者 @zh-hans
toolkit label: 铸造者行为者 @zh-hans

has caster collective agent
status: Published
lexical alias: casterCollectiveAgent.en
definition: Relates a manifestation to a collective agent who is responsible for creating a manifestation by pouring a liquid or molten substance into a mold and leaving it to solidify to take the shape of the mold.
toolkit label: caster collective agent
toolkit definition: A collective agent who is responsible for creating a manifestation by pouring a liquid or molten substance into a mold and leaving it to solidify to take the shape of the mold.
type: Property
domain: C10007
has element type: 2
sub property of: has caster agent
label: valaja (yhteistoimija) @fi
definition: Liittää manifestaation yhteistoimijaan, joka on vastuussa manifestaation valmistamisesta muovaamalla sulatettua tai nestemäistä ainetta muotin avulla. @fi
toolkit label: valaja (yhteistoimija) @fi
toolkit definition: Yhteistoimija, joka on vastuussa manifestaation valmistamisesta muovaamalla sulatettua tai nestemäistä ainetta muotin avulla. @fi
label: har støper (kollektiv agent) @no
definition: Relaterer en manifestasjon til en kollektiv agent som er involvert i framstillingen av en manifestasjon ved å helle et flytende eller smeltet stoff i en støpeform og la det stivne i denne formen. @no
toolkit label: støper (kollektiv agent) @no
toolkit definition: En kollektiv agent som er involvert i framstillingen av en manifestasjon ved å helle et flytende eller smeltet stoff i en støpeform og la det stivne i denne formen. @no
label: a pour agent collectif fondeur @fr
definition: Met une manifestation en relation avec un agent collectif qui est responsable de la création d’une manifestation en versant un liquide ou une substance fondue dans un moule et en laissant ce liquide ou cette substance se solidifier pour prendre la forme du moule. @fr
toolkit label: agent collectif fondeur @fr
toolkit definition: Agent collectif qui est responsable de la création d’une manifestation en versant un liquide ou une substance fondue dans un moule et en laissant ce liquide ou cette substance se solidifier pour prendre la forme du moule. @fr
label: heeft gieter-collectieve actor @nl
definition: Relateert een manifestatie aan een collectieve actor die verantwoordelijk is voor het creëren van een manifestatie middels het gieten van een vloeistof of gesmolten substantie in een mal en die te laten stollen in de vorm van die mal. @nl
toolkit label: gieter-collectieve actor @nl
toolkit definition: Een collectieve actor die verantwoordelijk is voor het creëren van een manifestatie middels het gieten van een vloeistof of gesmolten substantie in een mal en die te laten stollen in de vorm van die mal. @nl
label: له وكيل جماعي مسئول عن الصب @ar
definition: يربط بين تجسيدة ووكيل جماعي مسئول عن تصنيع تجسيدة بصب السائل أو المادة المذابة في القالب وتركه حتى يجف ليأخذ شكل القالب. @ar
toolkit label: وكيل جماعي مسئول عن الصب @ar
toolkit definition: وكيل جماعي مسئول عن تصنيع تجسيدة بصب السائل أو المادة المذابة في القالب وتركه حتى يجف ليأخذ شكل القالب. @ar
label: té com a agent col·lectiu emmotllador @ca
definition: Relaciona una manifestació amb un agent col·lectiu que és responsable de la creació d’una manifestació mitjançant l’abocament d’un líquid o una substància fosa en un motlle tot deixant que se solidifiqui perquè prengui la forma del motlle. @ca
toolkit label: agent col·lectiu emmotllador @ca
toolkit definition: Agent col·lectiu que és responsable de la creació d’una manifestació mitjançant l’abocament d’un líquid o una substància fosa en un motlle tot deixant que se solidifiqui perquè prengui la forma del motlle. @ca
label: har kollektiv agent, som er støber @da
definition: Relaterer en manifestation til en kollektiv agent, som er involveret i fremstillingen af en manifestation ved at hælde en væske eller et varmt, flydende stof i en form og lade det størkne, så det tager facon efter formen. @da
toolkit label: kollektiv agent, som er støber @da
toolkit definition: Kollektiv agent, som er involveret i fremstillingen af en manifestation ved at hælde en væske eller et varmt, flydende stof i en form og lade det størkne, så det tager facon efter formen. @da
label: valaja (kollektiiv) @et
definition: Seostab kehastuse kollektiiviga, kes osaleb kehastuse valmistamises, valades vedela või sulatatud materjali valuvormi, kus materjal tahkub, võttes valuvormi kuju. @et
toolkit label: valaja (kollektiiv) @et
toolkit definition: Kollektiiv, kes osaleb kehastuse valmistamises, valades vedela või sulatatud materjali valuvormi, kus materjal tahkub, võttes valuvormi kuju. @et
label: hat Formgießerin/Formgießer (Gemeinschaftlicher Akteur) @de
definition: Setzt eine Manifestation in Beziehung zu einem gemeinschaftlichen Akteur, der für die Herstellung einer Manifestation verantwortlich ist, indem er eine Flüssigkeit oder eine geschmolzenen Substanz in eine Form gießt, die in der Gießform verbleibt, bis sie ausgehärtet ist. @de
toolkit label: Formgießerin/Formgießer (Gemeinschaftlicher Akteur) @de
toolkit definition: Ein gemeinschaftlicher Akteur, der für die Herstellung einer Manifestation verantwortlich ist, indem er eine Flüssigkeit oder eine geschmolzenen Substanz in eine Form gießt, die in der Gießform verbleibt, bis sie ausgehärtet ist. @de
label: öntvénykészítő kollektív ágense a következő: @hu
definition: Hozzákapcsol egy megjelenési formát egy kollektív ágenshez, amely felelős egy megjelenési forma gyártásáért oly módon, hogy folyékony vagy olvasztott anyagot önt egy öntőformába és hagyja, hogy az megszilárduljon és az öntőforma formáját felvegye. @hu
toolkit label: öntvénykészítő kollektív ágens: @hu
toolkit definition: Egy kollektív ágens, amely felelős egy megjelenési forma gyártásáért oly módon, hogy folyékony vagy olvasztott anyagot önt egy öntőformába és hagyja, hogy az megszilárduljon és az öntőforma formáját felvegye. @hu
label: ha come fonditore agente collettivo @it
definition: Correla una manifestazione all'agente collettivo coinvolto nella manifattura di una manifestazione tramite il versamento di una sostanza liquida o fusa in uno stampo e lasciandola solidificare fino ad assumere la forma dello stampo. @it
toolkit label: fonditore agente collettivo @it
toolkit definition: Agente collettivo coinvolto nella manifattura di una manifestazione tramite il versamento di una sostanza liquida o fusa in uno stampo e lasciandola solidificare fino ad assumere la forma dello stampo. @it
label: lējējs (grupa) @lv
definition: Sasaista manifestāciju ar grupu, kas iesaistīta manifestācijas ražošanā, lejot veidnē šķidru vai izkausētu vielu un atstājot to sacietēt, lai tā iegūtu veidnes formu. @lv
toolkit label: lējējs (grupa) @lv
toolkit definition: Grupa, kas iesaistīta manifestācijas ražošanā, lejot veidnē šķidru vai izkausētu vielu un atstājot to sacietēt, lai tā iegūtu veidnes formu. @lv
sub property of: has creator collective agent of manifestation
label: 有铸造者集体行为者 @zh-hans
definition: 将一种载体表现与通过将液体或融化的物质倒入模具中使其按模具固化成型而对一种载体表现的创建负责的一个集体行为者关联起来。 @zh-hans
toolkit label: 铸造者集体行为者 @zh-hans
toolkit definition: 通过将液体或融化的物质倒入模具中使其按模具固化成型而对一种载体表现的创建负责的一个集体行为者 @zh-hans
label: dökümcü kolektif temsilci ile ilişkilidir @tr
definition: Bir gösterimi, sıvı veya erimiş bir maddeyi bir kalıba dökerek ve kalıbın şeklini alması için katılaşmaya bırakarak bir gösterim yaratmaktan sorumlu olan kolektif bir temsilciyle ilişkilendirir. @tr
toolkit label: dökümcü kolektif temsilcisi @tr
toolkit definition: Sıvı veya erimiş bir maddeyi bir kalıba dökerek ve kalıbın şeklini alması için katılaşmaya bırakarak bir gösterim yaratmaktan sorumlu kolektif bir temsilci. @tr
label: tiene agente colectivo lanzador @es
definition: Relaciona una manifestación con un agente colectivo que es responsable de crear una manifestación vertiendo un líquido o sustancia fundida en un molde y dejándolo solidificar para tomar la forma del molde. @es
toolkit label: agente colectivo lanzador @es
toolkit definition: Un agente colectivo que es responsable de crear una manifestación vertiendo un líquido o sustancia fundida en un molde y dejándolo solidificar para tomar la forma del molde. @es
has subproperty: has caster corporate body
has subproperty: has caster family
has subproperty: P30382

has caster corporate body
status: Published
lexical alias: casterCorporateBody.en
definition: Relates a manifestation to a corporate body who is responsible for creating a manifestation by pouring a liquid or molten substance into a mold and leaving it to solidify to take the shape of the mold.
toolkit label: caster corporate body
toolkit definition: A corporate body who is responsible for creating a manifestation by pouring a liquid or molten substance into a mold and leaving it to solidify to take the shape of the mold.
type: Property
domain: C10007
has element type: 2
sub property of: has caster collective agent
label: valaja (yhteisö) @fi
definition: Liittää manifestaation yhteisöön, joka on vastuussa manifestaation valmistamisesta muovaamalla sulatettua tai nestemäistä ainetta muotin avulla. @fi
toolkit label: valaja (yhteisö) @fi
toolkit definition: Yhteisö, joka on vastuussa manifestaation valmistamisesta muovaamalla sulatettua tai nestemäistä ainetta muotin avulla. @fi
label: har støper (korporasjon) @no
definition: Relaterer en manifestasjon til en korporasjon som er involvert i framstillingen av en manifestasjon ved å helle et flytende eller smeltet stoff i en støpeform og la det stivne i denne formen. @no
toolkit label: støper (korporasjon) @no
toolkit definition: En korporasjon som er involvert i framstillingen av en manifestasjon ved å helle et flytende eller smeltet stoff i en støpeform og la det stivne i denne formen. @no
label: a pour collectivité fondeuse @fr
definition: Met une manifestation en relation avec une collectivité qui est responsable de la création d’une manifestation en versant un liquide ou une substance fondue dans un moule et en laissant ce liquide ou cette substance se solidifier pour prendre la forme du moule. @fr
toolkit label: collectivité fondeuse @fr
toolkit definition: Collectivité qui est responsable de la création d’une manifestation en versant un liquide ou une substance fondue dans un moule et en laissant ce liquide ou cette substance se solidifier pour prendre la forme du moule. @fr
label: heeft gieter-corporatie @nl
definition: Relateert een manifestatie aan een corporatie die verantwoordelijk is voor het creëren van een manifestatie middels het gieten van een vloeistof of gesmolten substantie in een mal en die te laten stollen in de vorm van die mal. @nl
toolkit label: gieter-corporatie @nl
toolkit definition: Een corporatie die verantwoordelijk is voor het creëren van een manifestatie middels het gieten van een vloeistof of gesmolten substantie in een mal en die te laten stollen in de vorm van die mal. @nl
label: له هيئة مسئولة عن الصب @ar
definition: يربط بين تجسيدة وهيئة مسئولة عن تصنيع تجسيدة بصب السائل أو المادة المذابة في القالب وتركه حتى يجف ليأخذ شكل القالب. @ar
toolkit label: هيئة مسئولة عن الصب @ar
toolkit definition: هيئة مسئولة عن تصنيع تجسيدة بصب السائل أو المادة المذابة في القالب وتركه حتى يجف ليأخذ شكل القالب. @ar
label: té com a entitat corporativa emmotlladora @ca
definition: Relaciona una manifestació amb una entitat corporativa que és responsable de la creació d’una manifestació amb l’abocament d’un líquid o una substància fosa en un motlle tot deixant que se solidifiqui perquè prengui la forma del motlle. @ca
toolkit label: entitat corporativa emmotlladora @ca
toolkit definition: Entitat corporativa que és responsable de la creació d’una manifestació amb l’abocament d’un líquid o una substància fosa en un motlle tot deixant que se solidifiqui perquè prengui la forma del motlle. @ca
label: har korporation, som er støber @da
definition: Relaterer en manifestation til en korporation, som er involveret i fremstillingen af en manifestation ved at hælde en væske eller et varmt, flydende stof i en form og lade det størkne, så det tager facon efter formen. @da
toolkit label: korporation, som er støber @da
toolkit definition: Korporation, som er involveret i fremstillingen af en manifestation ved at hælde en væske eller et varmt, flydende stof i en form og lade det størkne, så det tager facon efter formen. @da
label: valaja (asutus) @et
definition: Seostab kehastuse asutusega, kes osaleb kehastuse valmistamises, valades vedela või sulatatud materjali valuvormi, kus materjal tahkub, võttes valuvormi kuju. @et
toolkit label: valaja (asutus) @et
toolkit definition: Asutus, kes osaleb kehastuse valmistamises, valades vedela või sulatatud materjali valuvormi, kus materjal tahkub, võttes valuvormi kuju. @et
label: hat Formgießerin/Formgießer (Körperschaft) @de
definition: Setzt eine Manifestation in Beziehung zu einer Körperschaft, die für die Herstellung einer Manifestation verantwortlich ist, indem sie eine Flüssigkeit oder eine geschmolzenen Substanz in eine Form gießt, die in der Gießform verbleibt, bis sie ausgehärtet ist. @de
toolkit label: Formgießerin/Formgießer (Körperschaft) @de
toolkit definition: Eine Körperschaft, die für die Herstellung einer Manifestation verantwortlich ist, indem sie eine Flüssigkeit oder eine geschmolzenen Substanz in eine Form gießt, die in der Gießform verbleibt, bis sie ausgehärtet ist. @de
label: öntvénykészítő testülete a következő: @hu
definition: Hozzákapcsol egy megjelenési formát egy testülethez, amely felelős egy megjelenési forma gyártásáért oly módon, hogy folyékony vagy olvasztott anyagot önt egy öntőformába és hagyja, hogy az megszilárduljon és az öntőforma formáját felvegye. @hu
toolkit label: öntvénykészítő testület: @hu
toolkit definition: Egy testület, amely felelős egy megjelenési forma gyártásáért oly módon, hogy folyékony vagy olvasztott anyagot önt egy öntőformába és hagyja, hogy az megszilárduljon és az öntőforma formáját felvegye. @hu
label: ha come fonditore ente @it
definition: Correla una manifestazione all'ente coinvolto nella manifattura di una manifestazione, tramite il versamento di una sostanza liquida o fusa in uno stampo e lasciandola solidificare fino ad assumere la forma dello stampo. @it
toolkit label: fonditore ente @it
toolkit definition: Ente coinvolto nella manifattura di una manifestazione, tramite il versamento di una sostanza liquida o fusa in uno stampo e lasciandola solidificare fino ad assumere la forma dello stampo. @it
label: lējējs (institūcija) @lv
definition: Sasaista manifestāciju ar institūciju, kas iesaistīta manifestācijas ražošanā, lejot veidnē šķidru vai izkausētu vielu un atstājot to sacietēt, lai tā iegūtu veidnes formu. @lv
toolkit label: lējējs (institūcija) @lv
toolkit definition: Institūcija, kas iesaistīta manifestācijas ražošanā, lejot veidnē šķidru vai izkausētu vielu un atstājot to sacietēt, lai tā iegūtu veidnes formu. @lv
sub property of: has creator corporate body of manifestation
label: 有铸造者团体 @zh-hans
definition: 将一种载体表现与通过将液体或融化的物质倒入模具中使其按模具固化成型而对一种载体表现的创建负责的一个团体关联起来。 @zh-hans
toolkit label: 铸造者团体 @zh-hans
toolkit definition: 通过将液体或融化的物质倒入模具中使其按模具固化成型而对一种载体表现的创建负责的一个团体 @zh-hans
label: dökümcü tüzel kişi ile ilişkilidir @tr
definition: Bir gösterimi, sıvı veya erimiş bir maddeyi bir kalıba dökerek ve kalıbın şeklini alması için katılaşmaya bırakarak gösterim yaratmakla yükümlü olan bir tüzel kişi ile ilişkilendirir. @tr
toolkit label: dökümcü tüzel kişisi @tr
toolkit definition: Sıvı veya erimiş bir maddeyi bir kalıba döküp, kalıbın şeklini alması için katılaşmaya bırakarak gösterim yaratmakla görevli tüzel kişi. @tr
label: tiene cuerpo corporativo lanzador @es
definition: Relaciona una manifestación con un cuerpo corporativo que es responsable de crear una manifestación vertiendo un líquido o sustancia fundida en un molde y dejándolo solidificar para tomar la forma del molde. @es
toolkit label: cuerpo corporativo lanzador @es
toolkit definition: Un cuerpo corporativo que es responsable de crear una manifestación vertiendo un líquido o sustancia fundida en un molde y dejándolo solidificar para tomar la forma del molde. @es
has subproperty: P30411

has caster family
status: Published
lexical alias: casterFamily.en
definition: Relates a manifestation to a family who is responsible for creating a manifestation by pouring a liquid or molten substance into a mold and leaving it to solidify to take the shape of the mold.
toolkit label: caster family
toolkit definition: A family who is responsible for creating a manifestation by pouring a liquid or molten substance into a mold and leaving it to solidify to take the shape of the mold.
type: Property
domain: C10007
has element type: 2
sub property of: has caster collective agent
label: valaja (suku) @fi
definition: Liittää manifestaation sukuun, joka on vastuussa manifestaation valmistamisesta muovaamalla sulatettua tai nestemäistä ainetta muotin avulla. @fi
toolkit label: valaja (suku) @fi
toolkit definition: Suku, joka on vastuussa manifestaation valmistamisesta muovaamalla sulatettua tai nestemäistä ainetta muotin avulla. @fi
label: har støper (familie) @no
definition: Relaterer en manifestasjon til en familie som er involvert i framstillingen av en manifestasjon ved å helle et flytende eller smeltet stoff i en støpeform og la det stivne i denne formen. @no
toolkit label: støper (familie) @no
toolkit definition: En familie som er involvert i framstillingen av en manifestasjon ved å helle et flytende eller smeltet stoff i en støpeform og la det stivne i denne formen. @no
label: a pour famille fondeuse @fr
definition: Met une manifestation en relation avec une famille qui est responsable de la création d’une manifestation en versant un liquide ou une substance fondue dans un moule et en laissant ce liquide ou cette substance se solidifier pour prendre la forme du moule. @fr
toolkit label: famille fondeuse @fr
toolkit definition: Famille qui est responsable de la création d’une manifestation en versant un liquide ou une substance fondue dans un moule et en laissant ce liquide ou cette substance se solidifier pour prendre la forme du moule. @fr
label: heeft gieter-familie @nl
definition: Relateert een manifestatie aan een familie die verantwoordelijk is voor het creëren van een manifestatie middels het gieten van een vloeistof of gesmolten substantie in een mal en die te laten stollen in de vorm van die mal. @nl
toolkit label: gieter-familie @nl
toolkit definition: Een familie die verantwoordelijk is voor het creëren van een manifestatie middels het gieten van een vloeistof of gesmolten substantie in een mal en die te laten stollen in de vorm van die mal. @nl
label: له عائلة مسئولة عن الصب @ar
definition: يربط بين تجسيدة وعائلة مسئولة عن تصنيع تجسيدة بصب السائل أو المادة المذابة في القالب وتركه حتى يجف ليأخذ شكل القالب. @ar
toolkit label: عائلة مسئولة عن الصب @ar
toolkit definition: عائلة مسئولة عن تصنيع تجسيدة بصب السائل أو المادة المذابة في القالب وتركه حتى يجف ليأخذ شكل القالب. @ar
label: té com a família emmotlladora @ca
definition: Relaciona una manifestació amb una família que és responsable de la creació d’una manifestació mitjançant l’abocament d’un líquid o una substància fosa en un motlle tot deixant que se solidifiqui perquè prengui la forma del motlle. @ca
toolkit label: família emmotlladora @ca
toolkit definition: Família que és responsable de la creació d’una manifestació mitjançant l’abocament d’un líquid o una substància fosa en un motlle tot deixant que se solidifiqui perquè prengui la forma del motlle. @ca
label: har familie, som er støber @da
definition: Relaterer en manifestation til en familie, som er involveret i fremstillingen af en manifestation ved at hælde en væske eller et varmt, flydende stof i en form og lade det størkne, så det tager facon efter formen. @da
toolkit label: familie, som er støber @da
toolkit definition: Familie, som er involveret i fremstillingen af en manifestation ved at hælde en væske eller et varmt, flydende stof i en form og lade det størkne, så det tager facon efter formen. @da
label: valaja (perekond) @et
definition: Seostab kehastuse perekonnaga, kes osaleb kehastuse valmistamises, valades vedela või sulatatud materjali valuvormi, kus materjal tahkub, võttes valuvormi kuju. @et
toolkit label: valaja (perekond) @et
toolkit definition: Perekond, kes osaleb kehastuse valmistamises, valades vedela või sulatatud materjali valuvormi, kus materjal tahkub, võttes valuvormi kuju. @et
label: hat Formgießerin/Formgießer (Familie) @de
definition: Setzt eine Manifestation in Beziehung zu einer Familie, die für die Herstellung einer Manifestation verantwortlich ist, indem sie eine Flüssigkeit oder eine geschmolzenen Substanz in eine Form gießt, die in der Gießform verbleibt, bis sie ausgehärtet ist. @de
toolkit label: Formgießerin/Formgießer (Familie) @de
toolkit definition: Eine Familie, die für die Herstellung einer Manifestation verantwortlich ist, indem sie eine Flüssigkeit oder eine geschmolzenen Substanz in eine Form gießt, die in der Gießform verbleibt, bis sie ausgehärtet ist. @de
label: öntvénykészítő családja a következő: @hu
definition: Hozzákapcsol egy megjelenési formát egy családhoz, amely felelős egy megjelenési forma gyártásáért oly módon, hogy folyékony vagy olvasztott anyagot önt egy öntőformába és hagyja, hogy az megszilárduljon és az öntőforma formáját felvegye. @hu
toolkit label: öntvénykészítő család: @hu
toolkit definition: Egy család, amely felelős egy megjelenési forma gyártásáért oly módon, hogy folyékony vagy olvasztott anyagot önt egy öntőformába és hagyja, hogy az megszilárduljon és az öntőforma formáját felvegye. @hu
label: ha come fonditore famiglia @it
definition: Correla una manifestazione alla famiglia coinvolta nella manifattura di una manifestazione tramite il versamento di una sostanza liquida o fusa in uno stampo e lasciandola solidificare fino ad assumere la forma dello stampo. @it
toolkit label: fonditore famiglia @it
toolkit definition: Famiglia coinvolta nella manifattura di una manifestazione, tramite il versamento di una sostanza liquida o fusa in uno stampo e lasciandola solidificare fino ad assumere la forma dello stampo. @it
label: lējējs (dzimta/ģimene) @lv
definition: Sasaista manifestāciju ar dzimtu/ģimeni, kas iesaistīta manifestācijas ražošanā, lejot veidnē šķidru vai izkausētu vielu un atstājot to sacietēt, lai tā iegūtu veidnes formu. @lv
toolkit label: lējējs (dzimta/ģimene) @lv
toolkit definition: Dzimta/ģimene, kas iesaistīta manifestācijas ražošanā, lejot veidnē šķidru vai izkausētu vielu un atstājot to sacietēt, lai tā iegūtu veidnes formu. @lv
sub property of: has creator family of manifestation
label: 有铸造者家族 @zh-hans
definition: 将一种载体表现与通过将液体或融化的物质倒入模具中使其按模具固化成型而对一种载体表现的创建负责的一个家族关联起来。 @zh-hans
toolkit label: 铸造者家族 @zh-hans
toolkit definition: 通过将液体或融化的物质倒入模具中使其按模具固化成型而对一种载体表现的创建负责的一个家族 @zh-hans
label: dökümcü aile ile ilişkilidir @tr
definition: Bir gösterimi, sıvı veya eritilmiş maddeyi bir kalıba dökerek ve kalıbın şeklini alması için katılaşmaya bırakarak bir gösterim yaratmakla sorumlu aileyle ilişkilendirir. @tr
toolkit label: dökümcü ailesi @tr
toolkit definition: Sıvı veya eritilmiş maddeyi bir kalıba dökerek ve kalıbın şeklini alması için katılaşmaya bırakarak bir gösterim yaratmakla sorumlu aile. @tr
label: tiene familia fundidora @es
definition: Relaciona una manifestación con una familia que es responsable de crear una manifestación al verter un líquido o sustancia fundida en un molde y dejar que se solidifique para que tome la forma del molde. @es
toolkit label: familia fundidora @es
toolkit definition: Una familia que es responsable de crear una manifestación al verter un líquido o sustancia fundida en un molde y dejar que se solidifique para que tome la forma del molde. @es
has subproperty: P30440

has caster person
status: Published
lexical alias: casterPerson.en
definition: Relates a manifestation to a person who is responsible for creating a manifestation by pouring a liquid or molten substance into a mold and leaving it to solidify to take the shape of the mold.
toolkit label: caster person
toolkit definition: A person who is responsible for creating a manifestation by pouring a liquid or molten substance into a mold and leaving it to solidify to take the shape of the mold.
type: Property
domain: C10007
has element type: 2
sub property of: has caster agent
label: valaja (henkilö) @fi
definition: Liittää manifestaation henkilöön, joka on vastuussa manifestaation valmistamisesta muovaamalla sulatettua tai nestemäistä ainetta muotin avulla. @fi
toolkit label: valaja (henkilö) @fi
toolkit definition: Henkilö, joka on vastuussa manifestaation valmistamisesta muovaamalla sulatettua tai nestemäistä ainetta muotin avulla. @fi
label: har støper (person) @no
definition: Relaterer en manifestasjon til en person som er involvert i framstillingen av en manifestasjon ved å helle et flytende eller smeltet stoff i en støpeform og la det stivne i denne formen. @no
toolkit label: støper (person) @no
toolkit definition: En person som er involvert i framstillingen av en manifestasjon ved å helle et flytende eller smeltet stoff i en støpeform og la det stivne i denne formen. @no
label: a pour personne fondeuse @fr
definition: Met une manifestation en relation avec une personne qui est responsable de la création d’une manifestation en versant un liquide ou une substance fondue dans un moule et en laissant ce liquide ou cette substance se solidifier pour prendre la forme du moule. @fr
toolkit label: personne fondeuse @fr
toolkit definition: Personne qui est responsable de la création d’une manifestation en versant un liquide ou une substance fondue dans un moule et en laissant ce liquide ou cette substance se solidifier pour prendre la forme du moule. @fr
label: heeft gieter-persoon @nl
definition: Relateert een manifestatie aan een persoon die verantwoordelijk is voor het creëren van een manifestatie middels het gieten van een vloeistof of gesmolten substantie in een mal en die te laten stollen in de vorm van die mal. @nl
toolkit label: gieter-persoon @nl
toolkit definition: Een persoon die verantwoordelijk is voor het creëren van een manifestatie middels het gieten van een vloeistof of gesmolten substantie in een mal en die te laten stollen in de vorm van die mal. @nl
label: له شخص مسئول عن الصب @ar
definition: يربط بين تجسيدة وشخص مسئول عن تصنيع تجسيدة بصب السائل أو المادة المذابة في القالب وتركه حتى يجف ليأخذ شكل القالب. @ar
toolkit label: شخص مسئول عن الصب @ar
toolkit definition: شخص مسئول عن تصنيع تجسيدة بصب السائل أو المادة المذابة في القالب وتركه حتى يجف ليأخذ شكل القالب. @ar
label: té com a persona emmotlladora @ca
definition: Relaciona una manifestació amb una persona que és responsable de la creació d’una manifestació mitjançant l’abocament d’un líquid o una substància fosa en un motlle tot deixant que se solidifiqui perquè prengui la forma del motlle. @ca
toolkit label: persona emmotlladora @ca
toolkit definition: Persona que és responsable de la creació d’una manifestació mitjançant l’abocament d’un líquid o una substància fosa en un motlle tot deixant que se solidifiqui perquè prengui la forma del motlle. @ca
label: har person, som er støber @da
definition: Relaterer en manifestation til en person, som er involveret i fremstillingen af en manifestation ved at hælde en væske eller et varmt, flydende stof i en form og lade det størkne, så det tager facon efter formen. @da
toolkit label: person, som er støber @da
toolkit definition: Person, som er involveret i fremstillingen af en manifestation ved at hælde en væske eller et varmt, flydende stof i en form og lade det størkne, så det tager facon efter formen. @da
label: valaja (isik) @et
definition: Seostab kehastuse isikuga, kes osaleb kehastuse valmistamises, valades vedela või sulatatud materjali valuvormi, kus materjal tahkub, võttes valuvormi kuju. @et
toolkit label: valaja (isik) @et
toolkit definition: Isik, kes osaleb kehastuse valmistamises, valades vedela või sulatatud materjali valuvormi, kus materjal tahkub, võttes valuvormi kuju. @et
label: hat Formgießerin/Formgießer (Person) @de
definition: Setzt eine Manifestation in Beziehung zu einer Person, die für die Herstellung einer Manifestation verantwortlich ist, indem sie eine Flüssigkeit oder eine geschmolzenen Substanz in eine Form gießt, die in der Gießform verbleibt, bis sie ausgehärtet ist. @de
toolkit label: Formgießerin/Formgießer (Person) @de
toolkit definition: Eine Person, die für die Herstellung einer Manifestation verantwortlich ist, indem sie eine Flüssigkeit oder eine geschmolzenen Substanz in eine Form gießt, die in der Gießform verbleibt, bis sie ausgehärtet ist. @de
label: öntvénykészítő személye a következő: @hu
definition: Hozzákapcsol egy megjelenési formát egy személyhez, aki felelős egy megjelenési forma gyártásáért oly módon, hogy folyékony vagy olvasztott anyagot önt egy öntőformába és hagyja, hogy az megszilárduljon és az öntőforma formáját felvegye. @hu
toolkit label: öntvénykészítő személy: @hu
toolkit definition: Egy személy, aki felelős egy megjelenési forma gyártásáért oly módon, hogy folyékony vagy olvasztott anyagot önt egy öntőformába és hagyja, hogy az megszilárduljon és az öntőforma formáját felvegye. @hu
label: ha come fonditore persona @it
definition: Correla una manifestazione alla persona coinvolta nella manifattura di una manifestazione, tramite il versamento di una sostanza liquida o fusa in uno stampo e lasciandola solidificare fino ad assumere la forma dello stampo. @it
toolkit label: fonditore persona @it
toolkit definition: Persona coinvolta nella manifattura di una manifestazione, tramite il versamento di una sostanza liquida o fusa in uno stampo e lasciandola solidificare fino ad assumere la forma dello stampo. @it
label: lējējs (persona) @lv
definition: Sasaista manifestāciju ar personu, kura iesaistīta manifestācijas ražošanā, lejot veidnē šķidru vai izkausētu vielu un atstājot to sacietēt, lai tā iegūtu veidnes formu. @lv
toolkit label: lējējs (persona) @lv
toolkit definition: Persona, kura iesaistīta manifestācijas ražošanā, lejot veidnē šķidru vai izkausētu vielu un atstājot to sacietēt, lai tā iegūtu veidnes formu. @lv
sub property of: has creator person of manifestation
label: 有铸造者个人 @zh-hans
definition: 将一种载体表现与通过将液体或融化的物质倒入模具中使其按模具固化成型而对一种载体表现的创建负责的一个个人关联起来。 @zh-hans
toolkit label: 铸造者个人 @zh-hans
toolkit definition: 通过将液体或融化的物质倒入模具中使其按模具固化成型而对一种载体表现的创建负责的一个个人 @zh-hans
label: dökümcü ile ilişkilidir @tr
definition: Bir gösterimi, sıvı veya erimiş bir maddeyi bir kalıba dökerek ve kalıbın şeklini almak üzere katılaşmaya bırakarak bir öğe oluşturmakla sorumlu olan kişiyle ilişkilendirir. @tr
toolkit label: dökümcü @tr
toolkit definition: Sıvı veya erimiş bir maddeyi bir kalıba dökerek ve kalıbın şeklini alması için katılaşmaya bırakarak bir gösterim oluşturmakla sorumlu kişi. @tr
label: tiene persona lanzadora @es
definition: Relaciona una manifestación con una persona que se encarga de crear una manifestación vertiendo un líquido o sustancia fundida en un molde y dejándolo solidificar para tomar la forma del molde. @es
toolkit label: persona lanzadora @es
toolkit definition: Una persona que se encarga de crear una manifestación vertiendo un líquido o sustancia fundida en un molde y dejándolo solidificar para tomar la forma del molde. @es
has subproperty: P30353

has category of manifestation
status: Published
lexical alias: categoryOfManifestation.en
definition: Relates a manifestation to a type to which a manifestation belongs.
alternative label: type of manifestation
toolkit label: category of manifestation
toolkit definition: A type to which a manifestation belongs.
type: Property
domain: C10007
sub property of: P00029
has element type: 5
label: manifestaation kategoria @fi
definition: Liittää manifestaation tyyppiin, johon manifestaatio kuuluu. @fi
alternative label: manifestaation tyyppi @fi
toolkit label: manifestaation kategoria @fi
toolkit definition: Tyyppi, johon manifestaatio kuuluu. @fi
label: har kategori av manifestasjon @no
definition: Relaterer en manifestasjon til en type som en manifestasjon tilhører. @no
alternative label: type manifestasjon @no
toolkit label: kategori av manifestasjon @no
toolkit definition: En type som en manifestasjon tilhører. @no
label: a pour catégorie de manifestation @fr
definition: Met une manifestation en relation avec un type auquel une manifestation appartient. @fr
alternative label: type de manifestation @fr
toolkit label: catégorie de manifestation @fr
toolkit definition: Type auquel une manifestation appartient. @fr
label: heeft categorie van manifestatie @nl
definition: Relateert een manifestatie aan een type waartoe een manifestatie behoort. @nl
toolkit label: categorie van manifestatie @nl
toolkit definition: Een type waartoe een manifestatie behoort. @nl
label: له فئة تجسيدة @ar
definition: يربط بين تجسيدة ونوع تنتمي إليه تجسيدة. @ar
alternative label: نوع تجسيدة @ar
toolkit label: فئة تجسيدة @ar
toolkit definition: نوع تنتمي إليه تجسيدة. @ar
label: té com a categoria de manifestació @ca
definition: Relaciona una manifestació amb un tipus al qual pertany una manifestació. @ca
alternative label: tipus de manifestació @ca
toolkit label: categoria de manifestació @ca
toolkit definition: Tipus al qual pertany una manifestació. @ca
label: har kategori af manifestation @da
definition: Relaterer en manifestation til en type, hvortil en manifestation tilhører. @da
alternative label: type af manifestation @da
toolkit label: kategori af manifestation @da
toolkit definition: Type, hvortil en manifestation tilhører. @da
label: kehastuse kategooria @et
definition: Seostab kehastuse tüübiga, millesse kehastus kuulub. @et
alternative label: kehastuse tüüp @et
toolkit label: kehastuse kategooria @et
toolkit definition: Tüüp, millesse kehastus kuulub. @et
label: hat Kategorie einer Manifestation @de
definition: Setzt eine Manifestation in Beziehung zu einer Art, zu der eine Manifestation gehört. @de
toolkit label: Kategorie einer Manifestation @de
toolkit definition: Eine Art, zu der eine Manifestation gehört. @de
label: megjelenési forma kategóriája a következő: @hu
definition: Hozzákapcsol egy megjelenési formát ahhoz a típushoz, amelyhez a megjelenési forma tartozik. @hu
alternative label: megjelenési forma kategóriája @hu
toolkit label: Egy típus, amelyhez a megjelenési forma tartozik. @hu
toolkit definition: megjelenési forma típusa: @hu
label: ha come categoria di manifestazione @it
definition: Correla una manifestazione a un tipo a cui appartiene una manifestazione. @it
alternative label: tipo di manifestazione @it
toolkit label: categoria di manifestazione @it
toolkit definition: Tipo a cui appartiene una manifestazione. @it
label: manifestācijas kategorija @lv
definition: Sasaista manifestāciju ar veidu, pie kura pieder manifestācija. @lv
toolkit label: manifestācijas kategorija @lv
toolkit definition: Veids, pie kura pieder manifestācija. @lv
alternative label: Art von Manifestation @de
alternative label: 载体表现的类型 @zh-hans
label: 有载体表现的类别 @zh-hans
definition: 将一种载体表现与一种载体表现所属于的一种类型关联起来。 @zh-hans
toolkit label: 载体表现的类别 @zh-hans
toolkit definition: 一种载体表现所属于的一种类型 @zh-hans
alternative label: gösterimin türü @tr
label: anlatımın kategorisi ile ilişkilidir @tr
toolkit label: gösterim kategorisi @tr
toolkit definition: Bir gösterimin ait olduğu bir tür @tr
toolkit label: categoría de manifestación @es
toolkit definition: Un tipo al que pertenece una manifestación. @es
has subproperty: P30335

has title of manifestation
status: Published
definition: Relates a manifestation to a nomen that is an appellation of manifestation in natural language and phrasing used in common discourse.
type: Property
domain: C10007
lexical alias: titleOfManifestation.en
instruction number: 2.3
toolkit label: title of manifestation
toolkit definition: A nomen that is an appellation of manifestation in natural language and phrasing used in common discourse.
label: a pour titre de manifestation @fr
definition: Met une manifestation en relation avec un nomen qui est une appellation de manifestation exprimée dans un langage et une formulation naturels et utilisée dans le langage courant. @fr
toolkit label: titre de manifestation @fr
toolkit definition: Nomen qui est une appellation de manifestation exprimée dans un langage et une formulation naturels et utilisée dans le langage courant. @fr
toolkit label: título de manifestación @es
toolkit definition: Un nomen que es una denominación de manifestación en lenguaje natural y fraseo usado en el discurso común. @es
label: har titel @sv
toolkit label: titel @sv
toolkit label: titel van manifestatie @nl
toolkit definition: Een nomen dat is een benaming van manifestatie in natuurlijke taal en formulering in gebruikelijke bewoording. @nl
label: có nhan đề @vi
definition: Liên kết biểu thị với từ, ký tự, hoặc nhóm từ hoặc ký tự mà tên của biểu thị hoặc tác phẩm được thể hiện trong đó. @vi
toolkit label: nhan đề @vi
toolkit definition: Từ, ký tự, hoặc nhóm từ hoặc ký tự mà tên của biểu thị hoặc tác phẩm được thể hiện trong đó. @vi
label: har titel på manifestation @da
definition: Relaterer en manifestation til en benævnelse på manifestation på normalsprog og med formuleringer, som bruges alment. @da
toolkit label: titel på manifestation @da
toolkit definition: Benævnelse på manifestation på normalsprog og med formuleringer, som bruges alment. @da
label: hat Titel einer Manifestation @de
definition: Setzt eine Manifestation in Beziehung zu einer Bezeichnung für eine Manifestation in natürlicher Sprache und Ausdrucksweise, die beim normalen Sprechen und Schreiben verwendet wird. @de
toolkit label: Titel einer Manifestation @de
toolkit definition: Eine Bezeichnung für eine Manifestation in natürlicher Sprache und Ausdrucksweise, die beim normalen Sprechen und Schreiben verwendet wird. @de
label: té com a títol de manifestació @ca
definition: Relaciona una manifestació amb un nomen que és una apel·lació de manifestació en llenguatge i frases naturals usada en el discurs comú. @ca
toolkit label: títol de manifestació @ca
toolkit definition: Nomen que és una apel·lació de manifestació en llenguatge i frases naturals usada en el discurs comú. @ca
definition: Liittää manifestaation nomeniin, joka on manifestaation nimitys, joka on luonnollisen kielen ja yleisen diskurssin sanamuodon mukainen. @fi
toolkit label: manifestaation nimeke @fi
toolkit definition: Nomen, joka on manifestaation nimitys, joka on luonnollisen kielen ja yleisen diskurssin sanamuodon mukainen. @fi
toolkit label: tittel for manifestasjon @no
toolkit definition: En betegnelse for manifestasjon på et naturlig språk og med en frasering brukt i alminnelig diskurs. @no
label: έχει τίτλο @el
definition: Συνδέει μια εκδήλωση με μια λέξη, έναν χαρακτήρα ή μια ομάδα λέξεων ή χαρακτήρων που κατονομάζουν μια εκδήλωση ή με ένα έργο που είναι ενσωματωμένο σε αυτήν [την εκδήλωση]. @el
toolkit label: τίτλος @el
toolkit definition: Μια λέξη, ένας χαρακτήρας ή μια ομάδα λέξεων ή χαρακτήρων που κατονομάζουν μια εκδήλωση ή με ένα έργο που είναι ενσωματωμένο σε αυτήν [την εκδήλωση]. @el
sub property of: has appellation of manifestation
has element type: 3
label: megjelenési forma címe a következő: @hu
definition: Hozzákapcsol egy megjelenési formát egy nomenhez, amely egy a megjelenési formához tartozó természetes nyelvű megnevezés és a közbeszédben használt megfogalmazás. @hu
toolkit label: megjelenési forma címe: @hu
toolkit definition: Egy nomen, amely egy a megjelenési formához tartozó természetes nyelvű megnevezés és a közbeszédben használt megfogalmazás. @hu
sub property of: P00019
label: manifestaation nimeke @fi
label: har tittel for manifestasjon @no
definition: Relaterer en manifestasjon til en betegnelse for manifestasjon på et naturlig språk og med en frasering brukt i alminnelig diskurs. @no
label: heeft titel van manifestatie @nl
definition: Relateert een manifestatie aan een nomen dat is een benaming van manifestatie in natuurlijke taal en formulering in gebruikelijke bewoording. @nl
label: له عنوان لتجسيدة @ar
definition: يربط بين تجسيدة وتسمية تجسيدة في اللغة الطبيعية والتسمية المستخدمة في الخطاب العام. @ar
toolkit label: عنوان لتجسيدة @ar
toolkit definition: تسمية تجسيدة في اللغة الطبيعية والتسمية المستخدمة في الخطاب العام. @ar
label: kehastuse pealkiri @et
definition: Seostab kehastuse kehastuse nimetusega loomulikus keeles ja sõnastuses, mida kasutatakse ühises diskursuses. @et
toolkit label: kehastuse pealkiri @et
toolkit definition: Kehastuse nimetus loomulikus keeles ja sõnastuses, mida kasutatakse ühises diskursuses. @et
label: ha come titolo di manifestazione @it
definition: Correla una manifestazione a una denominazione di manifestazione espressa in una lingua e formulazione naturali, usata nella lingua corrente. @it
toolkit label: titolo di manifestazione @it
toolkit definition: Denominazione di manifestazione espressa in una lingua e formulazione naturali, usata nella lingua corrente. @it
label: manifestācijas nosaukums @lv
definition: Sasaista manifestāciju ar nomenu, kas ir vārds vai vārdu, vai rakstzīmju grupa, kas nosauc tajā ietverto manifestāciju vai darbu. @lv
toolkit label: manifestācijas nosaukums @lv
toolkit definition: Vārds vai vārdu, vai rakstzīmju grupa, kas nosauc tajā ietverto manifestāciju vai darbu. @lv
alternative label: nimeke @fi
label: 有载体表现的题名 @zh-hans
definition: 将一种载体表现与作为用自然语言和普通话语措词表达的一种载体表现之称谓的一个命名关联起来。 @zh-hans
toolkit label: 载体表现的题名 @zh-hans
toolkit definition: 作为用自然语言和普通话语措词表达的一种载体表现之称谓的一个命名 @zh-hans
label: gösterim başlığı ile ilişkilidir @tr
definition: Bir gösterimi, doğal dilde gösterimin bir adı olan bir adla ve ortak söylemde kullanılan ifadelerle ilişkilendirir. @tr
toolkit label: gösterimin başlığı @tr

has variant title of manifestation
status: Published
definition: Relates a manifestation to a nomen that is a title of manifestation that is not selected for preference in a specific application or context.
type: Property
domain: C10007
sub property of: has title of manifestation
lexical alias: variantTitleOfManifestation.en
instruction number: 2.3.6
toolkit label: variant title of manifestation
toolkit definition: A nomen that is a title of manifestation that is not selected for preference in a specific application or context.
label: a pour variante de titre de manifestation @fr
definition: Met une manifestation en relation avec un nomen qui est un titre de manifestation ne faisant pas l’objet d’un choix privilégié dans une application ou un contexte spécifiques. @fr
toolkit label: variante de titre de manifestation @fr
toolkit definition: Nomen qui est un titre de manifestation ne faisant pas l’objet d’un choix privilégié dans une application ou un contexte spécifiques. @fr
toolkit label: título variante de manifestación @es
toolkit definition: Un nomen que es un título de manifestación que no se selecciona de preferencia en una aplicación o contexto específico. @es
label: har varianttitel @sv
toolkit label: varianttitel @sv
toolkit label: variant-titel van manifestatie @nl
toolkit definition: Een nomen dat is een titel van manifestatie die niet als voorkeursterm geselecteerd is in een specifieke toepassing of context. @nl
label: có nhan đề khác @vi
definition: Liên kết biểu thị với nhan đề liên quan tới biểu thị khác với nhan đề được ghi như là nhan đề hợp thức, nhan đề hợp thức song song, thông tin nhan đề khác, thông tin nhan đề khác song song, nhan đề hợp thức trước đây, nhan đề hợp thức sau này, nhan đề khoá, hoặc nhan đề tắt. @vi
toolkit label: nhan đề khác @vi
toolkit definition: Nhan đề liên quan tới biểu thị khác với nhan đề được ghi như là nhan đề hợp thức, nhan đề hợp thức song song, thông tin nhan đề khác, thông tin nhan đề khác song song, nhan đề hợp thức trước đây, nhan đề hợp thức sau này, nhan đề khoá, hoặc nhan đề tắt. @vi
label: har variant af titel på manifestation @da
definition: Relaterer en manifestation til en titel på manifestation, som ikke er valgt som præference i en specifik anvendelse eller kontekst. @da
toolkit label: variant af titel på manifestation @da
toolkit definition: Titel på manifestation, som ikke er valgt som præference i en specifik anvendelse eller kontekst. @da
label: hat abweichenden Titel einer Manifestation @de
definition: Setzt eine Manifestation in Beziehung zu einem Titel einer Manifestation, der in einer bestimmten Anwendung oder in einem bestimmten Kontext nicht als Vorzugsform bestimmt wird. @de
toolkit label: Abweichender Titel einer Manifestation @de
toolkit definition: Ein Titel einer Manifestation, der in einer bestimmten Anwendung oder in einem bestimmten Kontext nicht als Vorzugsform bestimmt wird. @de
label: té com a variant de títol de manifestació @ca
definition: Relaciona una manifestació amb un nomen que és un títol de manifestació que no se selecciona com a preferent en una aplicació o un context específic. @ca
toolkit label: variant de títol de manifestació @ca
toolkit definition: Nomen que és un títol de manifestació que no se selecciona com a preferent en una aplicació o un context específic. @ca
definition: Liittää manifestaation nomeniin, joka on manifestaation nimeke, jota ei ole valittu ensisijaiseksi tietyssä sovelluksessa tai kontekstissa. @fi
toolkit label: manifestaation varianttinimeke @fi
toolkit definition: Nomen, joka on manifestaation nimeke, jota ei ole valittu ensisijaiseksi tietyssä sovelluksessa tai kontekstissa. @fi
toolkit label: tittelvariant for manifestasjon @no
toolkit definition: En tittel for manifestasjon som ikke er valgt som foretrukket tittel i en spesifikk applikasjon eller kontekst. @no
label: έχει εναλλακτικό τίτλο @el
definition: Συνδέει μια εκδήλωση με έναν τίτλο που συνδέεται με μια εκδήλωση που διαφέρει από έναν τίτλο που καταχωρίστηκε ως κύριος τίτλος, ως παράλληλος κύριος τίτλος, ως άλλες πληροφορίες σχετικές με τον τίτλο, ως άλλες πληροφορίες σχετικές με τον παράλληλο τίτλο, ως προηγούμενος κύριος τίτλος, ως μεταγενέστερος κύριος τίτλος, ως τίτλος κλειδί ή ως συντομευμένος τίτλος. @el
toolkit label: εναλλακτικός τίτλος @el
toolkit definition: Ένας τίτλος που συνδέεται με μια εκδήλωση που διαφέρει από έναν τίτλο που καταχωρίστηκε ως κύριος τίτλος, ως παράλληλος κύριος τίτλος, ως άλλες πληροφορίες σχετικές με τον τίτλο, ως άλλες πληροφορίες σχετικές με τον παράλληλο τίτλο, ως προηγούμενος κύριος τίτλος, ως μεταγενέστερος κύριος τίτλος, ως τίτλος κλειδί ή ως συντομευμένος τίτλος. @el
has element type: 3
label: megjelenési forma címváltozata a következő: @hu
definition: Hozzákapcsol egy megjelenési formát egy nomenhez, amely egy olyan megjelenési formához tartozó cím, amelyet egy adott alkalmazásban vagy kontextusban nem részesítenek előnyben. @hu
toolkit label: megjelenési forma címváltozata: @hu
toolkit definition: Egy nomen, amely egy olyan megjelenési formához tartozó cím, amelyet egy adott alkalmazásban vagy kontextusban nem részesítenek előnyben. @hu
sub property of: P00023
label: manifestaation varianttinimeke @fi
label: har tittelvariant for manifestasjon @no
definition: Relaterer en manifestasjon til en tittel for manifestasjon som ikke er valgt som foretrukket tittel i en spesifikk applikasjon eller kontekst. @no
label: heeft variant titel van manifestatie @nl
definition: Relateert een manifestatie aan een nomen dat is een titel van manifestatie die niet als voorkeursterm geselecteerd is in een specifieke toepassing of context. @nl
label: له عنوان مختلف لتجسيدة @ar
definition: يربط بين تجسيدة وعنوان تجسيدة لم يتم اختياره للتفضيل في تطبيق أو سياق محدد. @ar
toolkit label: عنوان مختلف لتجسيدة @ar
toolkit definition: عنوان تجسيدة لم يتم اختياره للتفضيل في تطبيق أو سياق محدد. @ar
label: kehastuse variantpealkiri @et
definition: Seostab kehastuse kehastuse pealkirjaga, mis kindlas rakenduses või kontekstis ei ole valitud eelistatuks. @et
alternative label: kehastuse teisendpealkiri @et
toolkit label: kehastuse variantpealkiri @et
toolkit definition: Kehastuse pealkiri, mis kindlas rakenduses või kontekstis ei ole valitud eelistatuks. @et
label: ha come titolo variante della manifestazione @it
definition: Correla una manifestazione a un titolo della manifestazione non scelto come preferito in una specifica applicazione o contesto. @it
toolkit label: titolo variante della manifestazione @it
toolkit definition: Titolo della manifestazione non scelto come preferito in una specifica applicazione o contesto. @it
label: manifestācijas cits nosaukums @lv
definition: Sasaista manifestāciju ar nomenu, kas ir manifestācijas nosaukums, kas nav izvēlēts kā prioritārs noteiktā lietojumprogrammā vai kontekstā. @lv
toolkit label: manifestācijas cits nosaukums @lv
toolkit definition: Manifestācijas nosaukums, kas nav izvēlēts kā prioritārs noteiktā lietojumprogrammā vai kontekstā. @lv
alternative label: varianttinimeke @fi
label: 有载体表现的变异题名 @zh-hans
definition: 将一种载体表现与作为载体表现的一个题名但未在特定的应用或语境中被首选的一个命名关联起来。 @zh-hans
toolkit label: 载体表现的变异题名 @zh-hans
toolkit definition: 作为载体表现的一个题名但未在特定的应用或语境中被首选的一个命名 @zh-hans
label: gösterimin alternatif başlığı ile ilişkilidir @tr
definition: Bir gösterimi, belirli bir uygulama veya bağlamda tercih edilmeyen bir gösterimin unvanı olan bir isimle ilişkilendirir. @tr

has collotyper agent
status: Published
definition: Relates a manifestation to an agent who is responsible for creating a manifestation by preparing a hardened film of gelatin or other colloid that has ink-receptive and ink-repellent surfaces and that is used to make prints using a photomechanical process.
type: Property
domain: C10007
lexical alias: collotyperAgent.en
toolkit label: collotyper agent
toolkit definition: An agent who is responsible for creating a manifestation by preparing a hardened film of gelatin or other colloid that has ink-receptive and ink-repellent surfaces and that is used to make prints using a photomechanical process.
label: a pour agent phototypeur @fr
definition: Met une manifestation en relation avec un agent qui est responsable de la création d’une manifestation en préparant un film durci de gélatine ou d’un autre colloïde présentant des surfaces réceptives et répulsives à l’encre et servant à réaliser des images imprimées à l’aide d’un procédé photomécanique. @fr
toolkit label: agent phototypeur @fr
toolkit definition: Agent qui est responsable de la création d’une manifestation en préparant un film durci de gélatine ou d’un autre colloïde présentant des surfaces réceptives et répulsives à l’encre et servant à réaliser des images imprimées à l’aide d’un procédé photomécanique. @fr
toolkit label: agente colotipador @es
toolkit definition: Un agente que es responsable de crear una manifestación preparando una película endurecida de gelatina u otro coloide que tenga superficies receptoras y repelentes de tinta y que se utiliza para realizar impresiones mediante un proceso fotomecánico. @es
instruction number: 18.5
toolkit label: lichtdrukker-actor @nl
toolkit definition: Een actor die verantwoordelijk is voor het creëren van een manifestatie middels het prepareren van een verharde film van gelatine of ander colloïde dat inktopnemende en inktafstotende oppervlakken heeft en die gebruikt wordt voor het maken van afdrukken met gebruikmaking van een fotomechanisch proces. @nl
label: có người in từ phim @vi
definition: Liên kết biểu thị với tác nhân có liên quan tới chế tạo biểu thị theo trách nhiệm sử dụng quy trình quang cơ để tạo bản in trực tiếp từ phim được làm cứng từ gelatin hoặc chất keo khác có bề mặt thấm mực hoặc không thấm mực. @vi
toolkit label: người in từ phim @vi
toolkit definition: Tác nhân có liên quan tới chế tạo biểu thị theo trách nhiệm sử dụng quy trình quang cơ để tạo bản in trực tiếp từ phim được làm cứng từ gelatin hoặc chất keo khác có bề mặt thấm mực hoặc không thấm mực. @vi
label: har agent, som er lystrykker @da
definition: Relaterer en manifestation til en agent, som er involveret i fremstillingen af en manifestation vha. en fotomekanisk proces, hvorved der laves tryk direkte fra et hærdet gelatinelag eller andet kolloid, som har blækmodtagelige og blækafvisende overflader. @da
toolkit label: agent, som er lystrykker @da
toolkit definition: Agent, som er involveret i fremstillingen af en manifestation vha. en fotomekanisk proces, hvorved der laves tryk direkte fra et hærdet gelatinelag eller andet kolloid, som har blækmodtagelige og blækafvisende overflader. @da
label: hat Lichtdruckerin/Lichtdrucker (Akteur) @de
definition: Setzt eine Manifestation in Beziehung zu einem Akteur, der für die Herstellung einer Manifestation verantwortlich ist, indem er ein fotomechanisches Verfahren zur Herstellung von Abzügen direkt von einem gehärteten Film aus Gelatine oder einem anderen Kolloid verwendet, der druckerfarbenaufnehmende und -abweisende Oberflächen aufweist. @de
toolkit label: Lichtdruckerin/Lichtdrucker (Akteur) @de
toolkit definition: Ein Akteur, der für die Herstellung einer Manifestation verantwortlich ist, indem er ein fotomechanisches Verfahren zur Herstellung von Abzügen direkt von einem gehärteten Film aus Gelatine oder einem anderen Kolloid verwendet, der druckerfarbenaufnehmende und -abweisende Oberflächen aufweist. @de
label: té com a agent fototipista @ca
definition: Relaciona una manifestació amb un agent que és responsable de la creació d’una manifestació mitjançant la preparació d’una pel·lícula endurida de gelatina o d’un altre col·loide que té superfícies que accepten o rebutgen la tinta i que s’usa per fer gravats usant un procés fotomecànic. @ca
toolkit label: agent fototipista @ca
toolkit definition: Agent que és responsable de la creació d’una manifestació mitjançant la preparació d’una pel·lícula endurida de gelatina o d’un altre col·loide que té superfícies que accepten o rebutgen la tinta i que s’usa per fer gravats usant un procés fotomecànic. @ca
definition: Liittää manifestaation toimijaan, joka on vastuussa manifestaation valmistamisesta tekemällä vedoksia suoraan kovettuneelta gelatiinifilmiltä tai muulta materiaalilta, jossa on mustetta imeviä ja hylkiviä pintoja. @fi
toolkit label: kollotypian valmistaja (toimija) @fi
toolkit definition: Toimija, joka on vastuussa manifestaation valmistamisesta tekemällä vedoksia suoraan kovettuneelta gelatiinifilmiltä tai muulta materiaalilta, jossa on mustetta imeviä ja hylkiviä pintoja. @fi
toolkit label: lystrykker (agent) @no
toolkit definition: En agent som er involvert i framstillingen av en manifestasjon ved å bruke en fotomekanisk prosess for å lage kopier direkte fra en stivnet film av gelatin eller et annet kolloid som har overflater som er mottagelige for blekk og motstandige mot blekk. @no
label: έχει κατασκευαστή της κολλοτυπίας @el
definition: Συνδέει μια εκδήλωση με έναν φορέα που εμπλέκεται στην κατασκευή μιας εκδήλωσης μέσω της χρήσης μιας φωτομηχανικής διαδικασίας για τη δημιουργία εκτυπώσεων κατευθείαν από ένα σκληρυμένο φιλμ ζελατίνης ή άλλο κολλοειδές, το οποίο έχει μελανο-δεκτικές και μελανο-απωθητικές επιφάνειες. @el
toolkit label: κατασκευαστής κολλοτυπίας @el
toolkit definition: Ένας φορέας που εμπλέκεται στην κατασκευή μιας εκδήλωσης μέσω της χρήσης μιας φωτομηχανικής διαδικασίας για τη δημιουργία εκτυπώσεων κατευθείαν από ένα σκληρυμένο φιλμ ζελατίνης ή άλλο κολλοειδές, το οποίο έχει μελανο-δεκτικές και μελανο-απωθητικές επιφάνειες. @el
has element type: 2
label: fénynyomatkészítő ágense a következő: @hu
definition: Hozzákapcsol egy megjelenési formát egy ágenshez, amely felelős egy megjelenési forma gyártásáért oly módon, hogy fotómechanikai eljárás alkalmazásával nyomtatványokat állít elő közvetlenül olyan zselatin vagy más kolloid megkeményedett filmjéből, amelynek tintafelvevő és tintataszító felülete van. @hu
toolkit label: fénynyomatkészítő ágens: @hu
toolkit definition: Egy ágens, amely felelős egy megjelenési forma gyártásáért oly módon, hogy fotómechanikai eljárás alkalmazásával nyomtatványokat állít elő közvetlenül olyan zselatin vagy más kolloid megkeményedett filmjéből, amelynek tintafelvevő és tintataszító felülete van. @hu
alternative label: collotyper
alternative label: collotypist agent
label: kollotypian valmistaja (toimija) @fi
label: har lystrykker (agent) @no
definition: Relaterer en manifestasjon til en agent som er involvert i framstillingen av en manifestasjon ved å bruke en fotomekanisk prosess for å lage kopier direkte fra en stivnet film av gelatin eller et annet kolloid som har overflater som er mottagelige for blekk og motstandige mot blekk. @no
alternative label: lystrykker @no
label: heeft lichtdrukker-actor @nl
definition: Relateert een manifestatie aan een actor die verantwoordelijk is voor het creëren van een manifestatie middels het prepareren van een verharde film van gelatine of ander colloïde dat inktopnemende en inktafstotende oppervlakken heeft en die gebruikt wordt voor het maken van afdrukken met gebruikmaking van een fotomechanisch proces. @nl
label: له وكيل طباع صور @ar
definition: يربط بين تجسيدة ووكيل مسئول عن تصنيع تجسيدة باستخدام عمليات ضوئية ميكانيكية لإنتاج المطبوعات مباشرة من فيلم صلد من الجيلاتين أو غيره من المواد الغروية التى تحتوي أسطح مستقبلة وطاردة للحبر. @ar
alternative label: طباع صور @ar
toolkit label: وكيل طباع صور @ar
toolkit definition: وكيل مسئول عن تصنيع تجسيدة باستخدام عمليات ضوئية ميكانيكية لإنتاج المطبوعات مباشرة من فيلم صلد من الجيلاتين أو غيره من المواد الغروية التى تحتوي أسطح مستقبلة وطاردة للحبر. @ar
label: kollotüübi valmistaja (tegija) @et
definition: Seostab kehastuse tegijaga, kes osaleb kehastuse valmistamises, tehes fotomehaanilises protsessis tõmmiseid otse želatiini või muu kolloidi tahkunud kihilt, mille pind osalt seob värvainet, osalt ei seo. @et
alternative label: kollotüübi valmistaja @et
toolkit label: kollotüübi valmistaja (tegija) @et
toolkit definition: Tegija, kes osaleb kehastuse valmistamises, tehes fotomehaanilises protsessis tõmmiseid otse želatiini või muu kolloidi tahkunud kihilt, mille pind osalt seob värvainet, osalt ei seo. @et
alternative label: fénynyomó: @hu
label: ha come collotipista agente @it
definition: Correla una manifestazione all'agente coinvolto nella manifattura di una manifestazione tramite un processo fotomeccanico per realizzare stampe fotografiche direttamente da un film indurito di gelatina o altro colloide con superfici recettive e repellenti all'inchiostro. @it
alternative label: collotipista @it
toolkit label: collotipista agente @it
toolkit definition: Agente coinvolto nella manifattura di una manifestazione tramite un processo fotomeccanico per realizzare stampe fotografiche direttamente da un film indurito di gelatina o altro colloide con superfici recettive e repellenti all'inchiostro. @it
label: fotogravieris (aģents) @lv
definition: Sasaista manifestāciju ar aģentu, kas iesaistīts manifestācijas ražošanā, izmantojot fotomehānisku procesu, lai izgatavotu izdrukas tieši no plates, kas pārklāta ar gaismjutīga hromželatīna slāni vai citu koloīdu, kuram ir tinti piesaistošas un tinti atgrūdošas virsmas. @lv
toolkit label: fotogravieris (aģents) @lv
toolkit definition: Aģents, kas iesaistīts manifestācijas ražošanā, izmantojot fotomehānisku procesu, lai izgatavotu izdrukas tieši no plates, kas pārklāta ar gaismjutīga hromželatīna slāni vai citu koloīdu, kuram ir tinti piesaistošas un tinti atgrūdošas virsmas. @lv
sub property of: has platemaker agent
alternative label: Lichtdrucker @de
label: 有珂罗版制作者行为者 @zh-hans
definition: 将一种载体表现与通过利用一面吸墨而另一面不吸墨的明胶或其他硬胶片进行影印对一种载体表现的创建负责的一个行为者关联起来。 @zh-hans
toolkit label: 珂罗版制作者行为者 @zh-hans

has collotyper collective agent
status: Published
lexical alias: collotyperCollectiveAgent.en
definition: Relates a manifestation to a collective agent who is responsible for creating a manifestation by preparing a hardened film of gelatin or other colloid that has ink-receptive and ink-repellent surfaces and that is used to make prints using a photomechanical process.
toolkit label: collotyper collective agent
toolkit definition: A collective agent who is responsible for creating a manifestation by preparing a hardened film of gelatin or other colloid that has ink-receptive and ink-repellent surfaces and that is used to make prints using a photomechanical process.
type: Property
domain: C10007
has element type: 2
sub property of: has collotyper agent
label: kollotypian valmistaja (yhteistoimija) @fi
definition: Liittää manifestaation yhteistoimijaan, joka on vastuussa manifestaation valmistamisesta tekemällä vedoksia suoraan kovettuneelta gelatiinifilmiltä tai muulta materiaalilta, jossa on mustetta imeviä ja hylkiviä pintoja. @fi
toolkit label: kollotypian valmistaja (yhteistoimija) @fi
toolkit definition: Yhteistoimija, joka on vastuussa manifestaation valmistamisesta tekemällä vedoksia suoraan kovettuneelta gelatiinifilmiltä tai muulta materiaalilta, jossa on mustetta imeviä ja hylkiviä pintoja. @fi
label: har lystrykker (kollektiv agent) @no
definition: Relaterer en manifestasjon til en kollektiv agent som er involvert i framstillingen av en manifestasjon ved å bruke en fotomekanisk prosess for å lage kopier direkte fra en stivnet film av gelatin eller et annet kolloid som har overflater som er mottagelige for blekk og motstandige mot blekk. @no
toolkit label: lystrykker (kollektiv agent) @no
toolkit definition: En kollektiv agent som er involvert i framstillingen av en manifestasjon ved å bruke en fotomekanisk prosess for å lage kopier direkte fra en stivnet film av gelatin eller et annet kolloid som har overflater som er mottagelige for blekk og motstandige mot blekk. @no
label: a pour agent collectif phototypeur @fr
definition: Met une manifestation en relation avec un agent collectif qui est responsable de la création d’une manifestation en préparant un film durci de gélatine ou d’un autre colloïde présentant des surfaces réceptives et répulsives à l’encre et servant à réaliser des images imprimées à l’aide d’un procédé photomécanique. @fr
toolkit label: agent collectif phototypeur @fr
toolkit definition: Agent collectif qui est responsable de la création d’une manifestation en préparant un film durci de gélatine ou d’un autre colloïde présentant des surfaces réceptives et répulsives à l’encre et servant à réaliser des images imprimées à l’aide d’un procédé photomécanique. @fr
label: heeft collotype-collectieve actor @nl
definition: Relateert een manifestatie aan een collectieve actor die verantwoordelijk is voor het creëren van een manifestatie middels het prepareren van een verharde film van gelatine of ander colloïde dat inktopnemende en inktafstotende oppervlakken heeft en die gebruikt wordt voor het maken van afdrukken met gebruikmaking van een fotomechanisch proces. @nl
toolkit label: collotype-collectieve actor @nl
toolkit definition: Een collectieve actor die verantwoordelijk is voor het creëren van een manifestatie middels het prepareren van een verharde film van gelatine of ander colloïde dat inktopnemende en inktafstotende oppervlakken heeft en die gebruikt wordt voor het maken van afdrukken met gebruikmaking van een fotomechanisch proces. @nl
label: له وكيل جماعي طباع صور @ar
definition: يربط بين تجسيدة ووكيل جماعي مسئول عن تصنيع تجسيدة باستخدام عمليات ضوئية ميكانيكية لإنتاج المطبوعات مباشرة من فيلم صلد من الجيلاتين أو غيره من المواد الغروية التى تحتوي أسطح مستقبلة وطاردة للحبر. @ar
toolkit label: وكيل جماعي طباع صور @ar
toolkit definition: وكيل جماعي مسئول عن تصنيع تجسيدة باستخدام عمليات ضوئية ميكانيكية لإنتاج المطبوعات مباشرة من فيلم صلد من الجيلاتين أو غيره من المواد الغروية التى تحتوي أسطح مستقبلة وطاردة للحبر. @ar
label: té com a agent col·lectiu fototipista @ca
definition: Relaciona una manifestació amb un agent col·lectiu que és responsable de la creació d’una manifestació mitjançant la preparació d’una pel·lícula endurida de gelatina o d’un altre col·loide que té superfícies que accepten o rebutgen la tinta que s’usa per fer gravats usant un procés fotomecànic. @ca
toolkit label: agent col·lectiu fototipista @ca
toolkit definition: Agent col·lectiu que és responsable de la creació d’una manifestació mitjançant la preparació d’una pel·lícula endurida de gelatina o d’un altre col·loide que té superfícies que accepten o rebutgen la tinta que s’usa per fer gravats usant un procés fotomecànic. @ca
label: har kollektiv agent, som er lystrykker @da
definition: Relaterer en manifestation til en kollektiv agent, som er involveret i fremstillingen af en manifestation vha. en fotomekanisk proces, hvorved der laves tryk direkte fra et hærdet gelatinelag eller andet kolloid, som har blækmodtagelige og blækafvisende overflader. @da
toolkit label: kollektiv agent, som er lystrykker @da
toolkit definition: Kollektiv agent, som er involveret i fremstillingen af en manifestation vha. en fotomekanisk proces, hvorved der laves tryk direkte fra et hærdet gelatinelag eller andet kolloid, som har blækmodtagelige og blækafvisende overflader. @da
label: kollotüübi valmistaja (kollektiiv) @et
definition: Seostab kehastuse kollektiiviga, kes osaleb kehastuse valmistamises, tehes fotomehaanilises protsessis tõmmiseid otse želatiini või muu kolloidi tahkunud kihilt, mille pind osalt seob värvainet, osalt ei seo. @et
toolkit label: kollotüübi valmistaja (kollektiiv) @et
toolkit definition: Kollektiiv, kes osaleb kehastuse valmistamises, tehes fotomehaanilises protsessis tõmmiseid otse želatiini või muu kolloidi tahkunud kihilt, mille pind osalt seob värvainet, osalt ei seo. @et
label: hat Lichtdruckerin/Lichtdrucker (Gemeinschaftlicher Akteur) @de
definition: Setzt eine Manifestation in Beziehung zu einem gemeinschaftlichen Akteur, der für die Herstellung einer Manifestation verantwortlich ist, indem er ein fotomechanisches Verfahren zur Herstellung von Abzügen direkt von einem gehärteten Film aus Gelatine oder einem anderen Kolloid verwendet, der druckerfarbenaufnehmende und -abweisende Oberflächen aufweist. @de
toolkit label: Lichtdruckerin/Lichtdrucker (Gemeinschaftlicher Akteur) @de
toolkit definition: Ein gemeinschaftlicher Akteur, der für die Herstellung einer Manifestation verantwortlich ist, indem er ein fotomechanisches Verfahren zur Herstellung von Abzügen direkt von einem gehärteten Film aus Gelatine oder einem anderen Kolloid verwendet, der druckerfarbenaufnehmende und -abweisende Oberflächen aufweist. @de
label: fénynyomatkészítő kollektív ágense a következő: @hu
definition: Hozzákapcsol egy megjelenési formát egy kollektív ágenshez, amely felelős egy megjelenési forma gyártásáért oly módon, hogy fotómechanikai eljárás alkalmazásával nyomtatványokat állít elő közvetlenül olyan zselatin vagy más kolloid megkeményedett filmjéből, amelynek tintafelvevő és tintataszító felülete van. @hu
toolkit label: fénynyomatkészítő kollektív ágens: @hu
toolkit definition: Egy kollektív ágens, amely felelős egy megjelenési forma gyártásáért oly módon, hogy fotómechanikai eljárás alkalmazásával nyomtatványokat állít elő közvetlenül olyan zselatin vagy más kolloid megkeményedett filmjéből, amelynek tintafelvevő és tintataszító felülete van. @hu
label: ha come collotipista agente collettivo @it
definition: Correla una manifestazione all'agente collettivo coinvolto nella manifattura di una manifestazione, utilizzando un processo fotomeccanico per realizzare stampe direttamente da un film indurito di gelatina o altro colloide che ha superfici ricettive o repellenti all'inchiostro. @it
toolkit label: collotipista agente collettivo @it
toolkit definition: Agente collettivo coinvolto nella manifattura di una manifestazione, utilizzando un processo fotomeccanico per realizzare stampe direttamente da un film indurito di gelatina o altro colloide che ha superfici ricettive o repellenti all'inchiostro. @it
label: fotogravieris (grupa) @lv
definition: Sasaista manifestāciju ar grupu, kas iesaistīta manifestācijas ražošanā, izmantojot fotomehānisku procesu, lai izgatavotu izdrukas tieši no plates, kas pārklāta ar gaismjutīga hromželatīna slāni vai citu koloīdu, kuram ir tinti piesaistošas un tinti atgrūdošas virsmas. @lv
toolkit label: fotogravieris (grupa) @lv
toolkit definition: Grupa, kas iesaistīta manifestācijas ražošanā, izmantojot fotomehānisku procesu, lai izgatavotu izdrukas tieši no plates, kas pārklāta ar gaismjutīga hromželatīna slāni vai citu koloīdu, kuram ir tinti piesaistošas un tinti atgrūdošas virsmas. @lv
alternative label: collotypist collective agent
sub property of: has platemaker collective agent
alternative label: - @fi
alternative label: 珂罗版制作者集体行为者 @zh-hans
label: 有珂罗版制作者集体行为者 @zh-hans
definition: 将一种载体表现与通过利用一面吸墨而另一面不吸墨的明胶或其他硬胶片进行影印对一种载体表现的创建负责的一个集体行为者关联起来。 @zh-hans
toolkit label: 珂罗版制作者集体行为者 @zh-hans
toolkit definition: 通过利用一面吸墨而另一面不吸墨的明胶或其他硬胶片进行影印对一种载体表现的创建负责的一个集体行为者 @zh-hans
alternative label: agent collectif collotypiste @fr
alternative label: taş baskı uzmanı kolektif temsilcisi @tr
label: kolotip baskıcı kolektif temsilci ile ilişkilidir @tr
definition: Bir gösterimi, bir fotomekanik işlem kullanarak baskılar yapmak için kullanılan, mürekkep alıcı ve mürekkep itici yüzeylere sahip sertleştirilmiş bir jelatin veya diğer kolloid filmi hazırlayarak bir gösterim yaratmaktan sorumlu olan kolektif bir temsilci ile ilişkilendirir. @tr
toolkit label: taş baskıcı kolektif temsilcisi @tr
toolkit definition: Mürekkep alıcı ve mürekkep itici yüzeylere sahip olan ve fotomekanik bir işlem kullanarak baskı yapmak için kullanılan sertleştirilmiş bir jelatin veya diğer kolloid filmi hazırlayarak bir gösterim yaratmaktan sorumlu kolektif bir temsilci. @tr
alternative label: agente colectivo colotipista @es
label: tiene agente colectivo colotipador @es
definition: Relaciona una manifestación con un agente colectivo que es responsable de crear una manifestación preparando una película endurecida de gelatina u otro coloide que tenga superficies receptoras y repelentes de tinta y que se utilice para realizar impresiones mediante un proceso fotomecánico. @es
toolkit label: agente colectivo colotipador @es
toolkit definition: Un agente colectivo que es responsable de crear una manifestación preparando una película endurecida de gelatina u otro coloide que tenga superficies receptoras y repelentes de tinta y que se utilice para realizar impresiones mediante un proceso fotomecánico. @es
has subproperty: has collotyper corporate body
has subproperty: has collotyper family
has subproperty: P30386

has collotyper corporate body
status: Published
lexical alias: collotyperCorporateBody.en
definition: Relates a manifestation to a corporate body who is responsible for creating a manifestation by preparing a hardened film of gelatin or other colloid that has ink-receptive and ink-repellent surfaces and that is used to make prints using a photomechanical process.
toolkit label: collotyper corporate body
toolkit definition: A corporate body who is responsible for creating a manifestation by preparing a hardened film of gelatin or other colloid that has ink-receptive and ink-repellent surfaces and that is used to make prints using a photomechanical process.
type: Property
domain: C10007
has element type: 2
sub property of: has collotyper collective agent
label: kollotypian valmistaja (yhteisö) @fi
definition: Liittää manifestaation yhteisöön, joka on vastuussa manifestaation valmistamisesta tekemällä vedoksia suoraan kovettuneelta gelatiinifilmiltä tai muulta materiaalilta, jossa on mustetta imeviä ja hylkiviä pintoja. @fi
toolkit label: kollotypian valmistaja (yhteisö) @fi
toolkit definition: Yhteisö, joka on vastuussa manifestaation valmistamisesta tekemällä vedoksia suoraan kovettuneelta gelatiinifilmiltä tai muulta materiaalilta, jossa on mustetta imeviä ja hylkiviä pintoja. @fi
label: har lystrykker (korporasjon) @no
definition: Relaterer en manifestasjon til en korporasjon som er involvert i framstillingen av en manifestasjon ved å bruke en fotomekanisk prosess for å lage kopier direkte fra en stivnet film av gelatin eller et annet kolloid som har overflater som er mottagelige for blekk og motstandige mot blekk. @no
toolkit label: lystrykker (korporasjon) @no
toolkit definition: En korporasjon som er involvert i framstillingen av en manifestasjon ved å bruke en fotomekanisk prosess for å lage kopier direkte fra en stivnet film av gelatin eller et annet kolloid som har overflater som er mottagelige for blekk og motstandige mot blekk. @no
label: a pour collectivité phototypeuse @fr
definition: Met une manifestation en relation avec une collectivité qui est responsable de la création d’une manifestation en préparant un film durci de gélatine ou d’un autre colloïde présentant des surfaces réceptives et répulsives à l’encre et servant à réaliser des images imprimées à l’aide d’un procédé photomécanique. @fr
toolkit label: collectivité phototypeuse @fr
toolkit definition: Collectivité qui est responsable de la création d’une manifestation en préparant un film durci de gélatine ou d’un autre colloïde présentant des surfaces réceptives et répulsives à l’encre et servant à réaliser des images imprimées à l’aide d’un procédé photomécanique. @fr
label: heeft collotype-corporatie @nl
definition: Relateert een manifestatie aan een corporatie die is verantwoordelijk voor het creëren van een manifestatie middels het prepareren van een verharde film van gelatine of ander colloïde dat inktopnemende en inktafstotende oppervlakken heeft en die gebruikt wordt voor het maken van afdrukken met gebruikmaking van een fotomechanisch proces. @nl
toolkit label: collotype-corporatie @nl
toolkit definition: Een corporatie die is verantwoordelijk voor het creëren van een manifestatie middels het prepareren van een verharde film van gelatine of ander colloïde dat inktopnemende en inktafstotende oppervlakken heeft en die gebruikt wordt voor het maken van afdrukken met gebruikmaking van een fotomechanisch proces. @nl
label: له هيئة طباع صور @ar
definition: يربط بين تجسيدة وهيئة مسئولة عن تصنيع تجسيدة باستخدام عمليات ضوئية ميكانيكية لإنتاج المطبوعات مباشرة من فيلم صلد من الجيلاتين أو غيره من المواد الغروية التى تحتوي أسطح مستقبلة وطاردة للحبر. @ar
toolkit label: هيئة طباع صور @ar
toolkit definition: هيئة مسئولة عن تصنيع تجسيدة باستخدام عمليات ضوئية ميكانيكية لإنتاج المطبوعات مباشرة من فيلم صلد من الجيلاتين أو غيره من المواد الغروية التى تحتوي أسطح مستقبلة وطاردة للحبر. @ar
label: té com a entitat corporativa fototipista @ca
definition: Relaciona una manifestació amb una entitat corporativa que és responsable de la creació d’una manifestació mitjançant la preparació d’una pel·lícula endurida de gelatina o d’un altre col·loide que té superfícies que accepten o rebutgen la tinta i que s’usa per fer gravats usant un procés fotomecànic. @ca
toolkit label: entitat corporativa fototipista @ca
toolkit definition: Entitat corporativa que és responsable de la creació d’una manifestació mitjançant la preparació d’una pel·lícula endurida de gelatina o d’un altre col·loide que té superfícies que accepten o rebutgen la tinta i que s’usa per fer gravats usant un procés fotomecànic. @ca
label: har korporation, som er lystrykker @da
definition: Relaterer en manifestation til en korporation, som er involveret i fremstillingen af en manifestation vha. en fotomekanisk proces, hvorved der laves tryk direkte fra et hærdet gelatinelag eller andet kolloid, som har blækmodtagelige og blækafvisende overflader. @da
toolkit label: korporation, som er lystrykker @da
toolkit definition: Korporation, som er involveret i fremstillingen af en manifestation vha. en fotomekanisk proces, hvorved der laves tryk direkte fra et hærdet gelatinelag eller andet kolloid, som har blækmodtagelige og blækafvisende overflader. @da
label: kollotüübi valmistaja (asutus) @et
definition: Seostab kehastuse asutusega, kes osaleb kehastuse valmistamises, tehes fotomehaanilises protsessis tõmmiseid otse želatiini või muu kolloidi tahkunud kihilt, mille pind osalt seob värvainet, osalt ei seo. @et
toolkit label: kollotüübi valmistaja (asutus) @et
toolkit definition: Asutus, kes osaleb kehastuse valmistamises, tehes fotomehaanilises protsessis tõmmiseid otse želatiini või muu kolloidi tahkunud kihilt, mille pind osalt seob värvainet, osalt ei seo. @et
label: hat Lichtdruckerin/Lichtdrucker (Körperschaft) @de
definition: Setzt eine Manifestation in Beziehung zu einer Körperschaft, die für die Herstellung einer Manifestation verantwortlich ist, indem sie ein fotomechanisches Verfahren zur Herstellung von Abzügen direkt von einem gehärteten Film aus Gelatine oder einem anderen Kolloid verwendet, der druckerfarbenaufnehmende und -abweisende Oberflächen aufweist. @de
toolkit label: Lichtdruckerin/Lichtdrucker (Körperschaft) @de
toolkit definition: Eine Körperschaft, die für die Herstellung einer Manifestation verantwortlich ist, indem sie ein fotomechanisches Verfahren zur Herstellung von Abzügen direkt von einem gehärteten Film aus Gelatine oder einem anderen Kolloid verwendet, der druckerfarbenaufnehmende und -abweisende Oberflächen aufweist. @de
label: fénynyomatkészítő testülete a következő: @hu
definition: Hozzákapcsol egy megjelenési formát egy testülethez, amely felelős egy megjelenési forma gyártásáért oly módon, hogy fotómechanikai eljárás alkalmazásával nyomtatványokat állít elő közvetlenül olyan zselatin vagy más kolloid megkeményedett filmjéből, amelynek tintafelvevő és tintataszító felülete van. @hu
toolkit label: fénynyomatkészítő testület: @hu
toolkit definition: Egy testület, amely felelős egy megjelenési forma gyártásáért oly módon, hogy fotómechanikai eljárás alkalmazásával nyomtatványokat állít elő közvetlenül olyan zselatin vagy más kolloid megkeményedett filmjéből, amelynek tintafelvevő és tintataszító felülete van. @hu
label: ha come collotipista ente @it
definition: Correla una manifestazione all'ente coinvolto nella manifattura di una manifestazione, utilizzando un processo fotomeccanico per realizzare stampe direttamente da un film indurito di gelatina o altro colloide che ha superfici ricettive o repellenti all'inchiostro. @it
toolkit label: collotipista ente @it
toolkit definition: Ente coinvolto nella manifattura di una manifestazione, utilizzando un processo fotomeccanico per realizzare stampe direttamente da un film indurito di gelatina o altro colloide che ha superfici ricettive o repellenti all'inchiostro. @it
label: fotogravieris (institūcija) @lv
definition: Sasaista manifestāciju ar institūciju, kas iesaistīta manifestācijas ražošanā, izmantojot fotomehānisku procesu, lai izgatavotu izdrukas tieši no plates, kas pārklāta ar gaismjutīga hromželatīna slāni vai citu koloīdu, kuram ir tinti piesaistošas un tinti atgrūdošas virsmas. @lv
toolkit label: fotogravieris (institūcija) @lv
toolkit definition: Institūcija, kas iesaistīta manifestācijas ražošanā, izmantojot fotomehānisku procesu, lai izgatavotu izdrukas tieši no plates, kas pārklāta ar gaismjutīga hromželatīna slāni vai citu koloīdu, kuram ir tinti piesaistošas un tinti atgrūdošas virsmas. @lv
alternative label: collotypist corporate body
sub property of: has platemaker corporate body
alternative label: - @fi
alternative label: 珂罗版制作者团体 @zh-hans
label: 有珂罗版制作者团体 @zh-hans
definition: 将一种载体表现与通过利用一面吸墨而另一面不吸墨的明胶或其他硬胶片进行影印对一种载体表现的创建负责的一个团体关联起来。 @zh-hans
toolkit label: 珂罗版制作者团体 @zh-hans
toolkit definition: 通过利用一面吸墨而另一面不吸墨的明胶或其他硬胶片进行影印对一种载体表现的创建负责的一个团体 @zh-hans
alternative label: collectivité collotypiste @fr
alternative label: taş baskı uzmanı tüzel kişisi @tr
label: kolotip baskıcı tüzel kişi ile ilişkilidir @tr
definition: Bir gösterimi, mürekkep alıcı ve mürekkep itici yüzeylere sahip olan ve fotomekanik bir işlem kullanarak baskılar yapmak için kullanılan jelatin veya diğer kolloidden sertleştirilmiş bir film hazırlayarak bir gösterim yaratmaktan sorumlu olan bir tüzel kişi ile ilişkilendirir. @tr
toolkit label: taş baskıcı tüzel kişisi @tr
toolkit definition: Mürekkep alıcı ve mürekkep itici yüzeylere sahip olan ve fotomekanik bir işlem kullanarak baskı yapmak için kullanılan sertleştirilmiş bir jelatin veya diğer kolloid filmi hazırlayarak bir gösterim yaratmaktan sorumlu olan bir tüzel kişi. @tr
alternative label: cuerpo corporativo colotipista @es
label: tiene cuerpo corporativo colotipador @es
definition: Relaciona una manifestación con un cuerpo corporativo que es responsable de crear una manifestación mediante la preparación de una película endurecida de gelatina u otro coloide que tenga superficies receptoras y repelentes de tinta y que se utilice para realizar impresiones mediante un proceso fotomecánico. @es
toolkit label: cuerpo corporativo colotipador @es
toolkit definition: Un cuerpo corporativo que es responsable de crear una manifestación mediante la preparación de una película endurecida de gelatina u otro coloide que tenga superficies receptoras y repelentes de tinta y que se utilice para realizar impresiones mediante un proceso fotomecánico. @es
has subproperty: P30415
alternative label: collotype-corporatie @nl

has collotyper family
status: Published
lexical alias: collotyperFamily.en
definition: Relates a manifestation to a family who is responsible for creating a manifestation by preparing a hardened film of gelatin or other colloid that has ink-receptive and ink-repellent surfaces and that is used to make prints using a photomechanical process.
toolkit label: collotyper family
toolkit definition: A family who is responsible for creating a manifestation by preparing a hardened film of gelatin or other colloid that has ink-receptive and ink-repellent surfaces and that is used to make prints using a photomechanical process.
type: Property
domain: C10007
has element type: 2
sub property of: has collotyper collective agent
label: kollotypian valmistaja (suku) @fi
definition: Liittää manifestaation sukuun, joka on vastuussa manifestaation valmistamisesta tekemällä vedoksia suoraan kovettuneelta gelatiinifilmiltä tai muulta materiaalilta, jossa on mustetta imeviä ja hylkiviä pintoja. @fi
toolkit label: kollotypian valmistaja (suku) @fi
toolkit definition: Suku, joka on vastuussa manifestaation valmistamisesta tekemällä vedoksia suoraan kovettuneelta gelatiinifilmiltä tai muulta materiaalilta, jossa on mustetta imeviä ja hylkiviä pintoja. @fi
label: har lystrykker (familie) @no
definition: Relaterer en manifestasjon til en familie som er involvert i framstillingen av en manifestasjon ved å bruke en fotomekanisk prosess for å lage kopier direkte fra en stivnet film av gelatin eller et annet kolloid som har overflater som er mottagelige for blekk og motstandige mot blekk. @no
toolkit label: lystrykker (familie) @no
toolkit definition: En familie som er involvert i framstillingen av en manifestasjon ved å bruke en fotomekanisk prosess for å lage kopier direkte fra en stivnet film av gelatin eller et annet kolloid som har overflater som er mottagelige for blekk og motstandige mot blekk. @no
label: a pour famille phototypeuse @fr
definition: Met une manifestation en relation avec une famille qui est responsable de la création d’une manifestation en préparant un film durci de gélatine ou d’un autre colloïde présentant des surfaces réceptives et répulsives à l’encre et servant à réaliser des images imprimées à l’aide d’un procédé photomécanique. @fr
toolkit label: famille phototypeuse @fr
toolkit definition: Famille qui est responsable de la création d’une manifestation en préparant un film durci de gélatine ou d’un autre colloïde présentant des surfaces réceptives et répulsives à l’encre et servant à réaliser des images imprimées à l’aide d’un procédé photomécanique. @fr
label: heeft collotype-familie @nl
definition: Relateert een manifestatie aan een familie die is verantwoordelijk voor het creëren van een manifestatie middels het prepareren van een verharde film van gelatine of ander colloïde dat inktopnemende en inktafstotende oppervlakken heeft en die gebruikt wordt voor het maken van afdrukken met gebruikmaking van een fotomechanisch proces. @nl
toolkit label: collotype-familie @nl
toolkit definition: Een familie die is verantwoordelijk voor het creëren van een manifestatie middels het prepareren van een verharde film van gelatine of ander colloïde dat inktopnemende en inktafstotende oppervlakken heeft en die gebruikt wordt voor het maken van afdrukken met gebruikmaking van een fotomechanisch proces. @nl
label: له عائلة طباع صور @ar
definition: يربط تجسيدة وعائلة مسئولة عن تصنيع تجسيدة باستخدام عمليات ضوئية ميكانيكية لإنتاج المطبوعات مباشرة من فيلم صلد من الجيلاتين أو غيره من المواد الغروية التى تحتوي أسطح مستقبلة وطاردة للحبر. @ar
toolkit label: عائلة طباع صور @ar
toolkit definition: عائلة مسئولة عن تصنيع تجسيدة باستخدام عمليات ضوئية ميكانيكية لإنتاج المطبوعات مباشرة من فيلم صلد من الجيلاتين أو غيره من المواد الغروية التى تحتوي أسطح مستقبلة وطاردة للحبر. @ar
label: té com a família fototipista @ca
definition: Relaciona una manifestació amb una família que és responsable de la creació d’una manifestació mitjançant la preparació d’una pel·lícula endurida de gelatina o d’un altre col·loide que té superfícies que accepten o rebutgen la tinta i que s’usa per fer gravats usant un procés fotomecànic. @ca
toolkit label: família fototipista @ca
toolkit definition: Família que és responsable de la creació d’una manifestació mitjançant la preparació d’una pel·lícula endurida de gelatina o d’un altre col·loide que té superfícies que accepten o rebutgen la tinta i que s’usa per fer gravats usant un procés fotomecànic. @ca
label: har familie, som er lystrykker @da
definition: Relaterer en manifestation til en familie, som er involveret i fremstillingen af en manifestation vha. en fotomekanisk proces, hvorved der laves tryk direkte fra et hærdet gelatinelag eller andet kolloid, som har blækmodtagelige og blækafvisende overflader. @da
toolkit label: familie, som er lystrykker @da
toolkit definition: Familie, som er involveret i fremstillingen af en manifestation vha. en fotomekanisk proces, hvorved der laves tryk direkte fra et hærdet gelatinelag eller andet kolloid, som har blækmodtagelige og blækafvisende overflader. @da
label: kollotüübi valmistaja (perekond) @et
definition: Seostab kehastuse perekonnaga, kes osaleb kehastuse valmistamises, tehes fotomehaanilises protsessis tõmmiseid otse želatiini või muu kolloidi tahkunud kihilt, mille pind osalt seob värvainet, osalt ei seo. @et
toolkit label: kollotüübi valmistaja (perekond) @et
toolkit definition: Perekond, kes osaleb kehastuse valmistamises, tehes fotomehaanilises protsessis tõmmiseid otse želatiini või muu kolloidi tahkunud kihilt, mille pind osalt seob värvainet, osalt ei seo. @et
label: hat Lichtdruckerin/Lichtdrucker (Familie) @de
definition: Setzt eine Manifestation in Beziehung zu einer Familie, die für die Herstellung einer Manifestation verantwortlich ist, indem sie ein fotomechanisches Verfahren zur Herstellung von Abzügen direkt von einem gehärteten Film aus Gelatine oder einem anderen Kolloid verwendet, der druckerfarbenaufnehmende und -abweisende Oberflächen aufweist. @de
toolkit label: Lichtdruckerin/Lichtdrucker (Familie) @de
toolkit definition: Eine Familie, die für die Herstellung einer Manifestation verantwortlich ist, indem sie ein fotomechanisches Verfahren zur Herstellung von Abzügen direkt von einem gehärteten Film aus Gelatine oder einem anderen Kolloid verwendet, der druckerfarbenaufnehmende und -abweisende Oberflächen aufweist. @de
label: fénynyomatkészítő családja a következő: @hu
definition: Hozzákapcsol egy megjelenési formát egy családhoz, amely felelős egy megjelenési forma gyártásáért oly módon, hogy fotómechanikai eljárás alkalmazásával nyomtatványokat állít elő közvetlenül olyan zselatin vagy más kolloid megkeményedett filmjéből, amelynek tintafelvevő és tintataszító felülete van. @hu
toolkit label: fénynyomatkészítő család: @hu
toolkit definition: Egy család, amely felelős egy megjelenési forma gyártásáért oly módon, hogy fotómechanikai eljárás alkalmazásával nyomtatványokat állít elő közvetlenül olyan zselatin vagy más kolloid megkeményedett filmjéből, amelynek tintafelvevő és tintataszító felülete van. @hu
label: ha come collotipista famiglia @it
definition: Correla una manifestazione alla famiglia coinvolta nella manifattura di una manifestazione, utilizzando un processo fotomeccanico per realizzare stampe direttamente da un film indurito di gelatina o altro colloide che ha superfici ricettive o repellenti all'inchiostro. @it
toolkit label: collotipista famiglia @it
toolkit definition: Famiglia coinvolta nella manifattura di una manifestazione, utilizzando un processo fotomeccanico per realizzare stampe direttamente da un film indurito di gelatina o altro colloide che ha superfici ricettive o repellenti all'inchiostro. @it
label: fotogravieris (dzimta/ģimene) @lv
definition: Sasaista manifestāciju ar dzimtu/ģimeni, kas iesaistīta manifestācijas ražošanā, izmantojot fotomehānisku procesu, lai izgatavotu izdrukas tieši no plates, kas pārklāta ar gaismjutīga hromželatīna slāni vai citu koloīdu, kuram ir tinti piesaistošas un tinti atgrūdošas virsmas. @lv
toolkit label: fotogravieris (dzimta/ģimene) @lv
toolkit definition: Dzimta/ģimene, kas iesaistīta manifestācijas ražošanā, izmantojot fotomehānisku procesu, lai izgatavotu izdrukas tieši no plates, kas pārklāta ar gaismjutīga hromželatīna slāni vai citu koloīdu, kuram ir tinti piesaistošas un tinti atgrūdošas virsmas. @lv
alternative label: collotypist family
sub property of: has platemaker family
alternative label: - @fi
alternative label: 珂罗版制作者家族 @zh-hans
label: 有珂罗版制作者家族 @zh-hans
definition: 将一种载体表现与通过利用一面吸墨而另一面不吸墨的明胶或其他硬胶片进行影印对一种载体表现的创建负责的一个家族关联起来。 @zh-hans
toolkit label: 珂罗版制作者家族 @zh-hans
toolkit definition: 通过利用一面吸墨而另一面不吸墨的明胶或其他硬胶片进行影印对一种载体表现的创建负责的一个家族 @zh-hans
alternative label: famille collotypiste @fr
alternative label: taş baskı uzmanı ailesi @tr
label: kolotip baskıcı aile ile ilişkilidir @tr
definition: Bir gösterimi, mürekkep alıcı ve mürekkep itici yüzeylere sahip olan ve bir fotomekanik işlem kullanarak baskılar yapmak için kullanılan sertleştirilmiş bir jelatin veya diğer kolloid filmini hazırlayarak bir gösterim oluşturmakla sorumlu aileyle ilişkilendirir. @tr
toolkit label: taş baskıcı aile @tr
toolkit definition: Mürekkep alıcı ve mürekkep itici yüzeylere sahip olan ve bir fotomekanik işlem kullanarak baskılar yapmak için kullanılan sertleştirilmiş bir jelatin veya diğer kolloid filmini hazırlayarak bir gösterim oluşturmakla sorumlu aile. @tr
alternative label: familia colotipista @es
label: tiene familia colotipiadora @es
definition: Relaciona una manifestación con una familia que es responsable de crear una manifestación al preparar una película endurecida de gelatina u otro coloide que tenga superficies receptoras y repelentes de tinta y que es utilizada para realizar impresiones mediante un proceso fotomecánico. @es
toolkit label: familia colotipiadora @es
toolkit definition: Una familia que es responsable de crear una manifestación al preparar una película endurecida de gelatina u otro coloide que tenga superficies receptoras y repelentes de tinta y que es utilizada para realizar impresiones mediante un proceso fotomecánico. @es
has subproperty: P30444
alternative label: collotype-familie @nl

has collotyper person
status: Published
lexical alias: collotyperPerson.en
definition: Relates a manifestation to a person who is responsible for creating a manifestation by preparing a hardened film of gelatin or other colloid that has ink-receptive and ink-repellent surfaces and that is used to make prints using a photomechanical process.
toolkit label: collotyper person
toolkit definition: A person who is responsible for creating a manifestation by preparing a hardened film of gelatin or other colloid that has ink-receptive and ink-repellent surfaces and that is used to make prints using a photomechanical process.
type: Property
domain: C10007
has element type: 2
sub property of: has collotyper agent
label: kollotypian valmistaja (henkilö) @fi
definition: Liittää manifestaation henkilöön, joka on vastuussa manifestaation valmistamisesta tekemällä vedoksia suoraan kovettuneelta gelatiinifilmiltä tai muulta materiaalilta, jossa on mustetta imeviä ja hylkiviä pintoja. @fi
toolkit label: kollotypian valmistaja (henkilö) @fi
toolkit definition: Henkilö, joka on vastuussa manifestaation valmistamisesta tekemällä vedoksia suoraan kovettuneelta gelatiinifilmiltä tai muulta materiaalilta, jossa on mustetta imeviä ja hylkiviä pintoja. @fi
label: har lystrykker (person) @no
definition: Relaterer en manifestasjon til en person som er involvert i framstillingen av en manifestasjon ved å bruke en fotomekanisk prosess for å lage kopier direkte fra en stivnet film av gelatin eller et annet kolloid som har overflater som er mottagelige for blekk og motstandige mot blekk. @no
toolkit label: lystrykker (person) @no
toolkit definition: En person som er involvert i framstillingen av en manifestasjon ved å bruke en fotomekanisk prosess for å lage kopier direkte fra en stivnet film av gelatin eller et annet kolloid som har overflater som er mottagelige for blekk og motstandige mot blekk. @no
label: a pour personne phototypeuse @fr
definition: Met une manifestation en relation avec une personne qui est responsable de la création d’une manifestation en préparant un film durci de gélatine ou d’un autre colloïde présentant des surfaces réceptives et répulsives à l’encre et servant à réaliser des images imprimées à l’aide d’un procédé photomécanique. @fr
toolkit label: personne phototypeuse @fr
toolkit definition: Personne qui est responsable de la création d’une manifestation en préparant un film durci de gélatine ou d’un autre colloïde présentant des surfaces réceptives et répulsives à l’encre et servant à réaliser des images imprimées à l’aide d’un procédé photomécanique. @fr
label: heeft collotype-persoon @nl
definition: Relateert een manifestatie aan een persoon die is verantwoordelijk voor het creëren van een manifestatie middels het prepareren van een verharde film van gelatine of ander colloïde dat inktopnemende en inktafstotende oppervlakken heeft en die gebruikt wordt voor het maken van afdrukken met gebruikmaking van een fotomechanisch proces. @nl
toolkit label: collotype-persoon @nl
toolkit definition: Een persoon die is verantwoordelijk voor het creëren van een manifestatie middels het prepareren van een verharde film van gelatine of ander colloïde dat inktopnemende en inktafstotende oppervlakken heeft en die gebruikt wordt voor het maken van afdrukken met gebruikmaking van een fotomechanisch proces. @nl
label: له شخص طباع صور @ar
definition: يربط بين تجسيدة وشخص مسئول عن تصنيع تجسيدة باستخدام عمليات ضوئية ميكانيكية لإنتاج المطبوعات مباشرة من فيلم صلد من الجيلاتين أو غيره من المواد الغروية التى تحتوي أسطح مستقبلة وطاردة للحبر. @ar
toolkit label: شخص طباع صور @ar
toolkit definition: شخص مسئول عن تصنيع تجسيدة باستخدام عمليات ضوئية ميكانيكية لإنتاج المطبوعات مباشرة من فيلم صلد من الجيلاتين أو غيره من المواد الغروية التى تحتوي أسطح مستقبلة وطاردة للحبر. @ar
label: té com a persona fototipista @ca
definition: Relaciona una manifestació amb una persona que és responsable de la creació d’una manifestació mitjançant la preparació d’una pel·lícula endurida de gelatina o d’un altre col·loide que té superfícies que accepten o rebutgen la tinta que s’usa per fer gravats usant un procés fotomecànic. @ca
toolkit label: persona fototipista @ca
toolkit definition: Persona que és responsable de la creació d’una manifestació mitjançant la preparació d’una pel·lícula endurida de gelatina o d’un altre col·loide que té superfícies que accepten o rebutgen la tinta que susa per fer gravats usant un procés fotomecànic. @ca
label: har person, som er lystrykker @da
definition: Relaterer en manifestation til en person, som er involveret i fremstillingen af en manifestation vha. en fotomekanisk proces, hvorved der laves tryk direkte fra et hærdet gelatinelag eller andet kolloid, som har blækmodtagelige og blækafvisende overflader. @da
toolkit label: person, som er lystrykker @da
toolkit definition: Person, som er involveret i fremstillingen af en manifestation vha. en fotomekanisk proces, hvorved der laves tryk direkte fra et hærdet gelatinelag eller andet kolloid, som har blækmodtagelige og blækafvisende overflader. @da
label: kollotüübi valmistaja (isik) @et
definition: Seostab kehastuse isikuga, kes osaleb kehastuse valmistamises, tehes fotomehaanilises protsessis tõmmiseid otse želatiini või muu kolloidi tahkunud kihilt, mille pind osalt seob värvainet, osalt ei seo. @et
toolkit label: kollotüübi valmistaja (isik) @et
toolkit definition: Isik, kes osaleb kehastuse valmistamises, tehes fotomehaanilises protsessis tõmmiseid otse želatiini või muu kolloidi tahkunud kihilt, mille pind osalt seob värvainet, osalt ei seo. @et
label: hat Lichtdruckerin/Lichtdrucker (Person) @de
definition: Setzt eine Manifestation in Beziehung zu einer Person, die für die Herstellung einer Manifestation verantwortlich ist, indem sie ein fotomechanisches Verfahren zur Herstellung von Abzügen direkt von einem gehärteten Film aus Gelatine oder einem anderen Kolloid verwendet, der druckerfarbenaufnehmende und -abweisende Oberflächen aufweist. @de
toolkit label: Lichtdruckerin/Lichtdrucker (Person) @de
toolkit definition: Eine Person, die für die Herstellung einer Manifestation verantwortlich ist, indem sie ein fotomechanisches Verfahren zur Herstellung von Abzügen direkt von einem gehärteten Film aus Gelatine oder einem anderen Kolloid verwendet, der druckerfarbenaufnehmende und -abweisende Oberflächen aufweist. @de
label: fénynyomatkészítő személye a következő: @hu
definition: Hozzákapcsol egy megjelenési formát egy személyhez, aki felelős egy megjelenési forma gyártásáért oly módon, hogy fotómechanikai eljárás alkalmazásával nyomtatványokat állít elő közvetlenül olyan zselatin vagy más kolloid megkeményedett filmjéből, amelynek tintafelvevő és tintataszító felülete van. @hu
toolkit label: fénynyomatkészítő személy: @hu
toolkit definition: Egy személy, aki felelős egy megjelenési forma gyártásáért oly módon, hogy fotómechanikai eljárás alkalmazásával nyomtatványokat állít elő közvetlenül olyan zselatin vagy más kolloid megkeményedett filmjéből, amelynek tintafelvevő és tintataszító felülete van. @hu
label: ha come collotipista persona @it
definition: Correla una manifestazione alla persona coinvolta nella manifattura di una manifestazione, utilizzando un processo fotomeccanico per realizzare stampe direttamente da un film indurito di gelatina o altro colloide che ha superfici ricettive o repellenti all'inchiostro. @it
toolkit label: collotipista persona @it
toolkit definition: Persona coinvolta nella manifattura di una manifestazione, utilizzando un processo fotomeccanico per realizzare stampe direttamente da un film indurito di gelatina o altro colloide che ha superfici ricettive o repellenti all'inchiostro. @it
label: fotogravieris (persona) @lv
definition: Sasaista manifestāciju ar personu, kura iesaistīta manifestācijas ražošanā, izmantojot fotomehānisku procesu, lai izgatavotu izdrukas tieši no plates, kas pārklāta ar gaismjutīga hromželatīna slāni vai citu koloīdu, kuram ir tinti piesaistošas un tinti atgrūdošas virsmas. @lv
toolkit label: fotogravieris (persona) @lv
toolkit definition: Persona, kura iesaistīta manifestācijas ražošanā, izmantojot fotomehānisku procesu, lai izgatavotu izdrukas tieši no plates, kas pārklāta ar gaismjutīga hromželatīna slāni vai citu koloīdu, kuram ir tinti piesaistošas un tinti atgrūdošas virsmas. @lv
alternative label: collotypist person
sub property of: has platemaker person
alternative label: - @fi
alternative label: 珂罗版制作者个人 @zh-hans
label: 有珂罗版制作者个人 @zh-hans
definition: 将一种载体表现与通过利用一面吸墨而另一面不吸墨的明胶或其他硬胶片进行影印对一种载体表现的创建负责的一个个人关联起来。 @zh-hans
toolkit label: 珂罗版制作者个人 @zh-hans
toolkit definition: 通过利用一面吸墨而另一面不吸墨的明胶或其他硬胶片进行影印对一种载体表现的创建负责的一个个人 @zh-hans
alternative label: personne collotypiste @fr
alternative label: taş baskı uzmanı @tr
label: kolotip baskıcı ile ilişkilidir @tr
definition: Bir gösterimi, mürekkep alıcı ve mürekkep itici yüzeylere sahip olan ve fotomekanik bir işlem kullanarak baskılar yapmak için kullanılan sertleştirilmiş bir jelatin veya diğer kolloid filmi hazırlayarak bir gösterim yaratmaktan sorumlu olan bir kişiyle ilişkilendirir. @tr
toolkit label: taş baskıcı @tr
toolkit definition: Mürekkep alıcı ve mürekkep itici yüzeylere sahip olan ve fotomekanik bir işlem kullanarak baskı yapmak için kullanılan sertleştirilmiş bir jelatin veya diğer kolloid filmi hazırlayarak bir gösterim yaratmaktan sorumlu olan kişi. @tr
alternative label: persona colotipista @es
label: tiene persona colotipadora @es
definition: Relaciona una manifestación con una persona que es responsable de crear una manifestación preparando una película endurecida de gelatina u otro coloide que tenga superficies receptoras y repelentes de tinta y que se utiliza para realizar impresiones mediante un proceso fotomecánico. @es
toolkit label: persona colotipadora @es
toolkit definition: Una persona que es responsable de crear una manifestación preparando una película endurecida de gelatina u otro coloide que tenga superficies receptoras y repelentes de tinta y que se utiliza para realizar impresiones mediante un proceso fotomecánico. @es
has subproperty: P30357
alternative label: collotype-persoon @nl

is commentary on (manifestation) (Deprecated)
status: Deprecated
type: Property
toolkit definition: A manifestation used as the basis for a set of explanatory or critical notes. (Deprecated)
toolkit label: commentary on (manifestation) (Deprecated)
definition: Relates a work to a manifestation used as the basis for a set of explanatory or critical notes. (Deprecated)
sub property of: is description of (manifestation) (Deprecated)
lexical alias: commentaryOnManifestation.en
domain: C10001

has contributor agent of cartography
status: Published
lexical alias: contributorAgentOfCartography.en
definition: Relates a manifestation to an agent who is a contributor to aggregate who creates an expression of a cartographic work that is embodied by an aggregate.
toolkit label: contributor agent of cartography
toolkit definition: An agent who is a contributor to aggregate who creates an expression of a cartographic work that is embodied by an aggregate.
type: Property
domain: C10007
sub property of: has contributor agent to aggregate
instruction number: 18.5
has element type: 2
alternative label: cartographer (expression)
label: kartografiaan osallinen toimija @fi
definition: Liittää manifestaation aggregaattiin osalliseen toimijaan, joka on luonut aggregaattiin sisältyvän kartografisen teoksen ekspression. @fi
toolkit label: kartografiaan osallinen toimija @fi
toolkit definition: Aggregaattiin osallinen toimija, joka on luonut aggregaattiin sisältyvän kartografisen teoksen ekspression. @fi
label: har bidragsyter til kartografi (agent) @no
definition: Relaterer en manifestasjon til en agent som er en bidragsyter til aggregat som skaper et kartografisk verk som er realisert i et aggregat. @no
toolkit label: bidragsyter til kartografi (agent) @no
toolkit definition: En agent som er en bidragsyter til aggregat som skaper et kartografisk verk som er realisert i et aggregat. @no
label: a pour agent contributeur de cartographie @fr
definition: Met une manifestation en relation avec un agent contributeur à un agrégat qui crée une expression d’une œuvre cartographique matérialisée par un agrégat. @fr
toolkit label: agent contributeur de cartographie @fr
toolkit definition: Agent contributeur à un agrégat qui crée une expression d’une œuvre cartographique matérialisée par un agrégat. @fr
label: heeft bijdrager-actor van cartografie @nl
definition: Relateert een manifestatie aan een actor die een bijdrager aan aggregaat is die een expressie van een cartografisch werk creëert die is verwezenlijkt in een aggregaat. @nl
toolkit label: bijdrager-actor van cartografie @nl
toolkit definition: Een actor die een bijdrager aan aggregaat is die een expressie van een cartografisch werk creëert die is verwezenlijkt in een aggregaat. @nl
alternative label: kartografi (ekspressio) @fi
label: له وكيل مساهم برسم خرائط @ar
definition: يربط بين تجسيدة ووكيل مساهم في عمل تجميعي ينشيء عمل خرائطي ويتجسد في تجميعية. @ar
toolkit label: وكيل مساهم برسم خرائط @ar
toolkit definition: وكيل مساهم في عمل تجميعي ينشيء عمل خرائطي ويتجسد في تجميعية. @ar
label: té com a agent contribuïdor de cartografia @ca
definition: Relaciona una manifestació amb un agent que és un contribuïdor a un agregat i que crea una expressió d’una obra cartogràfica que es materialitza en un agregat. @ca
toolkit label: agent contribuïdor de cartografia @ca
toolkit definition: Agent que és un contribuïdor a un agregat i que crea una expressió d’una obra cartogràfica que es materialitza en un agregat. @ca
label: har agent, som er bidragsyder til kartografi @da
definition: Relaterer en manifestation til en agent, som er bidragsyder til samling, som skaber et kartografisk værk, der er indeholdt i en samling. @da
toolkit label: agent, som er bidragsyder til kartografi @da
toolkit definition: Agent, som er bidragsyder til samling, som skaber et kartografisk værk, der er indeholdt i en samling. @da
label: kaastööline kartograafia alal (tegija) @et
definition: Seostab kehastuse tegijaga, kes on liitumi kaastööline, luues kartograafilise teose väljenduse, mis on teostatud liitumis. @et
toolkit label: kaastööline kartograafia alal (tegija) @et
toolkit definition: Tegija, kes on liitumi kaastööline, luues kartograafilise teose väljenduse, mis on teostatud liitumis. @et
label: hat Beiträgerin/Beiträger von einer Kartografie (Akteur) @de
definition: Setzt eine Manifestation in Beziehung zu einer Beiträgerin/einem Beiträger zu einem Aggregat (Akteur), die/der eine Expression eines kartografischen Werks erstellt, die durch ein Aggregat verkörpert wird. @de
toolkit label: Beiträgerin/Beiträger von einer Kartografie (Akteur) @de
toolkit definition: Eine Beiträgerin/Ein Beiträger zu einem Aggregat (Akteur), die/der eine Expression eines kartografischen Werks erstellt, die durch ein Aggregat verkörpert wird. @de
label: kartográfia közreműködő ágense a következő: @hu
definition: Hozzákapcsol egy megjelenési formát egy ágenshez, amely aggregátor közreműködőként egy kartográfiai mű olyan kifejezési formáját hozza létre, amely egy aggregátumban testesül meg. @hu
toolkit label: kartográfia közreműködő ágense: @hu
toolkit definition: Egy ágens, amely aggregátor közreműködőként egy kartográfiai mű olyan kifejezési formáját hozza létre, amely egy aggregátumban testesül meg. @hu
label: kartogrāfijas līdzradītājs (aģents) @lv
definition: Sasaista manifestāciju ar aģentu, kas ir līdzradītājs, kas radījis apkopojumā ietverto kartogrāfisko darbu. @lv
toolkit label: kartogrāfijas līdzradītājs (aģents) @lv
toolkit definition: Aģents - līdzradītājs, kas radījis apkopojumā ietverto kartogrāfisko darbu. @lv
alternative label: cartographe (expression) @fr
alternative label: رسام خرائط (تعبيرة) @ar
alternative label: kartograf @da
alternative label: Kartograf (Expression) @de
alternative label: cartògraf (expressió) @ca
alternative label: 地图绘制者（内容表达） @zh-hans
label: 有地图绘制贡献者行为者 @zh-hans
definition: 将一种载体表现与作为合集的一个贡献者并创建被一种合集具体化的一种地图作品的一种内容表达的一个行为者关联起来。 @zh-hans
toolkit label: 地图绘制贡献者行为者 @zh-hans
toolkit definition: 作为合集的一个贡献者并创建被一种合集集体化的一种地图作品的一种内容表达的一个行为者 @zh-hans
alternative label: térképésze (kifejezési forma): @hu
alternative label: katograf (anlatım) @tr
label: kartografiye katkıda bulunan temsilci ile ilişkilidir @tr
definition: Bir gösterimi, bir bütün tarafından somutlaştırılan bir kartografik çalışmanın görüntüsü oluşturan bütünün bir parçası olan temsilciyle ilişkilendirir. @tr
toolkit label: kartografyaya katkıda bulunan temsilci @tr
toolkit definition: Bir topluluk tarafından somutlaştırılan bir kartografik eserin ifadesini yaratan ve bu topluluğa katkıda bulunan temsilci. @tr
alternative label: cartógrafo (expresión) @es
label: tiene agente colaborador de cartografía @es
definition: Relaciona una manifestación con un agente aportante del agregado que crea una expresión de una obra cartográfica que es encarnada por un agregado. @es
toolkit label: agente colaborador de cartografía @es
toolkit definition: Un agente aportante del agregado que crea una expresión de una obra cartográfica que es encarnada por un agregado. @es
has subproperty: has contributor collective agent of cartography
has subproperty: has contributor person of cartography
has subproperty: has surveyor agent

has contributor agent of choreography
status: Published
lexical alias: contributorAgentOfChoreography.en
definition: Relates a manifestation to an agent who is a contributor to aggregate who creates an expression of a choreographic work that is embodied by an aggregate.
toolkit label: contributor agent of choreography
toolkit definition: An agent who is a contributor to aggregate who creates an expression of a choreographic work that is embodied by an aggregate.
type: Property
domain: C10007
sub property of: has contributor agent to aggregate
instruction number: 18.5
has element type: 2
label: koreografiaan osallinen toimija @fi
definition: Liittää manifestaation aggregaattiin osalliseen toimijaan, joka on luonut aggregaattiin sisältyvän koreografisen teoksen ekspression. @fi
toolkit label: koreografiaan osallinen toimija @fi
toolkit definition: Aggregaattiin osallinen toimija, joka on luonut aggregaattiin sisältyvän koreografisen teoksen ekspression. @fi
label: har bidragsyter til koreografi (agent) @no
definition: Relaterer en manifestasjon til en agent som er en bidragsyter til aggregat som skaper et koreografisk verk som er realisert i et aggregat. @no
toolkit label: bidragsyter til koreografi (agent) @no
toolkit definition: En agent som er en bidragsyter til aggregat som skaper et koreografisk verk som er realisert i et aggregat. @no
label: a pour agent contributeur de chorégraphie @fr
definition: Met une manifestation en relation avec un agent contributeur à un agrégat qui crée une expression d’une œuvre chorégraphique matérialisée par un agrégat. @fr
toolkit label: agent contributeur de chorégraphie @fr
toolkit definition: Agent contributeur à un agrégat qui crée une expression d’une œuvre chorégraphique matérialisée par un agrégat. @fr
label: heeft bijdrager-actor van choreografie @nl
definition: Relateert een manifestatie aan een actor die een bijdrager aan aggregaat is die een expressie van een choreografisch werk creëert die is verwezenlijkt in een aggregaat. @nl
toolkit label: bijdrager-actor van choreografie @nl
toolkit definition: Een actor die een bijdrager aan aggregaat is die een expressie van een choreografisch werk creëert die is verwezenlijkt in een aggregaat. @nl
label: له وكيل مساهم بتصميم رقصات @ar
definition: يربط بين تجسيدة ووكيل مساهم في عمل تجميعي ينشيء عمل من تصميم الرقصات يتجسيد في تجميعية. @ar
toolkit label: وكيل مساهم بتصميم رقصات @ar
toolkit definition: وكيل مساهم في عمل تجميعي ينشيء عمل من تصميم الرقصات يتجسيد في تجميعية. @ar
label: té com a agent contribuïdor de coreografia @ca
definition: Relaciona una manifestació amb un agent que és un contribuïdor a un agregat i que crea una expressió d’una obra coreogràfica que es materialitza en un agregat. @ca
toolkit label: agent contribuïdor de coreografia @ca
toolkit definition: Agent que és un contribuïdor a un agregat i que crea una expressió d’una obra coreogràfica que es materialitza en un agregat. @ca
label: har agent, som er bidragsyder til koreografi @da
definition: Relaterer en manifestation til en agent, som er bidragsyder til samling, som skaber et koreografisk værk, der er indeholdt i en samling. @da
toolkit label: agent, som er bidragsyder til koreografi @da
toolkit definition: Agent, som er bidragsyder til samling, som skaber et koreografisk værk, der er indeholdt i en samling. @da
label: kaastööline koreograafia alal (tegija) @et
definition: Seostab kehastuse tegijaga, kes on liitumi kaastööline, luues koreograafilise teose väljenduse, mis on teostatud liitumis. @et
toolkit label: kaastööline koreograafia alal (tegija) @et
toolkit definition: Tegija, kes on liitumi kaastööline, luues koreograafilise teose väljenduse, mis on teostatud liitumis. @et
label: hat Beiträgerin/Beiträger von einer Choreografie (Akteur) @de
definition: Setzt eine Manifestation in Beziehung zu einer Beiträgerin/einem Beiträger zu einem Aggregat (Akteur), die/der eine Expression eines choreografischen Werks erstellt, die durch ein Aggregat verkörpert wird. @de
toolkit label: Beiträgerin/Beiträger von einer Choreografie (Akteur) @de
toolkit definition: Eine Beiträgerin/Ein Beiträger zu einem Aggregat (Akteur), die/der eine Expression eines choreografischen Werks erstellt, die durch ein Aggregat verkörpert wird. @de
label: koreográfia közreműködő ágense a következő: @hu
definition: Hozzákapcsol egy megjelenési formát egy ágenshez, amely aggregátor közreműködőként egy koreografikus mű olyan kifejezési formáját hozza létre, amely egy aggregátumban testesül meg. @hu
toolkit label: közreműködő ágense: @hu
toolkit definition: Egy ágens, amely aggregátor közreműködőként egy koreografikus mű olyan kifejezési formáját hozza létre, amely egy aggregátumban testesül meg. @hu
label: heoreogrāfijas līdzradītājs (aģents) @lv
definition: Sasaista manifestāciju ar aģentu, kas ir līdzradītājs, kas radījis apkopojumā ietverto horeogrāfisko darbu. @lv
toolkit label: heoreogrāfijas līdzradītājs (aģents) @lv
toolkit definition: Aģents - līdzradītājs, kas radījis apkopojumā ietverto horeogrāfisko darbu. @lv
label: 有编舞贡献者行为者 @zh-hans
definition: 将一种载体表现与作为合集的一个贡献者并创建被一种合集具体化的一种编舞作品的一种内容表达的一个行为者关联起来。 @zh-hans
toolkit label: 编舞贡献者行为者 @zh-hans
toolkit definition: 作为合集的一个贡献者并创建被一种合集具体化的一种编舞作品的一种内容表达的一个行为者 @zh-hans
label: koreografiye katkıda bulunan temsilci ile ilişkilidir @tr
definition: Bir gösterimi, bir bütün tarafından somutlaştırılan bir koreografik çalışmanın yorumlanması için bir anlatım yaratan bütünün bir parçası olan bir temsilciyle ilişkilendirir. @tr
toolkit label: koreografiye katkıda bulunan temsilci @tr
toolkit definition: Bir topluluk tarafından somutlaştırılan bir kartografik eserin ifadesini yaratan ve bu topluluğa katkıda bulunan temsilci. @tr
label: tiene agente colaborador de coreografía @es
definition: Relaciona una manifestación con un agente colaborador del agregado que crea la expresión de una obra coreográfica que es encarnada por un agregado. @es
toolkit label: agente colaborador de coreografía @es
toolkit definition: Un agente colaborador del agregado que crea la expresión de una obra coreográfica que es encarnada por un agregado. @es
has subproperty: has contributor collective agent of choreography
has subproperty: has contributor person of choreography
has subproperty: P30316

has contributor agent of computer content
status: Published
lexical alias: contributorAgentOfComputerContent.en
definition: Relates a manifestation to an agent who is a contributor to aggregate who creates an expression of computer content that is embodied by an aggregate.
toolkit label: contributor agent of computer content
toolkit definition: An agent who is a contributor to aggregate who creates an expression of computer content that is embodied by an aggregate.
type: Property
domain: C10007
sub property of: has contributor agent to aggregate
has element type: 2
label: digitaaliseen sisältöön osallinen toimija @fi
definition: Liittää manifestaation aggregaattiin osalliseen toimijaan, joka on luonut aggregaattiin sisältyvän digitaalisen sisällön ekspression. @fi
toolkit label: digitaaliseen sisältöön osallinen toimija @fi
toolkit definition: Aggregaattiin osallinen toimija, joka on luonut aggregaattiin sisältyvän digitaalisen sisällön ekspression. @fi
label: har bidragsyter til datamaskininnhold (agent) @no
definition: Relaterer en manifestasjon til en agent som er en bidragyter til aggregat som skaper datamaskininnhold som er realisert i et aggregat. @no
toolkit label: bidragsyter til datamaskininnhold (agent) @no
toolkit definition: En agent som er en bidragyter til aggregat som skaper datamaskininnhold som er realisert i et aggregat. @no
label: a pour agent contributeur de contenu informatique @fr
definition: Met une manifestation en relation avec un agent contributeur à un agrégat qui crée une expression d’un contenu informatique matérialisée par un agrégat. @fr
toolkit label: agent contributeur de contenu informatique @fr
toolkit definition: Agent contributeur à un agrégat qui crée une expression d’un contenu informatique matérialisée par un agrégat. @fr
label: heeft bijdrager-actor van computercontent @nl
definition: Relateert een manifestatie aan een actor die een bijdrager aan aggregaat is die een expressie van computercontent creëert die is verwezenlijkt in een aggregaat. @nl
toolkit label: bijdrager-actor van computercontent @nl
toolkit definition: Een actor die een bijdrager aan aggregaat is die een expressie van computercontent creëert die is verwezenlijkt in een aggregaat. @nl
label: له وكيل مساهم بمحتوى كمبيوتر @ar
definition: يربط بين تجسيدة ووكيل مساهم في عمل تجميعي ينشيء محتوى كمبيوتر يتجسد في تجميعية. @ar
toolkit label: وكيل مساهم بمحتوى كمبيوتر @ar
toolkit definition: وكيل مساهم في عمل تجميعي ينشيء محتوى كمبيوتر يتجسد في تجميعية. @ar
label: té com a agent contribuïdor de contingut informàtic @ca
definition: Relaciona una manifestació amb un agent que és un contribuïdor a un agregat i que crea una expressió de contingut informàtic que es materialitza en un agregat. @ca
toolkit label: agent contribuïdor de contingut informàtic @ca
toolkit definition: Agent que és un contribuïdor a un agregat i que crea una expressió de contingut informàtic que es materialitza en un agregat. @ca
label: har agent, som er bidragsyder til computerindhold @da
definition: Relaterer en manifestation til en agent, som er bidragsyder til samling, som skaber computerindhold, der er indeholdt i en samling. @da
toolkit label: agent, som er bidragsyder til computerindhold @da
toolkit definition: Agent, som er bidragsyder til samling, som skaber computerindhold, der er indeholdt i en samling. @da
label: digisisu kaastööline (tegija) @et
definition: Seostab kehastuse tegijaga, kes on liitumi kaastööline, luues digisisu väljenduse, mis on teostatud liitumis. @et
toolkit label: digisisu kaastööline (tegija) @et
toolkit definition: Tegija, kes on liitumi kaastööline, luues digisisu väljenduse, mis on teostatud liitumis. @et
label: hat Beiträgerin/Beiträger von Computer Content (Akteur) @de
definition: Setzt eine Manifestation in Beziehung zu einer Beiträgerin/einem Beiträger zu einem Aggregat (Akteur), die/der eine Expression von Computer Content erstellt, die durch ein Aggregat verkörpert wird. @de
toolkit label: Beiträgerin/Beiträger von Computer Content (Akteur) @de
toolkit definition: Eine Beiträgerin/Ein Beiträger zu einem Aggregat (Akteur), die/der eine Expression von Computer Content erstellt, die durch ein Aggregat verkörpert wird. @de
label: számítógépes tartalom közreműködő ágense a következő: @hu
definition: Hozzákapcsol egy megjelenési formát egy ágenshez, amely aggregátor közreműködőként egy számítógépes tartalom aggregátumban megtestesülő kifejezési formáját hozza létre. @hu
toolkit label: számítógépes tartalom közreműködő ágense: @hu
toolkit definition: Egy ágens, aggregátor közreműködőként egy számítógépes tartalom aggregátumban megtestesülő kifejezési formáját hozza létre. @hu
label: ha come contributore di contenuto informatico agente @it
definition: Correla una manifestazione all'agente contributore a un aggregato, che crea un contenuto informatico, materializzato in un aggregato. @it
toolkit label: agente contributore di contenuto informatico @it
toolkit definition: Agente contributore a un aggregato, che crea un contenuto informatico, materializzato in un aggregato. @it
label: datororientēta satura līdzradītājs (aģents) @lv
definition: Sasaista manifestāciju ar aģentu, kas ir līdzradītājs, kas radījis apkopojumā ietverto datororientēto saturu. @lv
toolkit label: datororientēta satura līdzradītājs (aģents) @lv
toolkit definition: Aģents - līdzradītājs, kas radījis apkopojumā ietverto datororientēto saturu. @lv
label: 有计算机内容的贡献者行为者 @zh-hans
definition: 将一种载体表现与作为合集的一个贡献者并创建被一种合集具体化的一种计算机内容的一种内容表达的一个行为者关联起来。 @zh-hans
toolkit label: 计算机内容的贡献者行为者 @zh-hans
toolkit definition: 作为合集的一个贡献者并创建被一种合集具体化的一种计算机内容的一种内容表达的一个行为者 @zh-hans
label: bilgisayar içeriğine katkıda bulunan temsilci ile ilişkilidir @tr
definition: Bir gösterimi, bir toplam tarafından somutlaştırılan bilgisayar içeriğinin bir ifadesini oluşturan toplama katkıda bulunan bir aracı ile ilişkilendirir. @tr
toolkit label: bilgisayar içeriğine katkıda bulunan temsilci @tr
toolkit definition: Bir topluluk tarafından somutlaştırılan bir bilgisayar içeriğinin ifadesini yaratan ve bu topluluğa katkıda bulunan temsilci. @tr
label: tiene agente colaborador de contenidos informáticos @es
definition: Relaciona una manifestación con un agente que contribuye al agregado y que crea una expresión de contenido informático que está incorporado por un agregado. @es
toolkit label: agente colaborador de contenidos informáticos @es
toolkit definition: Un agente que contribuye al agregado y que crea una expresión de contenido informático que está incorporado por un agregado. @es
has subproperty: has contributor collective agent of computer content
has subproperty: has contributor person of computer content
has subproperty: P30333

has contributor agent of moving image
status: Published
lexical alias: contributorAgentOfMovingImage.en
definition: Relates a manifestation to an agent who is a contributor to aggregate who creates an expression of a moving image work that is embodied by an aggregate.
toolkit label: contributor agent of moving image
toolkit definition: An agent who is a contributor to aggregate who creates an expression of a moving image work that is embodied by an aggregate.
type: Property
domain: C10007
sub property of: has contributor agent to aggregate
instruction number: 18.5
has element type: 2
label: liikkuvaan kuvaan osallinen toimija @fi
definition: Liittää manifestaation aggregaattiin osalliseen toimijaan, joka on luonut aggregaattiin sisältyvän liikkuvan kuvan teoksen ekspression. @fi
toolkit label: liikkuvaan kuvaan osallinen toimija @fi
toolkit definition: Aggregaattiin osallinen toimija, joka on luonut aggregaattiin sisältyvän liikkuvan kuvan teoksen ekspression. @fi
label: har bidragsyter til levende bilder (agent) @no
definition: Relaterer en manifestasjon til en agent som er en bidragsyter til aggregat som skaper et verk med levende bilder som er realisert i et aggregat. @no
toolkit label: bidragsyter til levende bilder (agent) @no
toolkit definition: En agent som er en bidragsyter til aggregat som skaper et verk med levende bilder som er realisert i et aggregat. @no
label: a pour agent contributeur d’images animées @fr
definition: Met une manifestation en relation avec un agent contributeur à un agrégat qui crée une expression d’une œuvre d’images animées matérialisée par un agrégat. @fr
toolkit label: agent contributeur d’images animées @fr
toolkit definition: Agent contributeur à un agrégat qui crée une expression d’une œuvre d’images animées matérialisée par un agrégat. @fr
label: heeft bijdrager-actor van bewegend beeld @nl
definition: Relateert een manifestatie aan een actor die een bijdrager aan aggregaat is die een expressie van een bewegend beeldwerk creëert die is verwezenlijkt in een aggregaat. @nl
toolkit label: bijdrager-actor van bewegend beeld @nl
toolkit definition: Een actor die een bijdrager aan aggregaat is die een expressie van een bewegend beeldwerk creëert die is verwezenlijkt in een aggregaat. @nl
label: له وكيل مساهم بصور متحركة @ar
definition: يربط بين تجسيدة ووكيل مساهم في عمل تجميعي ينشيء عمل من صور متحركة يتجسد في تجميعية. @ar
toolkit label: وكيل مساهم بصور متحركة @ar
toolkit definition: وكيل مساهم في عمل تجميعي ينشيء عمل من صور متحركة يتجسد في تجميعية. @ar
label: té com a agent contribuïdor d’imatge en moviment @ca
definition: Relaciona una manifestació amb un agent que és un contribuïdor a un agregat i que crea una expressió d’una obra d’imatge en moviment que es materialitza en un agregat. @ca
toolkit label: agent contribuïdor d’imatge en moviment @ca
toolkit definition: Agent que és un contribuïdor a un agregat i que crea una expressió d’una obra d’imatge en moviment que es materialitza en un agregat. @ca
label: har agent, som er bidragsyder til levende billede @da
definition: Relaterer en manifestation til en agent, som er bidragsyder til samling, som skaber et værk med levende billeder, der er indeholdt i en samling. @da
toolkit label: agent, som er bidragsyder til levende billede @da
toolkit definition: Agent, som er bidragsyder til samling, som skaber et værk med levende billeder, der er indeholdt i en samling. @da
label: kaastööline liikuva pildi alal (tegija) @et
definition: Seostab kehastuse tegijaga, kes on liitumi kaastööline, luues liikuvast pildist koosneva teose väljenduse, mis on teostatud liitumis. @et
toolkit label: kaastööline liikuva pildi alal (tegija) @et
toolkit definition: Tegija, kes on liitumi kaastööline, luues liikuvast pildist koosneva teose väljenduse, mis on teostatud liitumis. @et
label: hat Beiträgerin/Beiträger von einem Bewegtbild (Akteur) @de
definition: Setzt eine Manifestation in Beziehung zu einer Beiträgerin/einem Beiträger zu einem Aggregat (Akteur), die/der eine Expression eines Bewegtbildwerks erstellt, die durch ein Aggregat verkörpert wird. @de
toolkit label: Beiträgerin/Beiträger von einem Bewegtbild (Akteur) @de
toolkit definition: Eine Beiträgerin/Ein Beiträger zu einem Aggregat (Akteur), die/der eine Expression eines Bewegtbildwerks erstellt, die durch ein Aggregat verkörpert wird. @de
label: mozgókép közreműködő ágense a következő: @hu
definition: Hozzákapcsol egy megjelenési formát egy ágenshez, amely aggregátor közreműködőként egy mozgóképmű aggregátumban megtestesülő kifejezési formáját hozza létre. @hu
toolkit label: mozgókép közreműködő ágense: @hu
toolkit definition: Egy ágens, amely aggregátor közreműködőként egy mozgóképmű olyan kifejezési formáját hozza létre, amely egy aggregátumban testesül meg. @hu
label: kustīgu attēlu līdzradītājs (aģents) @lv
definition: Sasaista manifestāciju ar aģentu, kas ir līdzradītājs, kas radījis apkopojumā ietverto kustīgu attēlu kā darbu. @lv
toolkit label: kustīgu attēlu līdzradītājs (aģents) @lv
toolkit definition: Aģents - līdzradītājs, kas radījis apkopojumā ietverto kustīgu attēlu kā darbu. @lv
label: 有动态图像的贡献者行为者 @zh-hans
definition: 将一种载体表现与作为合集的一个贡献者并创建被一种合集具体化的一种动态图像作品的一种内容表达的一个行为者关联起来。 @zh-hans
toolkit label: 动态图像的贡献者行为者 @zh-hans
toolkit definition: 作为合集的一个贡献者并创建被一种合集具体化的一种动态图像作品的一种内容表达的一个行为者 @zh-hans
label: hareketli görüntüye katkıda bulunan temsilci ile ilişkilidir @tr
definition: Bir gösterimi, bir bütün tarafından somutlaştırılan bir hareketli görüntü çalışmasının görüntüsünü oluşturan bütünün bir parçası olan bir temsilciyle ilişkilendirir. @tr
toolkit label: hareketli̇ görüntüye katkıda bulunan temsilci @tr
toolkit definition: Bir topluluk tarafından somutlaştırılan bir hareketli görüntü ifadesini yaratan ve bu topluluğa katkıda bulunan temsilci. @tr
label: tiene agente colaborador de imagen en movimiento @es
definition: Relaciona una manifestación con un agente que contribuye al agregado y que crea una expresión de una obra de imagen en movimiento que está encarnada por un agregado. @es
toolkit label: agente colaborador de imagen en movimiento @es
toolkit definition: Un agente que contribuye al agregado y que crea una expresión de una obra de imagen en movimiento que está encarnada por un agregado. @es
has subproperty: has contributor collective agent of moving image
has subproperty: has contributor person of moving image
has subproperty: P30326

has contributor agent of music
status: Published
lexical alias: contributorAgentOfMusic.en
definition: Relates a manifestation to an agent who is a contributor to aggregate who creates an expression of a musical work that is embodied by an aggregate.
toolkit label: contributor agent of music
toolkit definition: An agent who is a contributor to aggregate who creates an expression of a musical work that is embodied by an aggregate.
type: Property
domain: C10007
sub property of: has contributor agent to aggregate
instruction number: 18.5
has element type: 2
alternative label: composer (expression)
label: musiikkiin osallinen toimija @fi
definition: Liittää manifestaation aggregaattiin osalliseen toimijaan, joka on luonut aggregaattiin sisältyvän musiikkiteoksen ekspression. @fi
toolkit label: musiikkiin osallinen toimija @fi
toolkit definition: Aggregaattiin osallinen toimija, joka on luonut aggregaattiin sisältyvän musiikkiteoksen ekspression. @fi
label: har bidragsyter til musikk (agent) @no
definition: Relaterer en manifestasjon til en agent som er en bidragsyter til aggregat som skaper et musikalsk verk som er realisert i et aggregat. @no
toolkit label: bidragsyter til musikk (agent) @no
toolkit definition: En agent som er en bidragsyter til aggregat som skaper et musikalsk verk som er realisert i et aggregat. @no
label: a pour agent contributeur de musique @fr
definition: Met une manifestation en relation avec un agent contributeur à un agrégat qui crée une expression d’une œuvre musicale matérialisée par un agrégat. @fr
toolkit label: agent contributeur de musique @fr
toolkit definition: Agent contributeur à un agrégat qui crée une expression d’une œuvre musicale matérialisée par un agrégat. @fr
label: heeft bijdrager-actor van muziek @nl
definition: Relateert een manifestatie aan een actor die is een bijdrager aan aggregaat die een expressie van een muziekwerk creëert die is verwezenlijkt in een aggregaat. @nl
toolkit label: bijdrager-actor van muziek @nl
toolkit definition: Een actor die is een bijdrager aan aggregaat die een expressie van een muziekwerk creëert die is verwezenlijkt in een aggregaat. @nl
alternative label: säveltäjä (ekspressio) @fi
label: له وكيل مساهم بموسيقى @ar
definition: يربط بين تجسيدة ووكيل مساهم في عمل تجميعي بإنشاء عمل موسيقي يتجسد في تجميعية. @ar
toolkit label: وكيل مساهم بموسيقى @ar
toolkit definition: وكيل مساهم في عمل تجميعي بإنشاء عمل موسيقي يتجسد في تجميعية. @ar
label: té com a agent contribuïdor de música @ca
definition: Relaciona una manifestació amb un agent que és un contribuïdor a un agregat i que crea una expressió d’una obra musical que es materialitza en un agregat. @ca
toolkit label: agent contribuïdor de música @ca
toolkit definition: Agent que és un contribuïdor a un agregat i que crea una expressió d’una obra musical que es materialitza en un agregat. @ca
label: har agent, som er bidragsyder til musik @da
definition: Relaterer en manifestation til en agent, som er bidragsyder til samling, som skaber et musikværk, der er indeholdt i en samling. @da
toolkit label: agent, som er bidragsyder til musik @da
toolkit definition: Agent, som er bidragsyder til samling, som skaber et musikværk, der er indeholdt i en samling. @da
label: muusikaline kaastööline (tegija) @et
definition: Seostab kehastuse tegijaga, kes on liitumi kaastööline, luues muusikateose väljenduse, mis on teostatud liitumis. @et
toolkit label: muusikaline kaastööline (tegija) @et
toolkit definition: Tegija, kes on liitumi kaastööline, luues muusikateose väljenduse, mis on teostatud liitumis. @et
label: hat Beiträgerin/Beiträger einer Musik (Akteur) @de
definition: Setzt eine Manifestation in Beziehung zu einer Beiträgerin/einem Beiträger zu einem Aggregat (Akteur), die/der eine Expression eines Musikwerks erstellt, die durch ein Aggregat verkörpert wird. @de
toolkit label: Beiträgerin/Beiträger einer Musik (Akteur) @de
toolkit definition: Eine Beiträgerin/Ein Beiträger zu einem Aggregat (Akteur), die/der eine Expression eines Musikwerks erstellt, die durch ein Aggregat verkörpert wird. @de
label: zene közreműködő ágense a következő: @hu
definition: Hozzákapcsol egy megjelenési formát egy ágenshez, amely aggregátor közreműködőként egy zenemű olyan kifejezési formáját hozza létre, amely egy aggregátumban testesül meg. @hu
toolkit label: zene közreműködő ágense: @hu
toolkit definition: Egy ágens, amely aggregátor közreműködőként egy zenemű olyan kifejezési formáját hozza létre, amely egy aggregátumban testesül meg. @hu
label: mūzikas līdzradītājs (aģents) @lv
definition: Sasaista manifestāciju ar aģentu, kas ir līdzradītājs, kas radījis apkopojumā ietverto mūzikas darbu. @lv
toolkit label: mūzikas līdzradītājs (aģents) @lv
toolkit definition: Aģents - līdzradītājs, kas radījis apkopojumā ietverto mūzikas darbu. @lv
alternative label: compositeur (expression) @fr
alternative label: ملحن (تعبيرة) @ar
alternative label: komponist (eksemplar) @da
alternative label: Komponist (Expression) @de
alternative label: compositor (expressió) @ca
alternative label: 作曲者（内容表达） @zh-hans
label: 有音乐的贡献者行为者 @zh-hans
definition: 将一种载体表现与作为合集的一个贡献者并创建被一种合集具体化的一种音乐作品的一种内容表达的一个行为者关联起来。 @zh-hans
toolkit label: 音乐的贡献者行为者 @zh-hans
toolkit definition: 作为合集的一个贡献者并创建被一种合集具体化的一种音乐作品的一种内容表达的一个行为者 @zh-hans
alternative label: zeneszerzője (kifejezési forma): @hu
alternative label: besteci (anlatım) @tr
label: müziğe katkıda bulunan temsilci ile ilişkilidir @tr
definition: Bir gösterimi, bir bütün tarafından somutlaştırılan bir müzik eserinin yorumunu oluşturan bir bütüne katkıda bulunan bir temsilciyle ilişkilendirir. @tr
toolkit label: müzi̇ğe katkıda bulunan temsi̇lci̇ @tr
toolkit definition: Bir topluluk tarafından somutlaştırılan bir müzik eserinin ifadesini yaratan ve bu topluluğa katkıda bulunan temsilci. @tr
alternative label: compositor (expresión) @es
label: tiene agente colaborador de la música @es
definition: Relaciona una manifestación con un agente que contribuye al agregado y que crea una expresión de una obra musical que está encarnada por un agregado. @es
toolkit label: agente colaborador de la música @es
toolkit definition: Un agente que contribuye al agregado y que crea una expresión de una obra musical que está encarnada por un agregado. @es
has subproperty: has contributor collective agent of music
has subproperty: has contributor person of music
has subproperty: P30311

has contributor agent of object
status: Published
lexical alias: contributorAgentOfObject.en
definition: Relates a manifestation to an agent who is a contributor to aggregate who creates an expression of an object work that is embodied by an aggregate.
toolkit label: contributor agent of object
toolkit definition: An agent who is a contributor to aggregate who creates an expression of an object work that is embodied by an aggregate.
type: Property
domain: C10007
sub property of: has contributor agent to aggregate
has element type: 2
label: esineeseen osallinen toimija @fi
definition: Liittää manifestaation aggregaattiin osalliseen toimijaan, joka on luonut aggregaattiin sisältyvän esineteoksen ekspression. @fi
toolkit label: esineeseen osallinen toimija @fi
toolkit definition: Aggregaattiin osallinen toimija, joka on luonut aggregaattiin sisältyvän esineteoksen ekspression. @fi
label: har bidragsyter til gjenstand (agent) @no
definition: Relaterer en manifestasjon til en agent som er en bidragsyter til aggregat som skaper et verk som er en gjenstand som er realisert i et aggregat. @no
toolkit label: bidragsyter til gjenstand (agent) @no
toolkit definition: En agent som er en bidragsyter til aggregat som skaper et verk som er en gjenstand som er realisert i et aggregat. @no
label: a pour agent contributeur d’objet @fr
definition: Met une manifestation en relation avec un agent contributeur à un agrégat qui crée une expression d’une œuvre objet matérialisée par un agrégat. @fr
toolkit label: agent contributeur d’objet @fr
toolkit definition: Agent contributeur à un agrégat qui crée une expression d’une œuvre objet matérialisée par un agrégat. @fr
label: heeft bijdrager-actor van object @nl
definition: Relateert een manifestatie aan een actor die een bijdrager aan aggregaat is die een expressie van een objectwerk creëert die is verwezenlijkt in een aggregaat. @nl
toolkit label: bijdrager-actor van object @nl
toolkit definition: Een actor die een bijdrager aan aggregaat is die een expressie van een objectwerk creëert die is verwezenlijkt in een aggregaat. @nl
label: له وكيل مساهم بكائن @ar
definition: يربط بين تجسيدة ووكيل مساهم في عمل تجميعي ينشيء عمل شيء ما يتجسد في تجميعية. @ar
toolkit label: وكيل مساهم بكائن @ar
toolkit definition: وكيل مساهم في عمل تجميعي ينشيء عمل شيء ما يتجسد في تجميعية. @ar
label: té com a agent contribuïdor d’objecte @ca
definition: Relaciona una manifestació amb un agent que és un contribuïdor a un agregat i que crea una expressió d’una obra d’objecte que es materialitza en un agregat. @ca
toolkit label: agent contribuïdor d’objecte @ca
toolkit definition: Agent que és un contribuïdor a un agregat i que crea una expressió d’una obra d’objecte que es materialitza en un agregat. @ca
label: har agent, som er bidragsyder til objekt @da
definition: Relaterer en manifestation til en agent, som er bidragsyder til samling, som skaber et værk med objekt, der er indeholdt i en samling. @da
toolkit label: agent, som er bidragsyder til objekt @da
toolkit definition: Agent, som er bidragsyder til samling, som skaber et værk med objekt, der er indeholdt i en samling. @da
label: objektiloome kaastööline (tegija) @et
definition: Seostab kehastuse tegijaga, kes on liitumi kaastööline, luues objektteose väljenduse, mis on teostatud liitumis. @et
toolkit label: objektiloome kaastööline (tegija) @et
toolkit definition: Tegija, kes on liitumi kaastööline, luues objektteose väljenduse, mis on teostatud liitumis. @et
label: hat Beiträgerin/Beiträger von einem Gegenstand (Akteur) @de
definition: Setzt eine Manifestation in Beziehung zu einer Beiträgerin/einem Beiträger zu einem Aggregat (Akteur), die/der eine Expression eines gegenständlichen Werks erstellt, die durch ein Aggregat verkörpert wird. @de
toolkit label: Beiträgerin/Beiträger von einem Gegenstand (Akteur) @de
toolkit definition: Eine Beiträgerin/Ein Beiträger zu einem Aggregat (Akteur), die/der eine Expression eines gegenständlichen Werks erstellt, die durch ein Aggregat verkörpert wird. @de
label: objektum közreműködő ágense a következő: @hu
definition: Hozzákapcsol egy megjelenési formát egy ágenshez, amely aggregátor közreműködőként egy tárgyi mű aggregátumban megtestesülő kifejezési formáját hozza létre. @hu
toolkit label: objektum közreműködő ágense: @hu
toolkit definition: Egy ágens, amely aggregátor közreműködőként egy tárgyi mű aggregátumban megtestesülő kifejezési formáját hozza létre. @hu
label: ha come contributore di oggetto agente @it
definition: Correla una manifestazione all'agente contributore a un aggregato, che crea un’opera oggetto, materializzata in un aggregato. @it
toolkit label: contributore di oggetto agente @it
toolkit definition: Agente contributore a un aggregato, che crea un’opera oggetto, materializzata in un aggregato. @it
label: objekta līdzradītājs (aģents) @lv
definition: Sasaista manifestāciju ar aģentu, kas ir līdzradītājs, kas radījis apkopojumā ietverto objekta darbu. @lv
toolkit label: objekta līdzradītājs (aģents) @lv
toolkit definition: Aģents - līdzradītājs, kas radījis apkopojumā ietverto objekta darbu. @lv
label: 有物体的贡献者行为者 @zh-hans
definition: 将一种载体表现与作为合集的一个贡献者并创建被一种合集具体化的一种物体作品的一种内容表达的一个行为者关联起来。 @zh-hans
toolkit label: 物体的贡献者行为者 @zh-hans
toolkit definition: 作为合集的一个贡献者并创建被一种合集具体化的一种物体作品的一种内容表达的一个行为者 @zh-hans
label: nesneye katkıda bulunan temsilci ile ilişkilidir @tr
definition: Bir gösterimi, bir bütün tarafından somutlaştırılan bir nesne çalışmasının ifadesini oluşturan bütünün bir parçası olan bir temsilciyle ilişkilendirir. @tr
toolkit label: nesneye katkıda bulunan temsilci @tr
toolkit definition: Bir topluluk tarafından somutlaştırılan bir nesnel eserin ifadesini yaratan ve bu topluluğa katkıda bulunan temsilci. @tr
label: tiene agente colaborador del objeto @es
definition: Relaciona una manifestación con un agente que contribuye al agregado y que crea una expresión de un objeto de obra que está encarnado por un agregado. @es
toolkit label: agente colaborador del objeto @es
toolkit definition: Un agente que contribuye al agregado y que crea una expresión de un objeto de obra que está encarnado por un agregado. @es
has subproperty: has contributor collective agent of object
has subproperty: has contributor person of object
has subproperty: P30332

has contributor agent of speech
status: Published
lexical alias: contributorAgentOfSpeech.en
definition: Relates a manifestation to an agent who is a contributor to aggregate who creates an expression of a vocal work that is embodied by an aggregate.
toolkit label: contributor agent of speech
toolkit definition: An agent who is a contributor to aggregate who creates an expression of a vocal work that is embodied by an aggregate.
type: Property
domain: C10007
sub property of: has contributor agent to aggregate
has element type: 2
label: puheeseen osallinen toimija @fi
definition: Liittää manifestaation aggregaattiin osalliseen toimijaan, joka on luonut aggregaattiin sisältyvän puheteoksen ekspression. @fi
toolkit label: puheeseen osallinen toimija @fi
toolkit definition: Aggregaattiin osallinen toimija, joka on luonut aggregaattiin sisältyvän puheteoksen ekspression. @fi
label: har bidragsyter til tale (agent) @no
definition: Relaterer en manifestasjon til en agent som er en bidragsyter til aggregat som skaper et verk av tale som er realisert i et aggregat. @no
toolkit label: bidragsyter til tale (agent) @no
toolkit definition: En agent som er en bidragsyter til aggregat som skaper et verk av tale som er realisert i et aggregat. @no
label: a pour agent contributeur de contenu vocal @fr
definition: Met une manifestation en relation avec un agent contributeur à un agrégat qui crée une expression d’une œuvre vocale matérialisée par un agrégat. @fr
toolkit label: agent contributeur de contenu vocal @fr
toolkit definition: Agent contributeur à un agrégat qui crée une expression d’une œuvre vocale matérialisée par un agrégat. @fr
label: heeft bijdrager-actor van spraak @nl
definition: Relateert een manifestatie aan een actor die een bijdrager aan aggregaat is die een expressie van een vocaal werk creëert die is verwezenlijkt in een aggregaat. @nl
toolkit label: bijdrager-actor van spraak @nl
toolkit definition: Een actor die een bijdrager aan aggregaat is die een expressie van een vocaal werk creëert die is verwezenlijkt in een aggregaat. @nl
label: له وكيل مساهم بحديث @ar
definition: يربط بين تجسيدة ووكيل مساهم في عمل تجميعي ينشيء عمل من كلمات منطوقة يتجسد في تجميعية. @ar
toolkit label: وكيل مساهم بحديث @ar
toolkit definition: وكيل مساهم في عمل تجميعي ينشيء عمل من كلمات منطوقة يتجسد في تجميعية. @ar
label: té com a agent contribuïdor de discurs @ca
definition: Relaciona una manifestació amb un agent que és un contribuïdor a un agregat i que crea una expressió d’una obra vocal que es materialitza en un agregat. @ca
toolkit label: agent contribuïdor de discurs @ca
toolkit definition: Agent que és un contribuïdor a un agregat i que crea una expressió d’una obra vocal que es materialitza en un agregat. @ca
label: har agent, som er bidragsyder til tale @da
definition: Relaterer en manifestation til en agent, som er bidragsyder til samling, som skaber et værk med talte ord, der er indeholdt i en samling. @da
toolkit label: agent, som er bidragsyder til tale @da
toolkit definition: Agent, som er bidragsyder til samling, som skaber et værk med talte ord, der er indeholdt i en samling. @da
label: kõneloome kaastööline (tegija) @et
definition: Seostab kehastuse tegijaga, kes on liitumi kaastööline, luues suulise teose väljenduse, mis on teostatud liitumis. @et
toolkit label: kõneloome kaastööline (tegija) @et
toolkit definition: Tegija, kes on liitumi kaastööline, luues suulise teose väljenduse, mis on teostatud liitumis. @et
label: hat Beiträgerin/Beiträger von einer Rede (Akteur) @de
definition: Setzt eine Manifestation in Beziehung zu einer Beiträgerin/einem Beiträger zu einem Aggregat (Akteur), die/der eine Expression eines gesprochenen Werks erstellt, die durch ein Aggregat verkörpert wird. @de
toolkit label: Beiträgerin/Beiträger von einer Rede (Akteur) @de
toolkit definition: Eine Beiträgerin/Ein Beiträger zu einem Aggregat (Akteur), die/der eine Expression eines gesprochenen Werks erstellt, die durch ein Aggregat verkörpert wird. @de
label: beszéd közreműködő ágense a következő: @hu
definition: Hozzákapcsol egy megjelenési formát egy ágenshez, amely aggregátor közreműködőként egy beszédmű aggregátumban megtestesülő kifejezési formáját hozza létre. @hu
toolkit label: beszéd közreműködő ágense: @hu
toolkit definition: Egy ágens, amely aggregátor közreműködőként egy beszédmű aggregátumban megtestesülő kifejezési formáját hozza létre. @hu
label: ha come contributore di discorso agente @it
definition: Correla una manifestazione all'agente contributore a un aggregato, che crea un'opera parlata, materializzata in un aggregato. @it
toolkit label: contributore di discorso agente @it
toolkit definition: Agente contributore a un aggregato, che crea un'opera parlata, materializzata in un aggregato. @it
label: runas līdzradītājs (aģents) @lv
definition: Sasaista manifestāciju ar aģentu, kas ir līdzradītājs, kas radījis apkopojumā ietverto mutvārdu darbu. @lv
toolkit label: runas līdzradītājs (aģents) @lv
toolkit definition: Aģents - līdzradītājs, kas radījis apkopojumā ietverto mutvārdu darbu. @lv
label: 有讲话的贡献者行为者 @zh-hans
definition: 将一种载体表现与作为合集的一个贡献者并创建被一种合集具体化的一种人声作品的一种内容表达的一个行为者关联起来。 @zh-hans
toolkit label: 讲话的贡献者行为者 @zh-hans
toolkit definition: 作为合集的一个贡献者并创建被一种合集具体化的一种人声作品的一种内容表达的一个行为者 @zh-hans
label: konuşmaya katkıda bulunan temsilci ile ilişkilidir @tr
definition: Bir gösterimi, bir bütün tarafından somutlaştırılan bir sesli eserin yorumunu oluşturan bütünün bir parçası olan bir temsilciyle ilişkilendirir. @tr
toolkit label: konuşmaya katkıda bulunan temsilci @tr
toolkit definition: Bir topluluk tarafından somutlaştırılan bir sesli eserin ifadesini yaratan ve bu topluluğa katkıda bulunan temsilci. @tr
label: tiene agente colaborador del habla @es
definition: Relaciona una manifestación con un agente que contribuye al agregado y que crea una expresión de una obra vocal que es encarnada por un agregado. @es
toolkit label: agente colaborador del habla @es
toolkit definition: Un agente que contribuye al agregado y que crea una expresión de una obra vocal que es encarnada por un agregado. @es
has subproperty: has contributor collective agent of speech
has subproperty: has contributor person of speech
has subproperty: P30331

has contributor agent of still image
status: Published
lexical alias: contributorAgentOfStillImage.en
definition: Relates a manifestation to an agent who is a contributor to aggregate who creates an expression of a still image work that is embodied by an aggregate.
toolkit label: contributor agent of still image
toolkit definition: An agent who is a contributor to aggregate who creates an expression of a still image work that is embodied by an aggregate.
type: Property
domain: C10007
sub property of: has contributor agent to aggregate
instruction number: 18.5
has element type: 2
alternative label: illustrator
alternative label: photographer (expression)
label: stillkuvaan osallinen toimija @fi
definition: Liittää manifestaation aggregaattiin osalliseen toimijaan, joka on luonut aggregaattiin sisältyvän stillkuvateoksen ekspression. @fi
toolkit label: stillkuvaan osallinen toimija @fi
toolkit definition: Aggregaattiin osallinen toimija, joka on luonut aggregaattiin sisältyvän stillkuvateoksen ekspression. @fi
label: har bidragsyter til bilde (agent) @no
definition: Relaterer en manifestasjon til en agent som er en bidragsyter til aggregat som skaper et bildeverk som er realisert i et aggregat. @no
alternative label: illustratør @no
toolkit label: bidragsyter til bilde (agent) @no
toolkit definition: En agent som er en bidragsyter til aggregat som skaper et bildeverk som er realisert i et aggregat. @no
label: a pour agent contributeur d’image fixe @fr
definition: Met une manifestation en relation avec un agent contributeur à un agrégat qui crée une expression d’une œuvre d’image fixe matérialisée par un agrégat. @fr
toolkit label: agent contributeur d’image fixe @fr
toolkit definition: Agent contributeur à un agrégat qui crée une expression d’une œuvre d’image fixe matérialisée par un agrégat. @fr
label: heeft bijdrager-actor van stilstaand beeld @nl
definition: Relateert een manifestatie aan een actor die een bijdrager aan aggregaat is die een expressie van een stilstaand beeldwerk creëert die is verwezenlijkt in een aggregaat. @nl
toolkit label: bijdrager-actor van stilstaand beeld @nl
toolkit definition: Een actor die een bijdrager aan aggregaat is die een expressie van een stilstaand beeldwerk creëert die is verwezenlijkt in een aggregaat. @nl
label: له وكيل مساهم بصور ثابتة @ar
definition: يربط بين تجسيدة ووكيل مساهم في عمل تجميعي ينشيء عمل من صور ثابتة يتجسد في تجميعية. @ar
alternative label: مصور (تعبيرة) @ar
toolkit label: وكيل مساهم بصور ثابتة @ar
toolkit definition: وكيل مساهم في عمل تجميعي ينشيء عمل من صور ثابتة يتجسد في تجميعية. @ar
label: té com a agent contribuïdor d’imatge fixa @ca
definition: Relaciona una manifestació amb un agent que és un contribuïdor a un agregat i que crea una expressió d’una obra d’imatge fixa que es materialitza en un agregat. @ca
toolkit label: agent contribuïdor d’imatge fixa @ca
toolkit definition: Agent que és un contribuïdor a un agregat i que crea una expressió d’una obra d’imatge fixa que es materialitza en un agregat. @ca
label: har agent, som er bidragsyder til stillbillede @da
definition: Relaterer en manifestation til en agent, som er bidragsyder til samling, som skaber et værk med stillbilleder, der er indeholdt i en samling. @da
alternative label: fotograf (udtryk) @da
toolkit label: agent, som er bidragsyder til stillbillede @da
toolkit definition: Agent, som er bidragsyder til samling, som skaber et værk med stillbilleder, der er indeholdt i en samling. @da
label: kaastööline liikumatu pildi alal (tegija) @et
definition: Seostab kehastuse tegijaga, kes on liitumi kaastööline, luues liikumatust pildist koosneva teose väljenduse, mis on teostatud liitumis. @et
alternative label: illustreerija @et
toolkit label: kaastööline liikumatu pildi alal (tegija) @et
toolkit definition: Tegija, kes on liitumi kaastööline, luues liikumatust pildist koosneva teose väljenduse, mis on teostatud liitumis. @et
label: hat Illustratorin/Illustrator (Akteur) @de
definition: Setzt eine Manifestation in Beziehung zu einer Beiträgerin/einem Beiträger zu einem Aggregat (Akteur), die/der eine Expression eines unbewegten Bildwerks erstellt, die durch ein Aggregat verkörpert wird. @de
toolkit label: Illustratorin/Illustrator (Akteur) @de
toolkit definition: Eine Beiträgerin/Ein Beiträger zu einem Aggregat (Akteur), die/der eine Expression eines unbewegten Bildwerks erstellt, die durch ein Aggregat verkörpert wird. @de
label: állókép közreműködő ágense a következő: @hu
definition: Hozzákapcsol egy megjelenési formát egy ágenshez, amely aggregátor közreműködőként egy állóképmű olyan kifejezési formáját hozza létre, amely egy aggregátumban testesül meg. @hu
toolkit label: állókép közreműködő ágense: @hu
toolkit definition: Egy ágens, amely aggregátor közreműködőként egy állóképmű olyan kifejezési formáját hozza létre, amely egy aggregátumban testesül meg. @hu
label: attēla līdzradītājs (aģents) @lv
definition: Sasaista manifestāciju ar aģentu, kas ir līdzradītājs, kas radījis apkopojumā ietverto attēlu kā darbu. @lv
toolkit label: attēla līdzradītājs (aģents) @lv
toolkit definition: Aģents - līdzradītājs, kas radījis apkopojumā ietverto attēlu kā darbu. @lv
alternative label: Fotograf (Expression) @de
label: 有静态图像的贡献者行为者 @zh-hans
definition: 将一种载体表现与作为合集的一个贡献者并创建被一种合集具体化的一种静态图像作品的一种内容表达的一个行为者关联起来。 @zh-hans
toolkit label: 静态图像的贡献者行为者 @zh-hans
toolkit definition: 作为合集的一个贡献者并创建被一种合集具体化的一种静态图像作品的一种内容表达的一个行为者 @zh-hans
alternative label: 插图者 @zh-hans
alternative label: 摄影者（内容表达） @zh-hans
alternative label: illustrateur @fr
alternative label: photographe (expression) @fr
alternative label: illusztrátora: @hu
alternative label: fényképésze (kifejezési forma): @hu
label: durağan görüntüye katkıda bulunan temsilci ile ilişkilidir @tr
definition: Bir gösterimi, bir bütün tarafından somutlaştırılan bir hareketsiz görüntü çalışmasının görüntüsünü oluşturan bütünün bir parçası olan bir temsilciyle ilişkilendirir. @tr
toolkit label: hareketsiz görüntüye katkıda bulunan temsilci @tr
toolkit definition: Bir topluluk tarafından somutlaştırılan bir sabit görüntü ifadesini yaratan ve bu topluluğa katkıda bulunan temsilci. @tr
toolkit label: agente colaborador de imagen fija @es
toolkit definition: Un agente que contribuye al agregado y que crea una expresión de una obra de imagen fija que está encarnada por un agregado. @es
has subproperty: has contributor collective agent of still image
has subproperty: has contributor person of still image
has subproperty: P30321

has contributor agent of text
status: Published
lexical alias: contributorAgentOfText.en
definition: Relates a manifestation to an agent who is a contributor to aggregate who creates an expression of a textual work that is embodied by an aggregate.
alternative label: writer of supplementary textual content
toolkit label: contributor agent of text
toolkit definition: An agent who is a contributor to aggregate who creates an expression of a textual work that is embodied by an aggregate.
type: Property
domain: C10007
sub property of: has contributor agent to aggregate
has element type: 2
alternative label: writer of added text
alternative label: writer of preface
alternative label: writer of added commentary
alternative label: writer of introduction
alternative label: writer of added lyrics
alternative label: writer of afterword
alternative label: writer of postface
alternative label: writer of foreword
label: tekstiin osallinen toimija @fi
definition: Liittää manifestaation aggregaattiin osalliseen toimijaan, joka on luonut aggregaattiin sisältyvän tekstiteoksen ekspression. @fi
toolkit label: tekstiin osallinen toimija @fi
toolkit definition: Aggregaattiin osallinen toimija, joka on luonut aggregaattiin sisältyvän tekstiteoksen ekspression. @fi
label: har bidragsyter til tekst (agent) @no
definition: Relaterer en manifestasjon til en agent som er en bidragsyter til aggregat som skaper et tekstlig verk som er realisert i et aggregat. @no
alternative label: forfatter av supplerende tekstlig innhold @no
alternative label: forfatter av tilføyd tekst @no
alternative label: forfatter av prolog @no
alternative label: forfatter av tilføyde kommentarer @no
alternative label: forfatter av innledning @no
alternative label: forfatter av tilføyde sangtekster @no
alternative label: forfatter av etterord @no
alternative label: forfatter av epilog @no
alternative label: forfatter av forord @no
toolkit label: bidragsyter til tekst (agent) @no
toolkit definition: En agent som er en bidragsyter til aggregat som skaper et tekstlig verk som er realisert i et aggregat. @no
label: a pour agent contributeur de texte @fr
definition: Met une manifestation en relation avec un agent contributeur à un agrégat qui crée une expression d’une œuvre textuelle matérialisée par un agrégat. @fr
alternative label: auteur de contenu textuel supplémentaire @fr
alternative label: auteur de texte ajouté @fr
alternative label: préfacier @fr
alternative label: auteur de commentaire ajouté @fr
alternative label: auteur d’introduction @fr
alternative label: auteur de paroles ajoutées @fr
alternative label: auteur d’après-propos @fr
alternative label: postfacier @fr
alternative label: auteur d’avant-propos @fr
toolkit label: agent contributeur de texte @fr
toolkit definition: Agent contributeur à un agrégat qui crée une expression d’une œuvre textuelle matérialisée par un agrégat. @fr
label: heeft bijdrager-actor van tekst @nl
definition: Relateert een manifestatie aan een actor die een bijdrager aan aggregaat is die een expressie van een tekstwerk creëert die is verwezenlijkt in een aggregaat. @nl
toolkit label: bijdrager-actor van tekst @nl
toolkit definition: Een actor die een bijdrager aan aggregaat is die een expressie van een tekstwerk creëert die is verwezenlijkt in een aggregaat. @nl
label: له وكيل مساهم بنص @ar
definition: يربط بين تجسيدة ووكيل مساهم في عمل تجميعي ينشيء عمل نصي يتجسد في تجميعية. @ar
alternative label: كاتب توطئة لـ @ar
toolkit label: وكيل مساهم بنص @ar
toolkit definition: وكيل مساهم في عمل تجميعي ينشيء عمل نصي يتجسد في تجميعية. @ar
label: té com a agent contribuïdor de text @ca
definition: Relaciona una manifestació amb un agent que és un contribuïdor a un agregat i que crea una expressió d’una obra textual que es materialitza en un agregat. @ca
toolkit label: agent contribuïdor de text @ca
toolkit definition: Agent que és un contribuïdor a un agregat i que crea una expressió d’una obra textual que es materialitza en un agregat. @ca
toolkit label: agent, som er bidragsyder til tekst @da
toolkit definition: Agent, som er bidragsyder til samling, som skaber et tekstværk, der er indeholdt i en samling. @da
toolkit label: tekstiloome kaastööline (tegija) @et
toolkit definition: Tegija, kes on liitumi kaastööline, luues tekstteose väljenduse, mis on teostatud liitumis. @et
toolkit label: Beiträgerin/Beiträger von ergänzendem Text (Akteur) @de
toolkit definition: Eine Beiträgerin/Ein Beiträger zu einem Aggregat (Akteur), die/der eine Expression eines textlichen Werks erstellt, die durch ein Aggregat verkörpert wird. @de
toolkit label: Egy ágens, amely aggregátor közreműködőként egy szöveges mű aggregátumban megtestesülő kifejezési formáját hozza létre. @hu
toolkit definition: kiegészítő szöveges tartalom írója: @hu
toolkit label: teksta līdzradītājs (aģents) @lv
toolkit definition: Aģents - līdzradītājs, kas radījis apkopojumā ietverto teksta darbu. @lv
toolkit label: 文本的贡献者行为者 @zh-hans
toolkit definition: 作为合集的一个贡献者并创建被一种合集具体化的一种文字作品的一种内容表达的一个行为者 @zh-hans
toolkit label: metne katkıda bulunan temsilci @tr
toolkit definition: Bir topluluk tarafından somutlaştırılan bir metinsel eserin ifadesini yaratan ve bu topluluğa katkıda bulunan temsilci. @tr
toolkit label: agente colaborador de texto @es
toolkit definition: Un agente que contribuye al agregado y que crea una expresión de una obra textual que está encarnada por un agregado. @es
has subproperty: has contributor collective agent of text
has subproperty: has contributor person of text
has subproperty: P30328

has contributor agent to aggregate
status: Published
lexical alias: contributorAgentToAggregate.en
definition: Relates a manifestation to an agent who is responsible for creating an expression of a work that is embodied by an aggregate.
toolkit label: contributor agent to aggregate
toolkit definition: An agent who is responsible for creating an expression of a work that is embodied by an aggregate.
type: Property
domain: C10007
sub property of: has related agent of manifestation
has element type: 2
label: aggregaattiin osallinen toimija @fi
definition: Liittää manifestaation toimijaan, joka on vastuussa aggregaattiin sisältyvän teoksen ekspression luomisesta. @fi
toolkit label: aggregaattiin osallinen toimija @fi
toolkit definition: Toimija, joka on vastuussa aggregaattiin sisältyvän teoksen ekspression luomisesta. @fi
label: har bidragsyter til aggregat (agent) @no
definition: Relaterer en manifestasjon til en agent som skaper et verk som er realisert i et aggregat. @no
toolkit label: bidragsyter til aggregat (agent) @no
toolkit definition: En agent som skaper et verk som er realisert i et aggregat. @no
label: a pour agent contributeur à un agrégat @fr
definition: Met une manifestation en relation avec un agent qui est responsable de la création d’une expression d’une œuvre matérialisée par un agrégat. @fr
toolkit label: agent contributeur à un agrégat @fr
toolkit definition: Agent qui est responsable de la création d’une expression d’une œuvre matérialisée par un agrégat. @fr
label: heeft bijdrager-actor aan aggregaat @nl
definition: Relateert een manifestatie aan een actor die verantwoordelijk is voor het creëren van een expressie van een werk dat is verwezenlijkt in een aggregaat. @nl
toolkit label: bijdrager-actor aan aggregaat @nl
toolkit definition: Een actor die verantwoordelijk is voor het creëren van een expressie van een werk dat is verwezenlijkt in een aggregaat. @nl
label: له وكيل مساهم في تجميعة @ar
definition: يربط بين تجسيدة ووكيل ينشئ عمل يتجسد في تجميعية. @ar
toolkit label: وكيل مساهم في تجميعة @ar
toolkit definition: وكيل ينشئ عمل يتجسد في تجميعية. @ar
label: té com a agent contribuïdor a un agregat @ca
definition: Relaciona una manifestació amb un agent que és responsable de la creació d’una expressió d’una obra que es materialitza en un agregat. @ca
toolkit label: agent contribuïdor a un agregat @ca
toolkit definition: Agent que és responsable de la creació d’una expressió d’una obra que es materialitza en un agregat. @ca
label: har agent, som er bidragsyder til samling @da
definition: Relaterer en manifestation til en agent, som skaber et værk, der er indeholdt i en samling. @da
toolkit label: agent, som er bidragsyder til samling @da
toolkit definition: Agent, som skaber et værk, der er indeholdt i en samling. @da
label: liitumi kaastööline (tegija) @et
definition: Seostab kehastuse tegijaga, kes loob teose väljenduse, mis on teostatud liitumis. @et
toolkit label: liitumi kaastööline (tegija) @et
toolkit definition: Tegija, kes loob teose väljenduse, mis on teostatud liitumis. @et
label: hat Beiträgerin/Beiträger zu einem Aggregat (Akteur) @de
definition: Setzt eine Manifestation in Beziehung zu einem Akteur, der für die Schaffung einer Expression eines Werks verantwortlich ist, die durch ein Aggregat verkörpert wird. @de
toolkit label: Beiträgerin/Beiträger zu einem Aggregat (Akteur) @de
toolkit definition: Ein Akteur, der für die Schaffung einer Expression eines Werks verantwortlich ist, die durch ein Aggregat verkörpert wird. @de
label: aggregátum közreműködő ágense a következő: @hu
definition: Hozzákapcsol egy megjelenési formát egy ágenshez, amely aggregátor közreműködőként egy mű aggregátumban megtestesülő mű kifejezési formájának létrehozásáért felelős. @hu
toolkit label: aggregátum közreműködő ágense: @hu
toolkit definition: Egy ágens, amely aggregátor közreműködőként egy mű aggregátumban megtestesülő mű kifejezési formájának létrehozásáért felelős. @hu
label: apkopojuma līdzradītājs (aģents) @lv
definition: Sasaista manifestāciju ar aģentu, līdzradītājs, kurš rada apkopojumā ietverto darbu. @lv
toolkit label: apkopojuma līdzradītājs (aģents) @lv
toolkit definition: Aģents, līdzradītājs, kurš rada apkopojumā ietverto darbu. @lv
label: 有合集的贡献者行为者 @zh-hans
definition: 将一种载体表现与负责创建被一种合集具体化的一种作品的一种内容表达的一个行为者关联起来。 @zh-hans
toolkit label: 合集的贡献者行为者 @zh-hans
toolkit definition: 负责创建被一种合集具体化的一种作品的一种内容表达的一个行为者 @zh-hans
label: toplamaya katkıda bulunan temsilci ile ilişkilidir @tr
definition: Bir gösterimi, bir bütün tarafından somutlaştırılan bir eserin görüntüsünü oluşturmaktan sorumlu olan bir temsilciyle ilişkilendirir. @tr
toolkit label: topluluğa katkıda bulunan temsilci @tr
toolkit definition: Bir topluluk tarafından somutlaştırılan bir eserin ifadesini oluşturmaktan sorumlu olan temsilci. @tr
label: tiene agente colaborador para agregar @es
definition: Relaciona una manifestación con un agente que se encarga de crear una expresión de una obra que está encarnada por un agregado. @es
toolkit label: agente contribuyente para agregar @es
toolkit definition: Un agente que se encarga de crear una expresión de una obra que está encarnada por un agregado. @es
has subproperty: has contributor agent of cartography
has subproperty: has contributor agent of choreography
has subproperty: has contributor agent of computer content
has subproperty: has contributor agent of moving image
has subproperty: has contributor agent of music
has subproperty: has contributor agent of object
has subproperty: has contributor agent of speech
has subproperty: has contributor agent of still image
has subproperty: has contributor agent of text
has subproperty: has contributor collective agent to aggregate
has subproperty: has contributor person to aggregate
has subproperty: P30327

has contributor collective agent of cartography
status: Published
lexical alias: contributorCollectiveAgentOfCartography.en
definition: Relates a manifestation to a collective agent who is a contributor to aggregate who creates an expression of a cartographic work that is embodied by an aggregate.
toolkit label: contributor collective agent of cartography
toolkit definition: A collective agent who is a contributor to aggregate who creates an expression of a cartographic work that is embodied by an aggregate.
type: Property
domain: C10007
has element type: 2
sub property of: has contributor collective agent to aggregate
sub property of: has contributor agent of cartography
label: kartografiaan osallinen yhteistoimija @fi
definition: Liittää manifestaation aggregaattiin osalliseen yhteistoimijaan, joka on luonut aggregaattiin sisältyvän kartografisen teoksen ekspression. @fi
toolkit label: kartografiaan osallinen yhteistoimija @fi
toolkit definition: Aggregaattiin osallinen yhteistoimija, joka on luonut aggregaattiin sisältyvän kartografisen teoksen ekspression. @fi
label: har bidragsyter til kartografi (kollektiv agent) @no
definition: Relaterer en manifestasjon til en kollektiv agent som er en bidragsyter til aggregat som skaper et kartografisk verk som er realisert i et aggregat. @no
toolkit label: bidragsyter til kartografi (kollektiv agent) @no
toolkit definition: En kollektiv agent som er en bidragsyter til aggregat som skaper et kartografisk verk som er realisert i et aggregat. @no
label: a pour agent collectif contributeur de cartographie @fr
definition: Met une manifestation en relation avec un agent collectif contributeur à un agrégat qui crée une expression d’une œuvre cartographique matérialisée par un agrégat. @fr
toolkit label: agent collectif contributeur de cartographie @fr
toolkit definition: Agent collectif contributeur à un agrégat qui crée une expression d’une œuvre cartographique matérialisée par un agrégat. @fr
label: heeft bijdrage-collectieve actor van cartografie @nl
definition: Relateert een manifestatie aan een collectieve actor die is een bijdrager aan aggregaat die een expressie van een cartografisch werk creëert die is verwezenlijkt in een aggregaat. @nl
toolkit label: bijdrage-collectieve actor van cartografie @nl
toolkit definition: Een collectieve actor die is een bijdrager aan aggregaat die een expressie van een cartografisch werk creëert die is verwezenlijkt in een aggregaat. @nl
label: له وكيل جماعي مساهم برسم خرائط @ar
definition: يربط بين تجسيدة ووكيل جماعي يساهم في عمل تجميعي ينشيء عمل خرائطي يتجسد في تجميعية. @ar
toolkit label: وكيل جماعي مساهم برسم خرائط @ar
toolkit definition: وكيل جماعي يساهم في عمل تجميعي ينشيء عمل خرائطي يتجسد في تجميعية. @ar
label: té com a agent col·lectiu contribuïdor de cartografia @ca
definition: Relaciona una manifestació amb un agent col·lectiu que és un contribuïdor a un agregat i que crea una obra cartogràfica que es materialitza en un agregat. @ca
toolkit label: agent col·lectiu contribuïdor de cartografia @ca
toolkit definition: Agent col·lectiu que és un contribuïdor a un agregat i que crea una obra cartogràfica que es materialitza en un agregat. @ca
label: har kollektiv agent, som er bidragsyder til kartografi @da
definition: Relaterer en manifestation til en kollektiv agent, som er bidragsyder til samling, som skaber et kartografisk værk, der er indeholdt i en samling. @da
toolkit label: kollektiv agent, som er bidragsyder til kartografi @da
toolkit definition: Kollektiv agent, som er bidragsyder til samling, som skaber et kartografisk værk, der er indeholdt i en samling. @da
label: kaastööline kartograafia alal (kollektiiv) @et
definition: Seostab kehastuse kollektiiviga, kes on liitumi kaastööline, luues kartograafilise teose väljenduse, mis on teostatud liitumis. @et
toolkit label: kaastööline kartograafia alal (kollektiiv) @et
toolkit definition: Kollektiiv, kes on liitumi kaastööline, luues kartograafilise teose väljenduse, mis on teostatud liitumis. @et
label: hat Beiträgerin/Beiträger von einer Kartografie (Gemeinschaftlicher Akteur) @de
definition: Setzt eine Manifestation in Beziehung zu einer Beiträgerin/einem Beiträger zu einem Aggregat (Gemeinschaftlicher Akteur), die/der eine Expression eines kartografischen Werks erstellt, die durch ein Aggregat verkörpert wird. @de
toolkit label: Beiträgerin/Beiträger von einer Kartografie (Gemeinschaftlicher Akteur) @de
toolkit definition: Eine Beiträgerin/Ein Beiträger zu einem Aggregat (Gemeinschaftlicher Akteur), die/der eine Expression eines kartografischen Werks erstellt, die durch ein Aggregat verkörpert wird. @de
label: térképészet közreműködő kollektív ágense a következő: @hu
definition: Hozzákapcsol egy megjelenési formát egy kollektív ágenshez, amely aggregátor közreműködőként egy kartográfiai mű olyan kifejezési formáját hozza létre, amely egy aggregátumban testesül meg. @hu
toolkit label: térképészet közreműködő kollektív ágense @hu
toolkit definition: Egy kollektív ágens, amely aggregátor közreműködőként egy kartográfiai mű olyan kifejezési formáját hozza létre, amely egy aggregátumban testesül meg. @hu
label: ha come contributore di cartografia agente collettivo @it
definition: Correla una manifestazione all'agente collettivo, contributore a un aggregato, che crea un'opera cartografica materializzata in un aggregato. @it
toolkit label: contributore di cartografia agente collettivo @it
toolkit definition: Agente collettivo, contributore a un aggregato, che crea un'opera cartografica materializzata in un aggregato. @it
label: kartogrāfijas līdzradītājs (grupa) @lv
definition: Sasaista manifestāciju ar grupu, kas ir līdzradītājs, kas radījusi apkopojumā ietverto kartogrāfijas darbu. @lv
toolkit label: kartogrāfijas līdzradītājs (grupa) @lv
toolkit definition: Grupa - līdzradītājs, kas radījusi apkopojumā ietverto kartogrāfijas darbu. @lv
label: 有地图绘制贡献者集体行为者 @zh-hans
definition: 将一种载体表现与作为合集的一个贡献者并创建被一种合集具体化的一种地图作品的一种内容表达的一个集体行为者关联起来。 @zh-hans
toolkit label: 地图绘制贡献者集体行为者 @zh-hans
toolkit definition: 作为合集的一个贡献者并创建被一种合集具体化的一种地图作品的一种内容表达的一个集体行为者 @zh-hans
label: kartografiye katkıda bulunan kolektif temsilci ile ilişkilidir @tr
definition: Bir gösterimi, bir bütünün somutlaştırdığı bir kartografik çalışmanın bir ifadesini yaratan, bütüne katkıda bulunan kolektif temsilci ile ilişkilendirir. @tr
toolkit label: kartografyaya katkıda bulunan kolektif temsilci @tr
toolkit definition: Bir bütünün parçası olan ve bir kartografik eserin ifadesini oluşturarak bu eseri bir bütün içinde somutlaştıran kolektif temsilci. @tr
label: tiene agente colectivo colaborador de cartografía @es
definition: Relaciona una manifestación con un agente colectivo que es colaborador de un agregado que crea una expresión de una obra cartográfica que es encarnada por un agregado. @es
toolkit label: agente colectivo colaborador de cartografía @es
toolkit definition: Un agente colectivo que es colaborador de un agregado que crea una expresión de una obra cartográfica que es encarnada por un agregado. @es
has subproperty: has contributor corporate body of cartography
has subproperty: has contributor family of cartography
has subproperty: has surveyor collective agent
has subproperty: P30367

has contributor collective agent of choreography
status: Published
lexical alias: contributorCollectiveAgentOfChoreography.en
definition: Relates a manifestation to a collective agent who is a contributor to aggregate who creates an expression of a choreographic work that is embodied by an aggregate.
toolkit label: contributor collective agent of choreography
toolkit definition: A collective agent who is a contributor to aggregate who creates an expression of a choreographic work that is embodied by an aggregate.
type: Property
domain: C10007
has element type: 2
sub property of: has contributor collective agent to aggregate
sub property of: has contributor agent of choreography
label: koreografiaan osallinen yhteistoimija @fi
definition: Liittää manifestaation aggregaattiin osalliseen yhteistoimijaan, joka on luonut aggregaattiin sisältyvän koreografisen teoksen ekspression. @fi
toolkit label: koreografiaan osallinen yhteistoimija @fi
toolkit definition: Aggregaattiin osallinen yhteistoimija, joka on luonut aggregaattiin sisältyvän koreografisen teoksen ekspression. @fi
label: har bidragsyter til koreografi (kollektiv agent) @no
definition: Relaterer en manifestasjon til en kollektiv agent som er en bidragsyter til aggregat som skaper et koreografisk verk som er realisert i et aggregat. @no
toolkit label: bidragsyter til koreografi (kollektiv agent) @no
toolkit definition: En kollektiv agent som er en bidragsyter til aggregat som skaper et koreografisk verk som er realisert i et aggregat. @no
label: a pour agent collectif contributeur de chorégraphie @fr
definition: Met une manifestation en relation avec un agent collectif contributeur à un agrégat qui crée une expression d’une œuvre chorégraphique matérialisée par un agrégat. @fr
toolkit label: agent collectif contributeur de chorégraphie @fr
toolkit definition: Agent collectif contributeur à un agrégat qui crée une expression d’une œuvre chorégraphique matérialisée par un agrégat. @fr
label: heeft bijdrage-collectieve actor van choreografie @nl
definition: Relateert een manifestatie aan een collectieve actor die is een bijdrager aan aggregaat die een expressie van een choreografisch werk creëert die is verwezenlijkt in een aggregaat. @nl
toolkit label: bijdrage-collectieve actor van choreografie @nl
toolkit definition: Een collectieve actor die is een bijdrager aan aggregaat die een expressie van een choreografisch werk creëert die is verwezenlijkt in een aggregaat. @nl
label: له وكيل جماعي مساهم بتصميم رقصات @ar
definition: يربط بين تجسيدة ووكيل جماعي مساهم في عمل تجميعي ينشيء عمل من تصميم الرقصات يتجسيد في تجميعية. @ar
toolkit label: وكيل جماعي مساهم بتصميم رقصات @ar
toolkit definition: وكيل جماعي مساهم في عمل تجميعي ينشيء عمل من تصميم الرقصات يتجسيد في تجميعية. @ar
label: té com a agent col·lectiu contribuïdor de coreografia @ca
definition: Relaciona una manifestació amb un agent col·lectiu que és un contribuïdor a un agregat i que crea una expressió d’una obra coreogràfica que es materialitza en un agregat. @ca
toolkit label: agent col·lectiu contribuïdor de coreografia @ca
toolkit definition: Agent col·lectiu que és un contribuïdor a un agregat i que crea una expressió d’una obra coreogràfica que es materialitza en un agregat. @ca
label: har kollektiv agent, som er bidragsyder til koreografi @da
definition: Relaterer en manifestation til en kollektiv agent, som er bidragsyder til samling, som skaber et koreografisk værk, der er indeholdt i en samling. @da
toolkit label: kollektiv agent, som er bidragsyder til koreografi @da
toolkit definition: Kollektiv agent, som er bidragsyder til samling, som skaber et koreografisk værk, der er indeholdt i en samling. @da
label: kaastööline koreograafia alal (kollektiiv) @et
definition: Seostab kehastuse kollektiiviga, kes on liitumi kaastööline, luues koreograafilise teose väljenduse, mis on teostatud liitumis. @et
toolkit label: kaastööline koreograafia alal (kollektiiv) @et
toolkit definition: Kollektiiv, kes on liitumi kaastööline, luues koreograafilise teose väljenduse, mis on teostatud liitumis. @et
label: hat Beiträgerin/Beiträger von einer Choreografie (Gemeinschaftlicher Akteur) @de
definition: Setzt eine Manifestation in Beziehung zu einer Beiträgerin/einem Beiträger zu einem Aggregat (Gemeinschaftlicher Akteur), die/der eine Expression eines choreografischen Werks erstellt, die durch ein Aggregat verkörpert wird. @de
toolkit label: Beiträgerin/Beiträger von einer Choreografie (Gemeinschaftlicher Akteur) @de
toolkit definition: Eine Beiträgerin/Ein Beiträger zu einem Aggregat (Gemeinschaftlicher Akteur), die/der eine Expression eines choreografischen Werks erstellt, die durch ein Aggregat verkörpert wird. @de
label: koreográfia közreműködő kollektív ágense a következő: @hu
definition: Hozzákapcsol egy megjelenési formát egy kollektív ágenshez, amely aggregátor közreműködőként oegy koreografikus mű olyan kifejezési formáját hozza létre, amely egy aggregátumban testesül meg. @hu
toolkit label: koreográfia közreműködő kollektív ágense @hu
toolkit definition: Egy kollektív ágens, amely aggregátor közreműködőként oegy koreografikus mű olyan kifejezési formáját hozza létre, amely egy aggregátumban testesül meg. @hu
label: ha come contributore di coreografia agente collettivo @it
definition: Correla una manifestazione all'agente collettivo, contributore a un aggregato, che crea un'opera coreografica, materializzata in un aggregato. @it
toolkit label: contributore di coreografia agente collettivo @it
toolkit definition: Agente collettivo, contributore a un aggregato, che crea un'opera coreografica, materializzata in un aggregato. @it
label: horeogrāfijas līdzradītājs (grupa) @lv
definition: Sasaista manifestāciju ar grupu, kas ir līdzradītājs, kas radījusi apkopojumā ietverto horeogrāfijas darbu. @lv
toolkit label: horeogrāfijas līdzradītājs (grupa) @lv
toolkit definition: Grupa - līdzradītājs, kas radījusi apkopojumā ietverto horeogrāfijas darbu. @lv
label: 有编舞贡献者集体行为者 @zh-hans
definition: 将一种载体表现与作为合集的一个贡献者并创建被一种合集具体化的一种编舞作品的一种内容表达的一个集体行为者关联起来。 @zh-hans
toolkit label: 编舞贡献者集体行为者 @zh-hans
toolkit definition: 作为合集的一个贡献者并创建被一种合集具体化的一种编舞作品的一种内容表达的一个集体行为者 @zh-hans
label: koreografiye katkıda bulunan kolektif temsilci ile ilişkilidir @tr
definition: Bir gösterimi, bir topluluk tarafından somutlaştırılan bir koreografik eserin anlatımını yaratan, topluluğa katkıda bulunan kolektif temsilci ile ilişkilendirir. @tr
toolkit label: koreografiye katkıda bulunan kolektif temsilci @tr
toolkit definition: Bir bütünün parçası olan ve bir koreografik eserin ifadesini oluşturarak bu eseri bir bütün içinde somutlaştıran kolektif temsilci. @tr
label: tiene agente colectivo colaborador de coreografía @es
definition: Relaciona una manifestación con un agente colectivo que es un colaborador del agregado que crea una expresión de una obra coreográfica que es encarnada por un agregado. @es
toolkit label: agente colectivo colaborador de coreografía @es
toolkit definition: Un agente colectivo que es un colaborador del agregado que crea una expresión de una obra coreográfica que es encarnada por un agregado. @es
has subproperty: has contributor corporate body of choreography
has subproperty: has contributor family of choreography
has subproperty: P30368

has contributor collective agent of computer content
status: Published
lexical alias: contributorCollectiveAgentOfComputerContent.en
definition: Relates a manifestation to a collective agent who is a contributor to aggregate who creates an expression of computer content that is embodied by an aggregate.
toolkit label: contributor collective agent of computer content
toolkit definition: A collective agent who is a contributor to aggregate who creates an expression of computer content that is embodied by an aggregate.
type: Property
domain: C10007
has element type: 2
sub property of: has contributor collective agent to aggregate
sub property of: has contributor agent of computer content
label: digitaaliseen sisältöön osallinen yhteistoimija @fi
definition: Liittää manifestaation aggregaattiin osalliseen yhteistoimijaan, joka on luonut aggregaattiin sisältyvän digitaalisen sisällön ekspression. @fi
toolkit label: digitaaliseen sisältöön osallinen yhteistoimija @fi
toolkit definition: Aggregaattiin osallinen yhteistoimija, joka on luonut aggregaattiin sisältyvän digitaalisen sisällön ekspression. @fi
label: har bidragsyter til datamaskininnhold (kollektiv agent) @no
definition: Relaterer en manifestasjon til en kollektiv agent som er en bidragsyter til aggregat som skaper datamaskininnhold som er realisert i et aggregat. @no
toolkit label: bidragsyter til datamaskininnhold (kollektiv agent) @no
toolkit definition: En kollektiv agent som er en bidragsyter til aggregat som skaper datamaskininnhold som er realisert i et aggregat. @no
label: a pour agent collectif contributeur de contenu informatique @fr
definition: Met une manifestation en relation avec un agent collectif contributeur à un agrégat qui crée une expression d’un contenu informatique matérialisée par un agrégat. @fr
toolkit label: agent collectif contributeur de contenu informatique @fr
toolkit definition: Agent collectif contributeur à un agrégat qui crée une expression d’un contenu informatique matérialisée par un agrégat. @fr
label: heeft bijdrage-collectieve actor van computercontent @nl
definition: Relateert een manifestatie aan een collectieve actor die is een bijdrager aan aggregaat die een expressie van computercontent creëert die is verwezenlijkt in een aggregaat. @nl
toolkit label: bijdrage-collectieve actor van computercontent @nl
toolkit definition: Een collectieve actor die is een bijdrager aan aggregaat die een expressie van computercontent creëert die is verwezenlijkt in een aggregaat. @nl
label: له وكيل جماعي مساهم بمحتوى كمبيوتر @ar
definition: يربط بين تجسيدة ووكيل جماعي مساهم في عمل تجميعي ينشيء محتوى كمبيوتر يتجسد في تجميعية. @ar
toolkit label: وكيل جماعي مساهم بمحتوى كمبيوتر @ar
toolkit definition: وكيل جماعي مساهم في عمل تجميعي ينشيء محتوى كمبيوتر يتجسد في تجميعية. @ar
label: té com a agent col·lectiu contribuïdor de contingut informàtic @ca
definition: Relaciona una manifestació amb un agent col·lectiu que és un contribuïdor a un agregat que crea una expressió de contingut informàtic que es materialitza en un agregat. @ca
toolkit label: agent col·lectiu contribuïdor de contingut informàtic @ca
toolkit definition: Agent col·lectiu que és un contribuïdor a un agregat que crea una expressió de contingut informàtic que es materialitza en un agregat. @ca
label: har kollektiv agent, som er bidragsyder til computerindhold @da
definition: Relaterer en manifestation til en kollektiv agent, som er bidragsyder til samling, som skaber computerindhold, der er indeholdt i en samling. @da
toolkit label: kollektiv agent, som er bidragsyder til computerindhold @da
toolkit definition: Kollektiv agent, som er bidragsyder til samling, som skaber computerindhold, der er indeholdt i en samling. @da
label: digisisu kaastööline (kollektiiv) @et
definition: Seostab kehastuse kollektiiviga, kes on liitumi kaastööline, luues digisisu väljenduse, mis on teostatud liitumis. @et
toolkit label: digisisu kaastööline (kollektiiv) @et
toolkit definition: Kollektiiv, kes on liitumi kaastööline, luues digisisu väljenduse, mis on teostatud liitumis. @et
label: hat Beiträgerin/Beiträger von Computer Content (Gemeinschaftlicher Akteur) @de
definition: Setzt eine Manifestation in Beziehung zu einer Beiträgerin/einem Beiträger zu einem Aggregat (Gemeinschaftlicher Akteur), die/der eine Expression von Computer Content erstellt, die durch ein Aggregat verkörpert wird. @de
toolkit label: Beiträgerin/Beiträger von Computer Content (Gemeinschaftlicher Akteur) @de
toolkit definition: Eine Beiträgerin/Ein Beiträger zu einem Aggregat (Gemeinschaftlicher Akteur), die/der eine Expression von Computer Content erstellt, die durch ein Aggregat verkörpert wird. @de
label: számítógépes tartalom közreműködő kollektív ágense a következő: @hu
definition: Egy megjelenési formát hozzákapcsol egy kollektív ágenshez, amely aggregátor közreműködőként egy számítógépes tartalom olyan kifejezési formáját hozza létre, amely egy aggregátumban testesül meg. @hu
toolkit label: számítógépes tartalom közreműködő kollektív ágense @hu
toolkit definition: Egy kollektív ágens, amely aggregátor közreműködőként egy számítógépes tartalom olyan kifejezési formáját hozza létre, amely egy aggregátumban testesül meg. @hu
label: ha come contributore di contenuto informatico agente collettivo @it
definition: Correla una manifestazione all'agente collettivo, contributore a un aggregato, che crea un contenuto informatico, materializzato in un aggregato. @it
toolkit label: contributore di contenuto informatico agente collettivo @it
toolkit definition: Agente collettivo, contributore a un aggregato, che crea un contenuto informatico materializzato in un aggregato. @it
label: datororientēta satura līdzradītājs (grupa) @lv
definition: Sasaista manifestāciju ar grupu, kas ir līdzradītājs, kas radījusi apkopojumā ietverto datororientēto saturu. @lv
toolkit label: datororientēta satura līdzradītājs (grupa) @lv
toolkit definition: Grupa - līdzradītājs, kas radījusi apkopojumā ietverto datororientēto saturu. @lv
label: 有计算机内容的贡献者集体行为者 @zh-hans
definition: 将一种载体表现与作为合集的一个贡献者并创建被一种合集具体化的一种计算机内容的一种内容表达的一个集体行为者关联起来。 @zh-hans
toolkit label: 计算机内容的贡献者集体行为者 @zh-hans
toolkit definition: 作为合集的一个贡献者并创建被一种合集具体化的一种计算机内容的一种内容表达的一个集体行为者 @zh-hans
label: bilgisayar içeriğine katkıda bulunan kolektif temsilci ile ilişkilidir @tr
definition: Bir gösterimi, bir topluluk tarafından somutlaştırılan bilgisayar içeriğinin bir anlatımını yaratan, topluluğa katkıda bulunan kolektif bir temsilciyle ilişkilendirir. @tr
toolkit label: bilgisayar içeriğine katkıda bulunan kolektif temsilci @tr
toolkit definition: Bir topluluk tarafından somutlaştırılan bilgisayar içeriğinin bir anlatımını yaratan, topluluğa katkıda bulunan kolektif bir temsilci. @tr
label: tiene agente colectivo colaborador de contenidos informáticos @es
definition: Relaciona una manifestación con un agente colectivo que es un colaborador al agregado y crea una expresión de contenido informático que está encarnado por un agregado. @es
toolkit label: agente colectivo colaborador de contenidos informáticos @es
toolkit definition: Un agente colectivo que es un colaborador al agregado y crea una expresión de contenido informático que está encarnado por un agregado. @es
has subproperty: has contributor corporate body of computer content
has subproperty: has contributor family of computer content
has subproperty: P30375

has contributor collective agent of moving image
status: Published
lexical alias: contributorCollectiveAgentOfMovingImage.en
definition: Relates a manifestation to a collective agent who is a contributor to aggregate who creates an expression of a moving image work that is embodied by an aggregate.
toolkit label: contributor collective agent of moving image
toolkit definition: A collective agent who is a contributor to aggregate who creates an expression of a moving image work that is embodied by an aggregate.
type: Property
domain: C10007
has element type: 2
sub property of: has contributor collective agent to aggregate
sub property of: has contributor agent of moving image
label: liikkuvaan kuvaan osallinen yhteistoimija @fi
definition: Liittää manifestaation aggregaattiin osalliseen yhteistoimijaan, joka on luonut aggregaattiin sisältyvän liikkuvan kuvan teoksen ekspression. @fi
toolkit label: liikkuvaan kuvaan osallinen yhteistoimija @fi
toolkit definition: Aggregaattiin osallinen yhteistoimija, joka on luonut aggregaattiin sisältyvän liikkuvan kuvan teoksen ekspression. @fi
label: har bidragsyter til levende bilder (kollektiv agent) @no
definition: Relaterer en manifestasjon til en kollektiv agent som er en bidragsyter til aggregat som skaper et verk med levende bilder som er realisert i et aggregat. @no
toolkit label: bidragsyter til levende bilder (kollektiv agent) @no
toolkit definition: En kollektiv agent som er en bidragsyter til aggregat som skaper et verk med levende bilder som er realisert i et aggregat. @no
label: a pour agent collectif contributeur d’images animées @fr
definition: Met une manifestation en relation avec un agent collectif contributeur à un agrégat qui crée une expression d’une œuvre d’images animées matérialisée par un agrégat. @fr
toolkit label: agent collectif contributeur d’images animées @fr
toolkit definition: Agent collectif contributeur à un agrégat qui crée une expression d’une œuvre d’images animées matérialisée par un agrégat. @fr
label: heeft bijdrage-collectieve actor van bewegend beeld @nl
definition: Relateert een manifestatie aan een collectieve actor die is een bijdrager aan aggregaat die een expressie van een bewegend beeldwerk creëert die is verwezenlijkt in een aggregaat. @nl
toolkit label: bijdrage-collectieve actor van bewegend beeld @nl
toolkit definition: Een collectieve actor die is een bijdrager aan aggregaat die een expressie van een bewegend beeldwerk creëert die is verwezenlijkt in een aggregaat. @nl
label: له وكيل جماعي مساهم بصور متحركة @ar
definition: يربط بين تجسيدة ووكيل جماعي مساهم في عمل تجميعي ينشيء عمل من صور متحركة يتجسد في تجميعية. @ar
toolkit label: وكيل جماعي مساهم بصور متحركة @ar
toolkit definition: وكيل جماعي مساهم في عمل تجميعي ينشيء عمل من صور متحركة يتجسد في تجميعية. @ar
label: té com a agent col·lectiu contribuïdor d’imatge en moviment @ca
definition: Relaciona una manifestació amb un agent col·lectiu que és un contribuïdor a un agregat i que crea una expressió d’una obra d’imatge en moviment que es materialitza en un agregat. @ca
toolkit label: agent col·lectiu contribuïdor d’imatge en moviment @ca
toolkit definition: Agent col·lectiu que és un contribuïdor a un agregat i que crea una expressió d’una obra d’imatge en moviment que es materialitza en un agregat. @ca
label: har kollektiv agent, som er bidragsyder til levende billede @da
definition: Relaterer en manifestation til en kollektiv agent, som er bidragsyder til samling, som skaber et værk med levende billeder, der er indeholdt i en samling. @da
toolkit label: kollektiv agent, som er bidragsyder til levende billede @da
toolkit definition: Kollektiv agent, som er bidragsyder til samling, som skaber et værk med levende billeder, der er indeholdt i en samling. @da
label: kaastööline liikuva pildi alal (kollektiiv) @et
definition: Seostab kehastuse kollektiiviga, kes on liitumi kaastööline, luues liikuvast pildist koosneva teose väljenduse, mis on teostatud liitumis. @et
toolkit label: kaastööline liikuva pildi alal (kollektiiv) @et
toolkit definition: Kollektiiv, kes on liitumi kaastööline, luues liikuvast pildist koosneva teose väljenduse, mis on teostatud liitumis. @et
label: hat Beiträgerin/Beiträger von einem Bewegtbild (Gemeinschaftlicher Akteur) @de
definition: Setzt eine Manifestation in Beziehung zu einer Beiträgerin/einem Beiträger zu einem Aggregat (Gemeinschaftlicher Akteur), die/der eine Expression eines Bewegtbildwerks erstellt, die durch ein Aggregat verkörpert wird. @de
toolkit label: Beiträgerin/Beiträger von einem Bewegtbild (Gemeinschaftlicher Akteur) @de
toolkit definition: Eine Beiträgerin/Ein Beiträger zu einem Aggregat (Gemeinschaftlicher Akteur), die/der eine Expression eines Bewegtbildwerks erstellt, die durch ein Aggregat verkörpert wird. @de
label: mozgókép közreműködő kollektív ágense a következő: @hu
definition: Hozzákapcsol egy megjelenési formát egy kollektív ágenshez, amely aggregátor közreműködőként egy mozgóképmű olyan kifejezési formáját hozza létre, amely egy aggregátumban testesül meg. @hu
toolkit label: mozgókép közreműködő kollektív ágense: @hu
toolkit definition: Egy kollektív ágens, amely aggregátor közreműködőként egy mozgóképmű olyan kifejezési formáját hozza létre, amely egy aggregátumban testesül meg. @hu
label: ha come contributore di immagine in movimento agente collettivo @it
definition: Correla una manifestazione all'agente collettivo, contributore a un aggregato, che crea un'opera di immagini in movimento, materializzata in un aggregato. @it
toolkit label: contributore di immagine in movimento agente collettivo @it
toolkit definition: Agente collettiivo, contributore a un aggregato, che crea un'opera di immagini in movimento, materializzata in un aggregato. @it
label: kustīga attēla līdzradītājs (grupa) @lv
definition: Sasaista manifestāciju ar grupu, kas ir līdzradītājs, kas radījusi apkopojumā ietverto kustīgā attēla darbu. @lv
toolkit label: kustīga attēla līdzradītājs (grupa) @lv
toolkit definition: Grupa - līdzradītājs, kas radījusi apkopojumā ietverto kustīgā attēla darbu. @lv
label: 有动态图像的贡献者集体行为者 @zh-hans
definition: 将一种载体表现与作为合集的一个贡献者并创建被一种合集具体化的一种动态图像作品的一种内容表达的一个集体行为者关联起来。 @zh-hans
toolkit label: 动态图像的贡献者集体行为者 @zh-hans
toolkit definition: 作为合集的一个贡献者并创建被一种合集具体化的一种动态图像作品的一种内容表达的一个集体行为者 @zh-hans
label: hareketli görüntüye katkıda bulunan kolektif temsilci ile ilişkilidir @tr
definition: Bir gösterimi, bir topluluğun somutlaştırdığı hareketli bir görüntü eserinin anlatımını yaratan, bütüne katkıda bulunan kolektif bir temsilci ile ilişkilendirir. @tr
toolkit label: hareketli̇ görüntüye katkıda bulunan kolektif temsilci @tr
toolkit definition: Bir bütünün parçası olan ve bir hareketli görüntü eserinin ifadesini oluşturarak bu eseri bir bütün içinde somutlaştıran kolektif temsilci. @tr
label: tiene agente colectivo colaborador de imagen en movimiento @es
definition: Relaciona una manifestación con un agente colectivo que es un colaborador al agregado que crea una expresión de una obra de imagen en movimiento que es encarnada por un agregado. @es
toolkit label: agente colectivo colaborador de imagen en movimiento @es
toolkit definition: Un agente colectivo que es un colaborador al agregado que crea una expresión de una obra de imagen en movimiento que es encarnada por un agregado. @es
has subproperty: has contributor corporate body of moving image
has subproperty: has contributor family of moving image
has subproperty: P30369

has contributor collective agent of music
status: Published
lexical alias: contributorCollectiveAgentOfMusic.en
definition: Relates a manifestation to a collective agent who is a contributor to aggregate who creates an expression of a musical work that is embodied by an aggregate.
toolkit label: contributor collective agent of music
toolkit definition: A collective agent who is a contributor to aggregate who creates an expression of a musical work that is embodied by an aggregate.
type: Property
domain: C10007
has element type: 2
sub property of: has contributor collective agent to aggregate
sub property of: has contributor agent of music
label: musiikkiin osallinen yhteistoimija @fi
definition: Liittää manifestaation aggregaattiin osalliseen yhteistoimijaan, joka on luonut aggregaattiin sisältyvän musiikkiteoksen ekspression. @fi
toolkit label: musiikkiin osallinen yhteistoimija @fi
toolkit definition: Aggregaattiin osallinen yhteistoimija, joka on luonut aggregaattiin sisältyvän musiikkiteoksen ekspression. @fi
label: har bidragsyter til musikk (kollektiv agent) @no
definition: Relaterer en manifestasjon til en kollektiv agent som er en bidragsyter til aggregat som skaper et musikalsk verk som er realisert i et aggregat. @no
toolkit label: bidragsyter til musikk (kollektiv agent) @no
toolkit definition: En kollektiv agent som er en bidragsyter til aggregat som skaper et musikalsk verk som er realisert i et aggregat. @no
label: a pour agent collectif contributeur de musique @fr
definition: Met une manifestation en relation avec un agent collectif contributeur à un agrégat qui crée une expression d’une œuvre musicale matérialisée par un agrégat. @fr
toolkit label: agent collectif contributeur de musique @fr
toolkit definition: Agent collectif contributeur à un agrégat qui crée une expression d’une œuvre musicale matérialisée par un agrégat. @fr
label: heeft bijdrage-collectieve actor van muziek @nl
definition: Relateert een manifestatie aan een collectieve actor die is een bijdrager aan aggregaat die een expressie van een muziekwerk creëert die is verwezenlijkt in een aggregaat. @nl
toolkit label: bijdrage-collectieve actor van muziek @nl
toolkit definition: Een collectieve actor die is een bijdrager aan aggregaat die een expressie van een muziekwerk creëert die is verwezenlijkt in een aggregaat. @nl
label: له وكيل جماعي مساهم بموسيقى @ar
definition: يربط بين تجسيدة ووكيل جماعي مساهم في عمل تجميعي بإنشاء عمل موسيقي يتجسد في تجميعية. @ar
toolkit label: وكيل جماعي مساهم بموسيقى @ar
toolkit definition: وكيل جماعي مساهم في عمل تجميعي بإنشاء عمل موسيقي يتجسد في تجميعية. @ar
label: té com a agent col·lectiu contribuïdor de música @ca
definition: Relaciona una manifestació amb un agent col·lectiu que és un contribuïdor a un agregat i que crea una expressió d’una obra musical que es materialitza en un agregat. @ca
toolkit label: agent col·lectiu contribuïdor de música @ca
toolkit definition: Agent col·lectiu que és un contribuïdor a un agregat i que crea una expressió d’una obra musical que es materialitza en un agregat. @ca
label: har kollektiv agent, som er bidragsyder til musik @da
definition: Relaterer en manifestation til en kollektiv agent, som er bidragsyder til samling, som skaber et musikværk, der er indeholdt i en samling. @da
toolkit label: kollektiv agent, som er bidragsyder til musik @da
toolkit definition: Kollektiv agent, som er bidragsyder til samling, som skaber et musikværk, der er indeholdt i en samling. @da
label: muusikaline kaastööline (kollektiiv) @et
definition: Seostab kehastuse kollektiiviga, kes on liitumi kaastööline, luues muusikateose väljenduse, mis on teostatud liitumis. @et
toolkit label: muusikaline kaastööline (kollektiiv) @et
toolkit definition: Kollektiiv, kes on liitumi kaastööline, luues muusikateose väljenduse, mis on teostatud liitumis. @et
label: hat Beiträgerin/Beiträger einer Musik (Gemeinschaftlicher Akteur) @de
definition: Setzt eine Manifestation in Beziehung zu einer Beiträgerin/einem Beiträger zu einem Aggregat (Gemeinschaftlicher Akteur), die/der eine Expression eines Musikwerks erstellt, die durch ein Aggregat verkörpert wird. @de
toolkit label: Beiträgerin/Beiträger einer Musik (Gemeinschaftlicher Akteur) @de
toolkit definition: Eine Beiträgerin/Ein Beiträger zu einem Aggregat (Gemeinschaftlicher Akteur), die/der eine Expression eines Musikwerks erstellt, die durch ein Aggregat verkörpert wird. @de
label: zene közreműködő kollektív ágense a következő: @hu
definition: Hozzákapcsol egy megjelenési formát egy kollektív ágenshez, amely aggregátor közreműködőként egy zenemű olyan kifejezési formáját hozza létre, amely egy aggregátumban testesül meg. @hu
toolkit label: zene közreműködő kollektív ágense @hu
toolkit definition: Egy kollektív ágens, amely aggregátor közreműködőként egy zenemű olyan kifejezési formáját hozza létre, amely egy aggregátumban testesül meg. @hu
label: ha come contributore di musica agente collettivo @it
definition: Correla una manifestazione all'agente collettivo, contributore a un aggregato, che crea un'opera musicale, materializzata in un aggregato. @it
toolkit label: contributore di musica agente collettivo @it
toolkit definition: Agente collettivo, contributore a un aggregato, che crea un'opera musicale, materializzata in un aggregato. @it
label: mūzikas līdzradītājs (grupa) @lv
definition: Sasaista manifestāciju ar grupu, kas ir līdzradītājs, kas radījusi apkopojumā ietverto mūzikas darbu. @lv
toolkit label: mūzikas līdzradītājs (grupa) @lv
toolkit definition: Grupa - līdzradītājs, kas radījusi apkopojumā ietverto mūzikas darbu. @lv
label: 有音乐的贡献者集体行为者 @zh-hans
definition: 将一种载体表现与作为合集的一个贡献者并创建被一种合集具体化的一种音乐作品的一种内容表达的一个集体行为者关联起来。 @zh-hans
toolkit label: 音乐的贡献者集体行为者 @zh-hans
toolkit definition: 作为合集的一个贡献者并创建被一种合集具体化的一种音乐作品的一种内容表达的一个集体行为者 @zh-hans
label: müziği katkıda bulunan kolektif temsilci ile ilişkilidir @tr
definition: Bir gösterimi, bir topluluk tarafından somutlaştırılan bir müzik eserinin anlatımını yaratan, topluluğa katkıda bulunan kolektif temsilci ile ilişkilendirir. @tr
toolkit label: müzi̇ğe katkıda bulunan kolektif temsi̇lci̇ @tr
toolkit definition: Bir müzik eserinin ifadesini yaratan, bu ifadeyi toplayan ve bir topluluk tarafından somutlaştırılan bir bütüne katkıda bulunan kolektif temsilci. @tr
label: tiene agente colectivo colaborador de música @es
definition: Relaciona una manifestación con un agente colectivo que es un colaborador al agregado que crea una expresión de una obra musical que es encarnada por un agregado. @es
toolkit label: agente colectivo colaborador de música @es
toolkit definition: Un agente colectivo que es un colaborador al agregado que crea una expresión de una obra musical que es encarnada por un agregado. @es
has subproperty: has contributor corporate body of music
has subproperty: has contributor family of music
has subproperty: P30370

has contributor collective agent of object
status: Published
lexical alias: contributorCollectiveAgentOfObject.en
definition: Relates a manifestation to a collective agent who is a contributor to aggregate who creates an expression of an object work that is embodied by an aggregate.
toolkit label: contributor collective agent of object
toolkit definition: A collective agent who is a contributor to aggregate who creates an expression of an object work that is embodied by an aggregate.
type: Property
domain: C10007
has element type: 2
sub property of: has contributor collective agent to aggregate
sub property of: has contributor agent of object
label: esineeseen osallinen yhteistoimija @fi
definition: Liittää manifestaation aggregaattiin osalliseen yhteistoimijaan, joka on luonut aggregaattiin sisältyvän esineteoksen ekspression. @fi
toolkit label: esineeseen osallinen yhteistoimija @fi
toolkit definition: Aggregaattiin osallinen yhteistoimija, joka on luonut aggregaattiin sisältyvän esineteoksen ekspression. @fi
label: har bidragsyter til gjenstand (kollektiv agent) @no
definition: Relaterer en manifestasjon til en kollektiv agent som er en bidragsyter til aggregat som skaper et verk som er en gjenstand som er realisert i et aggregat. @no
toolkit label: bidragsyter til gjenstand (kollektiv agent) @no
toolkit definition: En kollektiv agent som er en bidragsyter til aggregat som skaper et verk som er en gjenstand som er realisert i et aggregat. @no
label: a pour agent collectif contributeur d’objet @fr
definition: Met une manifestation en relation avec un agent collectif contributeur à un agrégat qui crée une expression d’une œuvre objet matérialisée par un agrégat. @fr
toolkit label: agent collectif contributeur d’objet @fr
toolkit definition: Agent collectif contributeur à un agrégat qui crée une expression d’une œuvre objet matérialisée par un agrégat. @fr
label: heeft bijdrage-collectieve actor van object @nl
definition: Relateert een manifestatie aan een collectieve actor die is een bijdrager aan aggregaat die een expressie van een objectwerk creëert die is verwezenlijkt in een aggregaat. @nl
toolkit label: bijdrage-collectieve actor van object @nl
toolkit definition: Een collectieve actor die is een bijdrager aan aggregaat die een expressie van een objectwerk creëert die is verwezenlijkt in een aggregaat. @nl
label: له وكيل جماعي مساهم بكائن @ar
definition: يربط بين تجسيدة ووكيل جماعي مساهم في عمل تجميعي ينشيء عمل شيء ما يتجسد في تجميعية. @ar
toolkit label: وكيل جماعي مساهم بكائن @ar
toolkit definition: وكيل جماعي مساهم في عمل تجميعي ينشيء عمل شيء ما يتجسد في تجميعية. @ar
label: té com a agent col·lectiu contribuïdor d’objecte @ca
definition: Relaciona una manifestació amb un agent col·lectiu que és un contribuïdor a un agregat que crea expressió d’una obra d’objecte que es materialitza en un agregat. @ca
toolkit label: agent col·lectiu contribuïdor d’objecte @ca
toolkit definition: Agent col·lectiu que és un contribuïdor a un agregat que crea expressió d’una obra d’objecte que es materialitza en un agregat. @ca
label: har kollektiv agent, som er bidragsyder til objekt @da
definition: Relaterer en manifestation til en kollektiv agent, som er bidragsyder til samling, som skaber et værk med objekt, der er indeholdt i en samling. @da
toolkit label: kollektiv agent, som er bidragsyder til objekt @da
toolkit definition: Kollektiv agent, som er bidragsyder til samling, som skaber et værk med objekt, der er indeholdt i en samling. @da
label: objektiloome kaastööline (kollektiiv) @et
definition: Seostab kehastuse kollektiiviga, kes on liitumi kaastööline, luues objektteose väljenduse, mis on teostatud liitumis. @et
toolkit label: objektiloome kaastööline (kollektiiv) @et
toolkit definition: Kollektiiv, kes on liitumi kaastööline, luues objektteose väljenduse, mis on teostatud liitumis. @et
label: hat Beiträgerin/Beiträger von einem Gegenstand (Gemeinschaftlicher Akteur) @de
definition: Setzt eine Manifestation in Beziehung zu einer Beiträgerin/einem Beiträger zu einem Aggregat (Gemeinschaftlicher Akteur), die/der eine Expression eines gegenständlichen Werks erstellt, die durch ein Aggregat verkörpert wird. @de
toolkit label: Beiträgerin/Beiträger von einem Gegenstand (Gemeinschaftlicher Akteur) @de
toolkit definition: Eine Beiträgerin/Ein Beiträger zu einem Aggregat (Gemeinschaftlicher Akteur), die/der eine Expression eines gegenständlichen Werks erstellt, die durch ein Aggregat verkörpert wird. @de
label: tárgy közreműködő kollektív ágense a következő: @hu
definition: Hozzákapcsol egy megjelenési formát egy kollektív ágenshez, amely aggregátor közreműködőként egy tárgyi mű olyan kifejezési formáját hozza létre, amely egy aggregátumban testesül meg. @hu
toolkit label: tárgy közreműködő kollektív ágense: @hu
toolkit definition: Egy kollektív ágens, amely aggregátor közreműködőként egy tárgyi mű olyan kifejezési formáját hozza létre, amely egy aggregátumban testesül meg. @hu
label: ha come contributore di oggetto agente collettivo @it
definition: Correla una manifestazione all'agente collettivo, contributore a un aggregato, che crea un’opera oggetto, materializzata in un aggregato. @it
toolkit label: contributore di oggetto agente collettivo @it
toolkit definition: Agente collettivo, contributore a un aggregato, che crea un’opera oggetto, materializzata in un aggregato. @it
label: objekta līdzradītājs (grupa) @lv
definition: Sasaista manifestāciju ar grupu, kas ir līdzradītājs, kas radījusi apkopojumā ietverto objekta darbu. @lv
toolkit label: objekta līdzradītājs (grupa) @lv
toolkit definition: Grupa - līdzradītājs, kas radījusi apkopojumā ietverto objekta darbu. @lv
label: 有物体的贡献者集体行为者 @zh-hans
definition: 将一种载体表现与作为合集的一个贡献者并创建被一种合集具体化的一种物体作品的一种内容表达的一个集体行为者关联起来。 @zh-hans
toolkit label: 物体的贡献者集体行为者 @zh-hans
toolkit definition: 作为合集的一个贡献者并创建被一种合集具体化的一种物体作品的一种内容表达的一个集体行为者 @zh-hans
label: nesneye katkıda bulunan kolektif temsilci ile ilişkilidir @tr
definition: Bir gösterimi, bir topluluğun somutlaştırdığı bir obje eserinin anlatımını yaratan, topluluğa katkıda bulunan kolektif bir temsilci ile ilişkilendirir. @tr
toolkit label: nesneye katkıda bulunan kolektif temsilci @tr
toolkit definition: Bir topluluk tarafından somutlaştırılan bir nesne eserinin anlatımını yaratan, topluluğa katkıda bulunan kolektif bir temsilci. @tr
label: tiene agente colectivo colaborador de objeto @es
definition: Relaciona una manifestación con un agente colectivo que es un colaborador al agregado que crea una expresión de un objeto de obra que está encarnado por un agregado. @es
toolkit label: agente colectivo colaborador de objeto @es
toolkit definition: Un agente colectivo que es un colaborador al agregado que crea una expresión de un objeto de obra que está encarnado por un agregado. @es
has subproperty: has contributor corporate body of object
has subproperty: has contributor family of object
has subproperty: P30374

has contributor collective agent of speech
status: Published
lexical alias: contributorCollectiveAgentOfSpeech.en
definition: Relates a manifestation to a collective agent who is a contributor to aggregate who creates an expression of a vocal work that is embodied by an aggregate.
toolkit label: contributor collective agent of speech
toolkit definition: A collective agent who is a contributor to aggregate who creates an expression of a vocal work that is embodied by an aggregate.
type: Property
domain: C10007
has element type: 2
sub property of: has contributor collective agent to aggregate
sub property of: has contributor agent of speech
label: puheeseen osallinen yhteistoimija @fi
definition: Liittää manifestaation aggregaattiin osalliseen yhteistoimjaan, joka on luonut aggregaattiin sisältyvän puheteoksen ekspression. @fi
toolkit label: puheeseen osallinen yhteistoimija @fi
toolkit definition: Aggregaattiin osallinen yhteistoimija, joka on luonut aggregaattiin sisältyvän puheteoksen ekspression. @fi
label: har bidragsyter til tale (kollektiv agent) @no
definition: Relaterer en manifestasjon til en kollektiv agent som er en bidragsyter til aggregat som skaper et verk av tale som er realisert i et aggregat. @no
toolkit label: bidragsyter til tale (kollektiv agent) @no
toolkit definition: En kollektiv agent som er en bidragsyter til aggregat som skaper et verk av tale som er realisert i et aggregat. @no
label: a pour agent collectif contributeur de contenu vocal @fr
definition: Met une manifestation en relation avec un agent collectif contributeur à un agrégat qui crée une expression d’une œuvre vocale matérialisée par un agrégat. @fr
toolkit label: agent collectif contributeur de contenu vocal @fr
toolkit definition: Agent collectif contribueur à un agrégat qui crée une expression d’une œuvre vocale matérialisée par un agrégat. @fr
label: heeft bijdrage-collectieve actor van spraak @nl
definition: Relateert een manifestatie aan een collectieve actor die is een bijdrager aan aggregaat die een expressie van een vocaal werk creëert die is verwezenlijkt in een aggregaat. @nl
toolkit label: bijdrage-collectieve actor van spraak @nl
toolkit definition: Een collectieve actor die is een bijdrager aan aggregaat die een expressie van een vocaal werk creëert die is verwezenlijkt in een aggregaat. @nl
label: له وكيل جماعي مساهم بحديث @ar
definition: يربط بين تجسيدة ووكيل جماعي مساهم في عمل تجميعي ينشيء عمل من كلمات منطوقة يتجسد في تجميعية. @ar
toolkit label: وكيل جماعي مساهم بحديث @ar
toolkit definition: وكيل جماعي مساهم في عمل تجميعي ينشيء عمل من كلمات منطوقة يتجسد في تجميعية. @ar
label: té com a agent col·lectiu contribuïdor de discurs @ca
definition: Relaciona una manifestació amb un agent col·lectiu que és un contribuïdor a un agregat i que crea una expressió d’una obra vocal que es materialitza en un agregat. @ca
toolkit label: agent col·lectiu contribuïdor de discurs @ca
toolkit definition: Agent col·lectiu que és un contribuïdor a un agregat i que crea una expressió d’una obra vocal que es materialitza en un agregat. @ca
label: har kollektiv agent, som er bidragsyder til tale @da
definition: Relaterer en manifestation til en kollektiv agent, som er bidragsyder til samling, som skaber et værk med talte ord, der er indeholdt i en samling. @da
toolkit label: kollektiv agent, som er bidragsyder til tale @da
toolkit definition: Kollektiv agent, som er bidragsyder til samling, som skaber et værk med talte ord, der er indeholdt i en samling. @da
label: kõneloome kaastööline (kollektiiv) @et
definition: Seostab kehastuse kollektiiviga, kes on liitumi kaastööline, luues suulise teose väljenduse, mis on teostatud liitumis. @et
toolkit label: kõneloome kaastööline (kollektiiv) @et
toolkit definition: Kollektiiv, kes on liitumi kaastööline, luues suulise teose väljenduse, mis on teostatud liitumis. @et
label: hat Beiträgerin/Beiträger von einer Rede (Gemeinschaftlicher Akteur) @de
definition: Setzt eine Manifestation in Beziehung zu einer Beiträgerin/einem Beiträger zu einem Aggregat (Gemeinschaftlicher Akteur), die/der eine Expression eines gesprochenen Werks erstellt, die durch ein Aggregat verkörpert wird. @de
toolkit label: Beiträgerin/Beiträger von einer Rede (Gemeinschaftlicher Akteur) @de
toolkit definition: Eine Beiträgerin/Ein Beiträger zu einem Aggregat (Gemeinschaftlicher Akteur), die/der eine Expression eines gesprochenen Werks erstellt, die durch ein Aggregat verkörpert wird. @de
label: beszéd közreműködő kollektív ágense a következő: @hu
definition: Hozzákapcsol egy megjelenési formát egy kollektív ágenshez, amely aggregátor közreműködőként egy beszédmű olyan kifejezési formáját hozza létre, amely egy aggregátumban testesül meg. @hu
toolkit label: beszéd közreműködő kollektív ágense @hu
toolkit definition: Egy kollektív ágens, amely aggregátor közreműködőként egy beszédmű olyan kifejezési formáját hozza létre, amely egy aggregátumban testesül meg. @hu
label: ha come contributore di discorso agente collettivo @it
definition: Correla una manifestazione all'agente collettivo, contributore a un aggregato, che crea un'opera parlata, materializzata in un aggregato. @it
toolkit label: contributore di discorso agente collettivo @it
toolkit definition: Agente collettivo, contributore a un aggregato, che crea un'opera parlata, materializzata in un aggregato. @it
label: runas līdzradītājs (grupa) @lv
definition: Sasaista manifestāciju ar grupu, kas ir līdzradītājs, kas radījusi apkopojumā ietverto mutvārdu darbu. @lv
toolkit label: runas līdzradītājs (grupa) @lv
toolkit definition: Grupa - līdzradītājs, kas radījusi apkopojumā ietverto mutvārdu darbu. @lv
label: 有讲话的贡献者集体行为者 @zh-hans
definition: 将一种载体表现与作为合集的一个贡献者并创建被一种合集具体化的一种人声作品的一种内容表达的一个集体行为者关联起来。 @zh-hans
toolkit label: 讲话的贡献者集体行为者 @zh-hans
toolkit definition: 作为合集的一个贡献者并创建被一种合集具体化的一种人声作品的一种内容表达的一个集体行为者 @zh-hans
label: konuşmaya katkıda bulunan kolektif temsilci ile ilişkilidir @tr
definition: Bir gösterimi, bir bütünün somutlaştırdığı bir ses eserinin anlatımını yaratan, bütüne katkıda bulunan kolektif bir temsilci ile ilişkilendirir. @tr
toolkit label: konuşmaya katkıda bulunan kolektif temsilci @tr
toolkit definition: Bir gösterimi, bir topluluk tarafından oluşturulan ve bir vokal eserin anlatımını üreten toplu bir katkıda bulunan temsilciyle ilişkilendirir; bu anlatım bir toplu yapı içinde somutlaşır. @tr
label: tiene agente colectivo colaborador del discurso @es
definition: Relaciona una manifestación con un agente colectivo que es un colaborador al agregado que crea una expresión de una obra vocal que es encarnada por un agregado. @es
toolkit label: agente colectivo colaborador del discurso @es
toolkit definition: Un agente colectivo que es un colaborador al agregado que crea una expresión de una obra vocal que es encarnada por un agregado. @es
has subproperty: has contributor corporate body of speech
has subproperty: has contributor family of speech
has subproperty: P30371

has contributor collective agent of still image
status: Published
lexical alias: contributorCollectiveAgentOfStillImage.en
definition: Relates a manifestation to a collective agent who is a contributor to aggregate who creates an expression of a still image work that is embodied by an aggregate.
toolkit label: contributor collective agent of still image
toolkit definition: A collective agent who is a contributor to aggregate who creates an expression of a still image work that is embodied by an aggregate.
type: Property
domain: C10007
has element type: 2
sub property of: has contributor collective agent to aggregate
sub property of: has contributor agent of still image
label: stillkuvaan osallinen yhteistoimija @fi
definition: Liittää manifestaation aggregaattiin osalliseen yhteistoimijaan, joka on luonut aggregaattiin sisältyvän stillkuvateoksen ekspression. @fi
toolkit label: stillkuvaan osallinen yhteistoimija @fi
toolkit definition: Aggregaattiin osallinen yhteistoimija, joka on luonut aggregaattiin sisältyvän stillkuvateoksen ekspression. @fi
label: har bidragsyter til bilde (kollektiv agent) @no
definition: Relaterer en manifestasjon til en kollektiv agent som er en bidragsyter til aggregat som skaper et bildeverk som er realisert i et aggregat. @no
toolkit label: bidragsyter til bilde (kollektiv agent) @no
toolkit definition: En kollektiv agent som er en bidragsyter til aggregat som skaper et bildeverk som er realisert i et aggregat. @no
label: a pour agent collectif contributeur d’image fixe @fr
definition: Met une manifestation en relation avec un agent collectif contributeur à un agrégat qui crée une expression d’une œuvre d’image fixe matérialisée par un agrégat. @fr
toolkit label: agent collectif contributeur d’image fixe @fr
toolkit definition: Agent collectif contributeur à un agrégat qui crée une expression d’une œuvre d’image fixe matérialisée par un agrégat. @fr
label: heeft bijdrage-collectieve actor van stilstaand beeld @nl
definition: Relateert een manifestatie aan een collectieve actor die is een bijdrager aan aggregaat die een expressie van een stilstaand beeldwerk creëert die is verwezenlijkt in een aggregaat. @nl
toolkit label: bijdrage-collectieve actor van stilstaand beeld @nl
toolkit definition: Een collectieve actor die is een bijdrager aan aggregaat die een expressie van een stilstaand beeldwerk creëert die is verwezenlijkt in een aggregaat. @nl
label: له وكيل جماعي مساهم بصور ثابتة @ar
definition: يربط بين تجسيدة ووكيل جماعي مساهم في عمل تجميعي ينشيء عمل من صور ثابتة يتجسد في تجميعية. @ar
toolkit label: وكيل جماعي مساهم بصور ثابتة @ar
toolkit definition: وكيل جماعي مساهم في عمل تجميعي ينشيء عمل من صور ثابتة يتجسد في تجميعية. @ar
label: té com a agent col·lectiu contribuïdor d’imatge fixa @ca
definition: Relaciona una manifestació amb un agent col·lectiu que és un contribuïdor a un agregat i que crea una expressió d’una obra d’imatge fixa que es materialitza en un agregat. @ca
toolkit label: agent col·lectiu contribuïdor d’imatge fixa @ca
toolkit definition: Agent col·lectiu que és un contribuïdor a un agregat i que crea una expressió d’una obra d’imatge fixa que es materialitza en un agregat. @ca
label: har kollektiv agent, som er bidragsyder til stillbillede @da
definition: Relaterer en manifestation til en kollektiv agent, som er bidragsyder til samling, som skaber et værk med stillbilleder, der er indeholdt i en samling. @da
toolkit label: kollektiv agent, som er bidragsyder til stillbillede @da
toolkit definition: Kollektiv agent, som er bidragsyder til samling, som skaber et værk med stillbilleder, der er indeholdt i en samling. @da
label: kaastööline liikumatu pildi alal (kollektiiv) @et
definition: Seostab kehastuse kollektiiviga, kes on liitumi kaastööline, luues liikumatust pildist koosneva teose väljenduse, mis on teostatud liitumis. @et
toolkit label: kaastööline liikumatu pildi alal (kollektiiv) @et
toolkit definition: Kollektiiv, kes on liitumi kaastööline, luues liikumatust pildist koosneva teose väljenduse, mis on teostatud liitumis. @et
label: hat Illustratorin/Illustrator (Gemeinschaftlicher Akteur) @de
definition: Setzt eine Manifestation in Beziehung zu einer Beiträgerin/einem Beiträger zu einem Aggregat (Gemeinschaftlicher Akteur), die/der eine Expression eines unbewegten Bildwerks erstellt, die durch ein Aggregat verkörpert wird. @de
toolkit label: Illustratorin/Illustrator (Gemeinschaftlicher Akteur) @de
toolkit definition: Eine Beiträgerin/Ein Beiträger zu einem Aggregat (Gemeinschaftlicher Akteur), die/der eine Expression eines unbewegten Bildwerks erstellt, die durch ein Aggregat verkörpert wird. @de
label: állókép közreműködő kollektív ágense a következő: @hu
definition: Hozzákapcsol egy megjelenési formát egy kollektív ágenshez, amely aggregátor közreműködőként egy állóképmű olyan kifejezési formáját hozza létre, amely egy aggregátumban testesül meg. @hu
toolkit label: állókép közreműködő kollektív ágense: @hu
toolkit definition: Egy kollektív ágens, amely aggregátor közreműködőként egy állóképmű olyan kifejezési formáját hozza létre, amely egy aggregátumban testesül meg. @hu
label: ha come contributore di immagine fissa agente collettivo @it
definition: Correla una manifestazione all'agente collettivo, contributore a un aggregato, che crea un'opera di immagine fissa, materializzata in un aggregato. @it
toolkit label: contributore di immagine fissa agente collettivo @it
toolkit definition: Agente collettivo, contributore a un aggregato, che crea un'opera di immagine fissa, materializzata in un aggregato. @it
label: attēla līdzradītājs (grupa) @lv
definition: Sasaista manifestāciju ar grupu, kas ir līdzradītājs, kas radījusi apkopojumā ietverto attēla darbu. @lv
toolkit label: attēla līdzradītājs (grupa) @lv
toolkit definition: Grupa - līdzradītājs, kas radījusi apkopojumā ietverto attēla darbu. @lv
label: 有静态图像的贡献者集体行为者 @zh-hans
definition: 将一种载体表现与作为合集的一个贡献者并创建被一种合集具体化的一种静态图像作品的一种内容表达的一个集体行为者关联起来。 @zh-hans
toolkit label: 静态图像的贡献者集体行为者 @zh-hans
toolkit definition: 作为合集的一个贡献者并创建被一种合集具体化的一种静态图像作品的一种内容表达的一个集体行为者 @zh-hans
label: durağan görüntüye katkıda bulunan kolektif temsilci ile ilişkilidir @tr
definition: Bir gösterimi, bir topluluğun somutlaştırdığı bir hareketsiz görüntü eserinin anlatımını yaratan, bütüne katkıda bulunan kolektif bir temsilci ile ilişkilendirir. @tr
toolkit label: hareketsiz görüntüye katkıda bulunan kolektif temsilci @tr
toolkit definition: Bir hareketsiz görüntü eserinin ifadesini yaratan, bu ifadeyi toplayan ve bir topluluk tarafından somutlaştırılan bir bütüne katkıda bulunan kolektif temsilci. @tr
label: tiene agente colectivo colaborador de imagen fija @es
definition: Relaciona una manifestación con un agente colectivo que es un colaborador al agregado y que crea una expresión de una obra de imagen fija que está encarnada por un agregado. @es
toolkit label: agente colectivo colaborador de imagen fija @es
toolkit definition: Un agente colectivo que es un colaborador al agregado y que crea una expresión de una obra de imagen fija que está encarnada por un agregado. @es
has subproperty: has contributor corporate body of still image
has subproperty: has contributor family of still image
has subproperty: P30372

has contributor collective agent of text
status: Published
lexical alias: contributorCollectiveAgentOfText.en
definition: Relates a manifestation to a collective agent who is a contributor to aggregate who creates an expression of a textual work that is embodied by an aggregate.
toolkit label: contributor collective agent of text
toolkit definition: A collective agent who is a contributor to aggregate who creates an expression of a textual work that is embodied by an aggregate.
type: Property
domain: C10007
has element type: 2
sub property of: has contributor collective agent to aggregate
sub property of: has contributor agent of text
label: tekstiin osallinen yhteistoimija @fi
definition: Liittää manifestaation aggregaattiin osalliseen yhteistoimijaan, joka on luonut aggregaattiin sisältyvän tekstiteoksen ekspression. @fi
toolkit label: tekstiin osallinen yhteistoimija @fi
toolkit definition: Aggregaattiin osallinen yhteistoimija, joka on luonut aggregaattiin sisältyvän tekstiteoksen ekspression. @fi
label: har bidragsyter til tekst (kollektiv agent) @no
definition: Relaterer en manifestasjon til en kollektiv agent som er en bidragsyter til aggregat som skaper et tekstlig verk som er realisert i et aggregat. @no
toolkit label: bidragsyter til tekst (kollektiv agent) @no
toolkit definition: En kollektiv agent som er en bidragsyter til aggregat som skaper et tekstlig verk som er realisert i et aggregat. @no
label: a pour agent collectif contributeur de texte @fr
definition: Met une manifestation en relation avec un agent collectif contributeur à un agrégat qui crée une expression d’une œuvre textuelle matérialisée par un agrégat. @fr
toolkit label: agent collectif contributeur de texte @fr
toolkit definition: Agent collectif contributeur à un agrégat qui crée une expression d’une œuvre textuelle matérialisée par un agrégat. @fr
label: heeft bijdrage-collectieve actor van tekst @nl
definition: Relateert een manifestatie aan een collectieve actor die is een bijdrager aan aggregaat die een expressie van een tekstwerk creëert die is verwezenlijkt in een aggregaat. @nl
toolkit label: bijdrage-collectieve actor van tekst @nl
toolkit definition: Een collectieve actor die is een bijdrager aan aggregaat die een expressie van een tekstwerk creëert die is verwezenlijkt in een aggregaat. @nl
label: له وكيل جماعي مساهم بنص @ar
definition: يربط بين تجسيدة ووكيل جماعي مساهم في عمل تجميعي ينشيء عمل نصي يتجسد في تجميعية. @ar
toolkit label: وكيل جماعي مساهم بنص @ar
toolkit definition: وكيل جماعي مساهم في عمل تجميعي ينشيء عمل نصي يتجسد في تجميعية. @ar
label: té com a agent col·lectiu contribuïdor de text @ca
definition: Relaciona una manifestació amb un agent col·lectiu que és un contribuïdor a un agregat i que crea una obra textual que es materialitza en un agregat. @ca
toolkit label: agent col·lectiu contribuïdor de text @ca
toolkit definition: Agent col·lectiu que és un contribuïdor a un agregat i que crea una obra textual que es materialitza en un agregat. @ca
label: har kollektiv agent, som er bidragsyder til tekst @da
definition: Relaterer en manifestation til en kollektiv agent, som er bidragsyder til samling, som skaber et tekstværk, der er indeholdt i en samling. @da
toolkit label: kollektiv agent, som er bidragsyder til tekst @da
toolkit definition: Kollektiv agent, som er bidragsyder til samling, som skaber et tekstværk, der er indeholdt i en samling. @da
label: tekstiloome kaastööline (kollektiiv) @et
definition: Seostab kehastuse kollektiiviga, kes on liitumi kaastööline, luues tekstteose väljenduse, mis on teostatud liitumis. @et
toolkit label: tekstiloome kaastööline (kollektiiv) @et
toolkit definition: Kollektiiv, kes on liitumi kaastööline, luues tekstteose väljenduse, mis on teostatud liitumis. @et
label: hat Beiträgerin/Beiträger von ergänzendem Text (Gemeinschaftlicher Akteur) @de
definition: Setzt eine Manifestation in Beziehung zu einer Beiträgerin/einem Beiträger zu einem Aggregat (Gemeinschaftlicher Akteur), die/der eine Expression eines textlichen Werks erstellt, die durch ein Aggregat verkörpert wird. @de
toolkit label: Beiträgerin/Beiträger von ergänzendem Text (Gemeinschaftlicher Akteur) @de
toolkit definition: Eine Beiträgerin/Ein Beiträger zu einem Aggregat (Gemeinschaftlicher Akteur), die/der eine Expression eines textlichen Werks erstellt, die durch ein Aggregat verkörpert wird. @de
label: szöveg közreműködő kollektív ágense a következő: @hu
definition: Hozzákapcsol egy megjelenési formát egy kollektív ágenshez, amely aggregátor közreműködőként egy szöveges mű olyan kifejezési formáját hozza létre, amely egy aggregátumban testesül meg. @hu
toolkit label: szöveg közreműködő kollektív ágense: @hu
toolkit definition: Egy kollektív ágens, amely aggregátor közreműködőként egy szöveges mű olyan kifejezési formáját hozza létre, amely egy aggregátumban testesül meg. @hu
label: ha come contributore di testo agente collettivo @it
definition: Correla una manifestazione all'agente collettivo, contributore a un aggregato, che crea un'opera testuale, materializzata in un aggregato. @it
toolkit label: contributore di testo agente collettivo @it
toolkit definition: Agente collettivo, contributore a un aggregato, che crea un'opera testuale, materializzata in un aggregato. @it
label: teksta līdzradītājs (grupa) @lv
definition: Sasaista manifestāciju ar grupu, kas ir līdzradītājs, kas radījusi apkopojumā ietverto teksta darbu. @lv
toolkit label: teksta līdzradītājs (grupa) @lv
toolkit definition: Grupa - līdzradītājs, kas radījusi apkopojumā ietverto teksta darbu. @lv
label: 有文本的贡献者集体行为者 @zh-hans
definition: 将一种载体表现与作为合集的一个贡献者并创建被一种合集具体化的一种文字作品的一种内容表达的一个集体行为者关联起来。 @zh-hans
toolkit label: 文本的贡献者集体行为者 @zh-hans
toolkit definition: 作为合集的一个贡献者并创建被一种合集具体化的一种文字作品的一种内容表达的一个集体行为者 @zh-hans
label: metne katkıda bulunan kolektif temsilci ile ilişkilidir @tr
definition: Bir gösterimi, bir topluluğun somutlaştırdığı metinsel bir eserin anlatımını yaratan, topluluğa katkıda bulunan kolektif bir temsilci ile ilişkilendirir. @tr
toolkit label: metne katkıda bulunan kolektif temsilci @tr
toolkit definition: Bir topluluğun somutlaştırdığı metinsel bir eserin anlatımını yaratan, topluluğa katkıda bulunan kolektif bir temsilci. @tr
label: tiene agente colectivo colaborador de texto @es
definition: Relaciona una manifestación con un agente colectivo que es un colaborador al agregado que crea una expresión de una obra textual que está encarnada por un agregado. @es
toolkit label: agente colectivo colaborador de texto @es
toolkit definition: Un agente colectivo que es un colaborador al agregado que crea una expresión de una obra textual que está encarnada por un agregado. @es
has subproperty: has contributor corporate body of text
has subproperty: has contributor family of text
has subproperty: P30373

has contributor collective agent to aggregate
status: Published
lexical alias: contributorCollectiveAgentToAggregate.en
definition: Relates a manifestation to a collective agent who is responsible for creating an expression of a work that is embodied by an aggregate.
toolkit label: contributor collective agent to aggregate
toolkit definition: A collective agent who is responsible for creating an expression of a work that is embodied by an aggregate.
type: Property
domain: C10007
has element type: 2
sub property of: has related collective agent of manifestation
sub property of: has contributor agent to aggregate
label: aggregaattiin osallinen yhteistoimija @fi
definition: Liittää manifestaation yhteistoimijaan, joka on vastuussa aggregaattiin sisältyvän teoksen ekspression luomisesta. @fi
toolkit label: aggregaattiin osallinen yhteistoimija @fi
toolkit definition: Yhteistoimija, joka on vastuussa aggregaattiin sisältyvän teoksen ekspression luomisesta. @fi
label: har bidragsyter til aggregat (kollektiv agent) @no
definition: Relaterer en manifestasjon til en kollektiv agent som skaper et verk som er realisert i et aggregat. @no
toolkit label: bidragsyter til aggregat (kollektiv agent) @no
toolkit definition: En kollektiv agent som skaper et verk som er realisert i et aggregat. @no
label: a pour agent collectif contributeur à un agrégat @fr
definition: Met une manifestation en relation avec un agent collectif qui est responsable de la création d’une expression d’une œuvre matérialisée par un agrégat. @fr
toolkit label: agent collectif contributeur à un agrégat @fr
toolkit definition: Agent collectif qui est responsable de la création d’une expression d’une œuvre matérialisée par un agrégat. @fr
label: heeft bijdrage-collectieve actor aan aggregaat @nl
definition: Relateert een manifestatie aan een collectieve actor die verantwoordelijk is voor het creëren van een expressie van een werk die is verwezenlijkt in een aggregaat. @nl
toolkit label: bijdrage-collectieve actor aan aggregaat @nl
toolkit definition: Een collectieve actor die verantwoordelijk is voor het creëren van een expressie van een werk die is verwezenlijkt in een aggregaat. @nl
label: له وكيل جماعي مساهم في تجميعة @ar
definition: يربط بين تجسيدة ووكيل جماعي ينشئ عمل يتجسد في تجميعية. @ar
toolkit label: وكيل جماعي مساهم في تجميعة @ar
toolkit definition: وكيل جماعي ينشئ عمل يتجسد في تجميعية. @ar
label: té com a agent col·lectiu contribuïdor a un agregat @ca
definition: Relaciona una manifestació amb un agent col·lectiu que és responsable de la creació d’una expressió d’una obra que es materialitza en un agregat. @ca
toolkit label: agent col·lectiu contribuïdor a un agregat @ca
toolkit definition: Agent col·lectiu que és responsable de la creació d’una expressió d’una obra que es materialitza en un agregat. @ca
label: har kollektiv agent, som er bidragsyder til samling @da
definition: Relaterer en manifestation til en kollektiv agent, som skaber et værk, der er indeholdt i en samling. @da
toolkit label: kollektiv agent, som er bidragsyder til samling @da
toolkit definition: Kollektiv agent, som skaber et værk, der er indeholdt i en samling. @da
label: liitumi kaastööline (kollektiiv) @et
definition: Seostab kehastuse kollektiiviga, kes loob teose väljenduse, mis on teostatud liitumis. @et
toolkit label: liitumi kaastööline (kollektiiv) @et
toolkit definition: Kollektiiv, kes loob teose väljenduse, mis on teostatud liitumis. @et
label: hat Beiträgerin/Beiträger zu einem Aggregat (Gemeinschaftlicher Akteur) @de
definition: Setzt eine Manifestation in Beziehung zu einem gemeinschaftlichen Akteur, der für die Schaffung einer Expression eines Werks verantwortlich ist, die durch ein Aggregat verkörpert wird. @de
toolkit label: Beiträgerin/Beiträger zu einem Aggregat (Gemeinschaftlicher Akteur) @de
toolkit definition: Ein gemeinschaftlichen Akteur, der für die Schaffung einer Expression eines Werks verantwortlich ist, die durch ein Aggregat verkörpert wird. @de
label: aggregátum közreműködő kollektív ágense a következő: @hu
definition: Hozzákapcsol egy megjelenési formát egy kollektív ágenshez, amely egy mű olyan kifejezési formájának létrehozásáért felelős, amely egy aggregátumban testesül meg. @hu
toolkit label: aggregátum létrejöttében közreműködő kollektív ágens @hu
toolkit definition: Egy kollektív ágens, amely egy mű olyan kifejezési formájának létrehozásáért felelős, amely egy aggregátumban testesül meg. @hu
label: ha come contributore a un aggregato agente collettivo @it
definition: Correla una manifestazione all'agente collettivo creatore di un'opera materializzata in un aggregato. @it
toolkit label: contributore a un aggregato agente collettivo @it
toolkit definition: Agente collettivo creatore di un'opera materializzata in un aggregato. @it
label: apkopojuma līdzradītājs (grupa) @lv
definition: Sasaista manifestāciju ar grupu, kas radījusi apkopojumā ietverto darbu. @lv
toolkit label: apkopojuma līdzradītājs (grupa) @lv
toolkit definition: Grupa, kas radījusi apkopojumā ietverto darbu. @lv
label: 有合集的贡献者集体行为者 @zh-hans
definition: 将一种载体表现与负责创建被一种合集具体化的一种作品的一种内容表达的一个集体行为者关联起来。 @zh-hans
toolkit label: 合集的贡献者集体行为者 @zh-hans
toolkit definition: 负责创建被一种合集具体化的一种作品的一种内容表达的一个集体行为者 @zh-hans
label: toplamaya katkıda bulunan kolektif temsilci ile ilişkilidir @tr
definition: Bir gösterimi, bir kollektif temsilci tarafından somutlaştırılan bir eserin anlatımını yaratmaktan sorumlu olan bir toplulukla ilişkilendirir. @tr
toolkit label: topluluğa katkıda bulunan kolektif temsilci @tr
toolkit definition: Bir topluluk tarafından somutlaştırılan bir eserin anlatımını yaratmaktan sorumlu olan kolektif bir temsilci. @tr
label: tiene agente colectivo contribuyente para agregar @es
definition: Relaciona una manifestación con un agente colectivo que se encarga de crear una expresión de una obra que es encarnada por un agregado. @es
toolkit label: agente colectivo contribuyente para agregar @es
toolkit definition: Un agente colectivo que se encarga de crear una expresión de una obra que es encarnada por un agregado. @es
has subproperty: has contributor collective agent of cartography
has subproperty: has contributor collective agent of choreography
has subproperty: has contributor collective agent of computer content
has subproperty: has contributor collective agent of moving image
has subproperty: has contributor collective agent of music
has subproperty: has contributor collective agent of object
has subproperty: has contributor collective agent of speech
has subproperty: has contributor collective agent of still image
has subproperty: has contributor collective agent of text

has contributor corporate body of cartography
status: Published
lexical alias: contributorCorporateBodyOfCartography.en
definition: Relates a manifestation to a corporate body who is a contributor to aggregate who creates an expression of a cartographic work that is embodied by an aggregate.
toolkit label: contributor corporate body of cartography
toolkit definition: A corporate body who is a contributor to aggregate who creates an expression of a cartographic work that is embodied by an aggregate.
type: Property
domain: C10007
has element type: 2
sub property of: has contributor corporate body to aggregate
sub property of: has contributor collective agent of cartography
label: kartografiaan osallinen yhteisö @fi
definition: Liittää manifestaation aggregaattiin osalliseen yhteisöön, joka on luonut aggregaattiin sisältyvän kartografisen teoksen ekspression. @fi
toolkit label: kartografiaan osallinen yhteisö @fi
toolkit definition: Aggregaattiin osallinen yhteisö, joka on luonut aggregaattiin sisältyvän kartografisen teoksen ekspression. @fi
label: har bidragsyter til kartografi (korporasjon) @no
definition: Relaterer en manifestasjon til en korporasjon som er en bidragsyter til aggregat som skaper et kartografisk verk som er realisert i et aggregat. @no
toolkit label: bidragsyter til kartografi (korporasjon) @no
toolkit definition: En korporasjon som er en bidragsyter til aggregat som skaper et kartografisk verk som er realisert i et aggregat. @no
label: a pour collectivité contributrice de cartographie @fr
definition: Met une manifestation en relation avec une collectivité contributrice à un agrégat qui crée une expression d’une œuvre cartographique matérialisée par un agrégat. @fr
toolkit label: collectivité contributrice de cartographie @fr
toolkit definition: Collectivité contributrice à un agrégat qui crée une expression d’une œuvre cartographique matérialisée par un agrégat. @fr
label: heeft bijdrage-corporatie van cartografie @nl
definition: Relateert een manifestatie aan een corporatie die een bijdrager aan aggregaat is die een expressie van een cartografisch werk creëert die is verwezenlijkt in een aggregaat. @nl
toolkit label: bijdrage-corporatie van cartografie @nl
toolkit definition: Een corporatie die een bijdrager aan aggregaat is die een expressie van een cartografisch werk creëert die is verwezenlijkt in een aggregaat. @nl
label: له هيئة مساهمة برسم خرائط @ar
definition: يربط بين تجسيدة وهيئة تساهم في عمل تجميعي ينشيء عمل خرائطي يتجسد في تجميعية. @ar
toolkit label: هيئة مساهمة برسم خرائط @ar
toolkit definition: هيئة تساهم في عمل تجميعي ينشيء عمل خرائطي يتجسد في تجميعية. @ar
label: té com a entitat corporativa contribuïdora de cartografia @ca
definition: Relaciona una manifestació amb una entitat corporativa que és un contribuïdor a un agregat que crea una expressió d’una obra cartogràfica que es materialitza en un agregat. @ca
toolkit label: entitat corporativa contribuïdora de cartografia @ca
toolkit definition: Entitat corporativa que és un contribuïdor a un agregat que crea una expressió d’una obra cartogràfica que es materialitza en un agregat. @ca
label: har korporation, som er bidragsyder til kartografi @da
definition: Relaterer en manifestation til en korporation, som er bidragsyder til samling, som skaber et kartografisk værk, der er indeholdt i en samling. @da
toolkit label: korporation, som er bidragsyder til kartografi @da
toolkit definition: Korporation, som er bidragsyder til samling, som skaber et kartografisk værk, der er indeholdt i en samling. @da
label: kaastööline kartograafia alal (asutus) @et
definition: Seostab kehastuse asutusega, kes on liitumi kaastööline, luues kartograafilise teose väljenduse, mis on teostatud liitumis. @et
toolkit label: kaastööline kartograafia alal (asutus) @et
toolkit definition: Asutus, kes on liitumi kaastööline, luues kartograafilise teose väljenduse, mis on teostatud liitumis. @et
label: hat Beiträgerin/Beiträger von einer Kartografie (Körperschaft) @de
definition: Setzt eine Manifestation in Beziehung zu einer Beiträgerin/einem Beiträger zu einem Aggregat (Körperschaft), die/der eine Expression eines kartografischen Werks erstellt, die durch ein Aggregat verkörpert wird. @de
toolkit label: Beiträgerin/Beiträger von einer Kartografie (Körperschaft) @de
toolkit definition: Eine Beiträgerin/Ein Beiträger zu einem Aggregat (Körperschaft), die/der eine Expression eines kartografischen Werks erstellt, die durch ein Aggregat verkörpert wird. @de
label: térképészet közreműködő testülete a következő: @hu
definition: Hozzákapcsol egy megjelenési formát egy testülethez, amely aggregátor közreműködőként egy kartográfiai mű olyan kifejezési formáját hozza létre, amely egy aggregátumban testesül meg. @hu
toolkit label: térképészet közreműködő testülete: @hu
toolkit definition: Egy testület, amely aggregátor közreműködőként egy kartográfiai mű olyan kifejezési formáját hozza létre, amely egy aggregátumban testesül meg. @hu
label: ha come contributore di cartografia ente @it
definition: Correla una manifestazione all'ente contributore a un aggregato, che crea un'opera cartografica, materializzata in un aggregato. @it
toolkit label: contributore di cartografia ente @it
toolkit definition: Ente contributore a un aggregato, che crea un'opera cartografica, materializzata in un aggregato. @it
label: kartogrāfijas līdzradītājs (institūcija) @lv
definition: Sasaista manifestāciju ar institūciju, kas ir līdzradītājs, kas radījusi apkopojumā ietverto kartogrāfijas darbu. @lv
toolkit label: kartogrāfijas līdzradītājs (institūcija) @lv
toolkit definition: Institūcija - līdzradītājs, kas radījusi apkopojumā ietverto kartogrāfijas darbu. @lv
label: 有地图绘制贡献者团体 @zh-hans
definition: 将一种载体表现与作为合集的一个贡献者并创建被一种合集具体化的一种地图作品的一种内容表达的一个团体关联起来。 @zh-hans
toolkit label: 地图绘制贡献者团体 @zh-hans
toolkit definition: 作为合集的一个贡献者并创建被一种合集具体化的一种地图作品的一种内容表达的一个团体 @zh-hans
label: kartografiye katkıda bulunan tüzel kişi ile ilişkilidir @tr
definition: Bir gösterimi, bir topluluğun somutlaştırdığı bir kartografik eserin anlatımını yaratan, topluluğa katkıda bulunan bir tüzel kişi ile ilişkilendirir. @tr
toolkit label: kartografyaya katkıda bulunan tüzel kişi @tr
toolkit definition: Bir topluluğun somutlaştırdığı bir kartografik eserin anlatımını oluşturan, topluluğa katkıda bulunan bir tüzel kişilik. @tr
label: tiene cuerpo corporativo colaborador de cartografía @es
definition: Relaciona una manifestación con un cuerpo corporativo que es un colaborador de un agregado que crea una expresión de una obra cartográfica que está plasmada en un agregado. @es
toolkit label: cuerpo corporativo colaborador de cartografía @es
toolkit definition: Un cuerpo corporativo que es un colaborador de un agregado que crea una expresión de una obra cartográfica que está plasmada en un agregado. @es
has subproperty: has surveyor corporate body
has subproperty: P30396

has contributor corporate body of choreography
status: Published
lexical alias: contributorCorporateBodyOfChoreography.en
definition: Relates a manifestation to a corporate body who is a contributor to aggregate who creates an expression of a choreographic work that is embodied by an aggregate.
toolkit label: contributor corporate body of choreography
toolkit definition: A corporate body who is a contributor to aggregate who creates an expression of a choreographic work that is embodied by an aggregate.
type: Property
domain: C10007
has element type: 2
sub property of: has contributor corporate body to aggregate
sub property of: has contributor collective agent of choreography
label: koreografiaan osallinen yhteisö @fi
definition: Liittää manifestaation aggregaattiin osalliseen yhteisöön, joka on luonut aggregaattiin sisältyvän koreografisen teoksen ekspression. @fi
toolkit label: koreografiaan osallinen yhteisö @fi
toolkit definition: Aggregaattiin osallinen yhteisö, joka on luonut aggregaattiin sisältyvän koreografisen teoksen ekspression. @fi
label: har bidragsyter til koreografi (korporasjon) @no
definition: Relaterer en manifestasjon til en korporasjon som er en bidragsyter til aggregat som skaper et koreografisk verk som er realisert i et aggregat. @no
toolkit label: bidragsyter til koreografi (korporasjon) @no
toolkit definition: En korporasjon som er en bidragsyter til aggregat som skaper et koreografisk verk som er realisert i et aggregat. @no
label: a pour collectivité contributrice de chorégraphie @fr
definition: Met une manifestation en relation avec une collectivité contributrice à un agrégat qui crée une expression d’une œuvre chorégraphique matérialisée par un agrégat. @fr
toolkit label: collectivité contributrice de chorégraphie @fr
toolkit definition: Collectivité contributrice à un agrégat qui crée une expression d’une œuvre chorégraphique matérialisée par un agrégat. @fr
label: heeft bijdrage-corporatie van choreografie @nl
definition: Relateert een manifestatie aan een corporatie die een bijdrager aan aggregaat is die een expressie van een choreografisch werk creëert die is verwezenlijkt in een aggregaat. @nl
toolkit label: bijdrage-corporatie van choreografie @nl
toolkit definition: Een corporatie die een bijdrager aan aggregaat is die een expressie van een choreografisch werk creëert die is verwezenlijkt in een aggregaat. @nl
label: له هيئة مساهمة بتصميم رقصات @ar
definition: يربط بين تجسيدة وهيئة مساهمة في عمل تجميعي ينشيء عمل من تصميم الرقصات يتجسيد في تجميعية. @ar
toolkit label: هيئة مساهمة بتصميم رقصات @ar
toolkit definition: هيئة مساهمة في عمل تجميعي ينشيء عمل من تصميم الرقصات يتجسيد في تجميعية. @ar
label: té com a entitat corporativa contribuïdora de coreografia @ca
definition: Relaciona una manifestació amb una entitat corporativa que és un contribuïdor a un agregat que crea una expressió d’una obra coreogràfica que es materialitza en un agregat. @ca
toolkit label: entitat corporativa contribuïdora de coreografia @ca
toolkit definition: Entitat corporativa que és un contribuïdor a un agregat que crea una expressió d’una obra coreogràfica que es materialitza en un agregat. @ca
label: har korporation, som er bidragsyder til koreografi @da
definition: Relaterer en manifestation til en korporation, som er bidragsyder til samling, som skaber et koreografisk værk, der er indeholdt i en samling. @da
toolkit label: korporation, som er bidragsyder til koreografi @da
toolkit definition: Korporation, som er bidragsyder til samling, som skaber et koreografisk værk, der er indeholdt i en samling. @da
label: kaastööline koreograafia alal (asutus) @et
definition: Seostab kehastuse asutusega, kes on liitumi kaastööline, luues koreograafilise teose väljenduse, mis on teostatud liitumis. @et
toolkit label: kaastööline koreograafia alal (asutus) @et
toolkit definition: Asutus, kes on liitumi kaastööline, luues koreograafilise teose väljenduse, mis on teostatud liitumis. @et
label: hat Beiträgerin/Beiträger von einer Choreografie (Körperschaft) @de
definition: Setzt eine Manifestation in Beziehung zu einer Beiträgerin/einem Beiträger zu einem Aggregat (Körperschaft), die/der eine Expression eines choreografischen Werks erstellt, die durch ein Aggregat verkörpert wird. @de
toolkit label: Beiträgerin/Beiträger von einer Choreografie (Körperschaft) @de
toolkit definition: Eine Beiträgerin/Ein Beiträger zu einem Aggregat (Körperschaft), die/der eine Expression eines choreografischen Werks erstellt, die durch ein Aggregat verkörpert wird. @de
label: koreográfia közreműködő testülete a következő: @hu
definition: Hozzákapcsol egy megjelenési formát egy kollektív ágenshez, amely aggregátor közreműködőként egy koreografikus mű olyan kifejezési formáját hozza létre, amely egy aggregátumban testesül meg. @hu
toolkit label: koreográfia közreműködő testülete: @hu
toolkit definition: Egy testület, amely aggregátor közreműködőként egy koreografikus mű olyan kifejezési formáját hozza létre, amely egy aggregátumban testesül meg. @hu
label: ha come contributore di coreografia ente @it
definition: Correla una manifestazione all'ente contributore a un aggregato, che crea un'opera coreografica materializzata in un aggregato. @it
toolkit label: contributore di coreografia ente @it
toolkit definition: Ente contributore a un aggregato, che crea un'opera coreografica, materializzata in un aggregato. @it
label: horeogrāfijas līdzradītājs (institūcija) @lv
definition: Sasaista manifestāciju ar institūciju, kas ir līdzradītājs, kas radījusi apkopojumā ietverto horeogrāfijas darbu. @lv
toolkit label: horeogrāfijas līdzradītājs (institūcija) @lv
toolkit definition: Institūcija - līdzradītājs, kas radījusi apkopojumā ietverto horeogrāfijas darbu. @lv
label: 有编舞贡献者团体 @zh-hans
definition: 将一种载体表现与作为合集的一个贡献者并创建被一种合集具体化的一种编舞作品的一种内容表达的一个团体关联起来。 @zh-hans
toolkit label: 编舞贡献者团体 @zh-hans
toolkit definition: 作为合集的一个贡献者并创建被一种合集具体化的一种编舞作品的一种内容表达的一个团体 @zh-hans
label: koreografiye katkıda bulunan tüzel kişi ile ilişkilidir @tr
definition: Bir gösterimi, bir topluluğa katkıda bulunan ve bir topluluğa somutlaşan bir koreografik eserin anlatımını yaratan bir tüzel kişiyle ilişkilendirir. @tr
toolkit label: koreografiye katkıda bulunan tüzel kişi @tr
toolkit definition: Bir topluluğun somutlaştırdığı bir koreografik eserin anlatımını yaratan, topluluğa katkıda bulunan bir tüzel kişilik. @tr
label: tiene cuerpo corporativo colaborador de coreografía @es
definition: Relaciona una manifestación con un cuerpo corporativo que es un colaborador de un agregado que crea una expresión de una obra coreográfica que es encarnada por un agregado. @es
toolkit label: cuerpo corporativo colaborador de coreografía @es
toolkit definition: Un cuerpo corporativo que es un colaborador de un agregado que crea una expresión de una obra coreográfica que es encarnada por un agregado. @es
has subproperty: P30397

has contributor corporate body of computer content
status: Published
lexical alias: contributorCorporateBodyOfComputerContent.en
definition: Relates a manifestation to a corporate body who is a contributor to aggregate who creates an expression of computer content that is embodied by an aggregate.
toolkit label: contributor corporate body of computer content
toolkit definition: A corporate body who is a contributor to aggregate who creates an expression of computer content that is embodied by an aggregate.
type: Property
domain: C10007
has element type: 2
sub property of: has contributor corporate body to aggregate
sub property of: has contributor collective agent of computer content
label: digitaaliseen sisältöön osallinen yhteisö @fi
definition: Liittää manifestaation aggregaattiin osalliseen yhteisöön, joka on luonut aggregaattiin sisältyvän digitaalisen sisällön ekspression. @fi
toolkit label: digitaaliseen sisältöön osallinen yhteisö @fi
toolkit definition: Aggregaattiin osallinen yhteisö, joka on luonut aggregaattiin sisältyvän digitaalisen sisällön ekspression. @fi
label: har bidragsyter til datamaskininnhold (korporasjon) @no
definition: Relaterer en manifestasjon til en korporasjon som er en bidragsyter til aggregat som skaper datamaskininnhold som er realisert i et aggregat. @no
toolkit label: bidragsyter til datamaskininnhold (korporasjon) @no
toolkit definition: En korporasjon som er en bidragsyter til aggregat som skaper datamaskininnhold som er realisert i et aggregat. @no
label: a pour collectivité contributrice de contenu informatique @fr
definition: Met une manifestation en relation avec une collectivité contributrice à un agrégat qui crée une expression d’un contenu informatique matérialisée par un agrégat. @fr
toolkit label: collectivité contributrice de contenu informatique @fr
toolkit definition: Collectivité contributrice à un agrégat qui crée une expression d’un contenu informatique matérialisée par un agrégat. @fr
label: heeft bijdrage-corporatie van computercontent @nl
definition: Relateert een manifestatie aan een corporatie die een bijdrager aan aggregaat is die een expressie van computercontent creëert die is verwezenlijkt in een aggregaat. @nl
toolkit label: bijdrage-corporatie van computercontent @nl
toolkit definition: Een corporatie die een bijdrager aan aggregaat is die een expressie van computercontent creëert die is verwezenlijkt in een aggregaat. @nl
label: له هيئة مساهمة بمحتوى كمبيوتر @ar
definition: يربط بين تجسيدة وهيئة مساهم في عمل تجميعي ينشيء محتوى كمبيوتر يتجسد في تجميعية. @ar
toolkit label: هيئة مساهمة بمحتوى كمبيوتر @ar
toolkit definition: هيئة مساهمة في عمل تجميعي ينشيء محتوى كمبيوتر يتجسد في تجميعية. @ar
label: té com a entitat corporativa contribuïdora de contingut informàtic @ca
definition: Relaciona una manifestació amb una entitat corporativa que és un contribuïdor a un agregat que crea una expressió de contingut informàtic que es materialitza en un agregat. @ca
toolkit label: entitat corporativa contribuïdora de contingut informàtic @ca
toolkit definition: Entitat corporativa que és un contribuïdor a un agregat que crea una expressió de contingut informàtic que es materialitza en un agregat. @ca
label: har korporation, som er bidragsyder til computerindhold @da
definition: Relaterer en manifestation til en korporation, som er bidragsyder til samling, som skaber computerindhold, der er indeholdt i en samling. @da
toolkit label: korporation, som er bidragsyder til computerindhold @da
toolkit definition: Korporation, som er bidragsyder til samling, som skaber computerindhold, der er indeholdt i en samling. @da
label: digisisu kaastööline (asutus) @et
definition: Seostab kehastuse asutusega, kes on liitumi kaastööline, luues digisisu väljenduse, mis on teostatud liitumis. @et
toolkit label: digisisu kaastööline (asutus) @et
toolkit definition: Asutus, kes on liitumi kaastööline, luues digisisu väljenduse, mis on teostatud liitumis. @et
label: hat Beiträgerin/Beiträger von Computer Content (Körperschaft) @de
definition: Setzt eine Manifestation in Beziehung zu einer Beiträgerin/einem Beiträger zu einem Aggregat (Körperschaft), die/der eine Expression von Computer Content erstellt, die durch ein Aggregat verkörpert wird. @de
toolkit label: Beiträgerin/Beiträger von Computer Content (Körperschaft) @de
toolkit definition: Eine Beiträgerin/Ein Beiträger zu einem Aggregat (Körperschaft), die/der eine Expression von Computer Content erstellt, die durch ein Aggregat verkörpert wird. @de
label: számítógépes tartalom közreműködő testülete a következő: @hu
definition: Hozzákapcsol egy megjelenési formát egy testülethez, amely aggregátor közreműködőként egy számítógépes tartalom olyan kifejezési formáját hozza létre, amely egy aggregátumban testesül meg. @hu
toolkit label: számítógépes tartalom közreműködő testülete: @hu
toolkit definition: Egy testület, amely aggregátor közreműködőként egy számítógépes tartalom olyan kifejezési formáját hozza létre, amely egy aggregátumban testesül meg. @hu
label: ha come contributore di contenuto informatico ente @it
definition: Correla una manifestazione all'ente contributore a un aggregato, che crea un contenuto informatico, materializzato in un aggregato. @it
toolkit label: contributore di contenuto informatico ente @it
toolkit definition: Ente contributore a un aggregato, che crea un contenuto informatico, materializzato in un aggregato. @it
label: datororientēta satura līdzradītājs (institūcija) @lv
definition: Sasaista manifestāciju ar institūciju, kas ir līdzradītājs, kas radījusi apkopojumā ietverto datororientēto saturu. @lv
toolkit label: datororientēta satura līdzradītājs (institūcija) @lv
toolkit definition: Institūcija - līdzradītājs, kas radījusi apkopojumā ietverto datororientēto saturu. @lv
label: 有计算机内容的贡献者团体 @zh-hans
definition: 将一种载体表现与作为合集的一个贡献者并创建被一种合集具体化的一种计算机内容的一种内容表达的一个团体关联起来。 @zh-hans
toolkit label: 计算机内容的贡献者团体 @zh-hans
toolkit definition: 作为合集的一个贡献者并创建被一种合集具体化的一种计算机内容的一种内容表达的一个团体 @zh-hans
label: bilgisayar içeriğine katkıda bulunan tüzel kişi ile ilişkilidir @tr
definition: Bir gösterimi, bir topluluk tarafından somutlaştırılan bilgisayar içeriğinin bir anlatımını yaratan, topluluğa katkıda bulunan bir tüzel kişiyle ilişkilendirir. @tr
toolkit label: bilgisayar içeriğine katkıda bulunan tüzel kişi @tr
toolkit definition: Bir topluluk tarafından somutlaştırılan bilgisayar içeriğinin bir anlatımını yaratan, topluluğa katkıda bulunan bir tüzel kişi. @tr
label: tiene cuerpo corporativo colaborador de contenido informático @es
definition: Relaciona una manifestación con un cuerpo corporativo que es colaborador a un agregado y que crea una expresión de contenido informático que está personificado por un agregado. @es
toolkit label: cuerpo corporativo colaborador de contenido informático @es
toolkit definition: Un cuerpo corporativo que es colaborador a un agregado y que crea una expresión de contenido informático que está personificado por un agregado. @es
has subproperty: P30404

has contributor corporate body of moving image
status: Published
lexical alias: contributorCorporateBodyOfMovingImage.en
definition: Relates a manifestation to a corporate body who is a contributor to aggregate who creates an expression of a moving image work that is embodied by an aggregate.
toolkit label: contributor corporate body of moving image
toolkit definition: A corporate body who is a contributor to aggregate who creates an expression of a moving image work that is embodied by an aggregate.
type: Property
domain: C10007
has element type: 2
sub property of: has contributor corporate body to aggregate
sub property of: has contributor collective agent of moving image
label: liikkuvaan kuvaan osallinen yhteisö @fi
definition: Liittää manifestaation aggregaattiin osalliseen yhteisöön, joka on luonut aggregaattiin sisältyvän liikkuvan kuvan teoksen ekspression. @fi
toolkit label: liikkuvaan kuvaan osallinen yhteisö @fi
toolkit definition: Aggregaattiin osallinen yhteisö, joka on luonut aggregaattiin sisältyvän liikkuvan kuvan teoksen ekspression. @fi
label: har bidragsyter til levende bilder (korporasjon) @no
definition: Relaterer en manifestasjon til en korporasjon som er en bidragsyter til aggregat som skaper et verk med levende bilder som er realisert i et aggregat. @no
toolkit label: bidragsyter til levende bilder (korporasjon) @no
toolkit definition: En korporasjon som er en bidragsyter til aggregat som skaper et verk med levende bilder som er realisert i et aggregat. @no
label: a pour collectivité contributrice d’images animées @fr
definition: Met une manifestation en relation avec une collectivité contributrice à un agrégat qui crée une expression d’une œuvre d’images animées matérialisée par un agrégat. @fr
toolkit label: collectivité contributrice d’images animées @fr
toolkit definition: Collectivité contributrice à un agrégat qui crée une expression d’une œuvre d’images animées matérialisée par un agrégat. @fr
label: heeft bijdrage-corporatie van bewegend beeld @nl
definition: Relateert een manifestatie aan een corporatie die een bijdrager aan aggregaat is die een expressie van een bewegend beeldwerk creëert die is verwezenlijkt in een aggregaat. @nl
toolkit label: bijdrage-corporatie van bewegend beeld @nl
toolkit definition: Een corporatie die een bijdrager aan aggregaat is die een expressie van een bewegend beeldwerk creëert die is verwezenlijkt in een aggregaat. @nl
label: له هيئة مساهمة بصور متحركة @ar
definition: يربط بين تجسيدة وهيئة مساهمة في عمل تجميعي ينشيء عمل من صور متحركة يتجسد في تجميعية. @ar
toolkit label: هيئة مساهمة بصور متحركة @ar
toolkit definition: هيئة مساهمة في عمل تجميعي ينشيء عمل من صور متحركة يتجسد في تجميعية. @ar
label: té com a entitat corporativa contribuïdora d’imatge en moviment @ca
definition: Relaciona una manifestació amb una entitat corporativa que és un contribuïdor a un agregat que crea una expressió d’una obra d’imatge en moviment que es materialitza en un agregat. @ca
toolkit label: entitat corporativa contribuïdora d’imatge en moviment @ca
toolkit definition: Entitat corporativa que és un contribuïdor a un agregat que crea una expressió d’una obra d’imatge en moviment que es materialitza en un agregat. @ca
label: har korporation, som er bidragsyder til levende billede @da
definition: Relaterer en manifestation til en korporation, som er bidragsyder til samling, som skaber et værk med levende billeder, der er indeholdt i en samling. @da
toolkit label: korporation, som er bidragsyder til levende billede @da
toolkit definition: Korporation, som er bidragsyder til samling, som skaber et værk med levende billeder, der er indeholdt i en samling. @da
label: kaastööline liikuva pildi alal (asutus) @et
definition: Seostab kehastuse asutusega, kes on liitumi kaastööline, luues liikuvast pildist koosneva teose väljenduse, mis on teostatud liitumis. @et
toolkit label: kaastööline liikuva pildi alal (asutus) @et
toolkit definition: Asutus, kes on liitumi kaastööline, luues liikuvast pildist koosneva teose väljenduse, mis on teostatud liitumis. @et
label: hat Beiträgerin/Beiträger von einem Bewegtbild (Körperschaft) @de
definition: Setzt eine Manifestation in Beziehung zu einer Beiträgerin/einem Beiträger zu einem Aggregat (Körperschaft), die/der eine Expression eines Bewegtbildwerks erstellt, die durch ein Aggregat verkörpert wird. @de
toolkit label: Beiträgerin/Beiträger von einem Bewegtbild (Körperschaft) @de
toolkit definition: Eine Beiträgerin/Ein Beiträger zu einem Aggregat (Körperschaft), die/der eine Expression eines Bewegtbildwerks erstellt, die durch ein Aggregat verkörpert wird. @de
label: mozgókép közreműködő testülete a következő a következő: @hu
definition: Hozzákapcsol egy megjelenési formát egy testülethez, amely aggregátor közreműködőként egy mozgóképmű olyan kifejezési formáját hozza létre, amely egy aggregátumban testesül meg. @hu
toolkit label: mozgókép közreműködő testülete a következő: @hu
toolkit definition: Egy testület, amely aggregátor közreműködőként egy mozgóképmű olyan kifejezési formáját hozza létre, amely egy aggregátumban testesül meg. @hu
label: ha come contributore di immagine in movimento ente @it
definition: Correla una manifestazione all'ente contributore a un aggregato, che crea un'opera di immagini in movimento, materializzata in un aggregato. @it
toolkit label: contributore di immagine in movimento ente @it
toolkit definition: Ente contributore a un aggregato, che crea un'opera di immagini in movimento, materializzata in un aggregato. @it
label: kustīga attēla līdzradītājs (institūcija) @lv
definition: Sasaista manifestāciju ar institūciju, kas ir līdzradītājs, kas radījusi apkopojumā ietverto kustīgā attēla darbu. @lv
toolkit label: kustīga attēla līdzradītājs (institūcija) @lv
toolkit definition: Institūcija - līdzradītājs, kas radījusi apkopojumā ietverto kustīgā attēla darbu. @lv
label: 有动态图像的贡献者团体 @zh-hans
definition: 将一种载体表现与作为合集的一个贡献者并创建被一种合集具体化的一种动态图像作品的一种内容表达的一个团体关联起来。 @zh-hans
toolkit label: 动态图像的贡献者团体 @zh-hans
toolkit definition: 作为合集的一个贡献者并创建被一种合集具体化的一种动态图像作品的一种内容表达的一个团体 @zh-hans
label: hareketli görüntüye katkıda bulunan tüzel kişi ile ilişkilidir @tr
definition: Bir gösterimi, bir topluluğun somutlaştırdığı hareketli bir görüntü eserin anlatımını yaratan, topluluğa katkıda bulunan bir tüzel kişiyle ilişkilendirir. @tr
toolkit label: hareketli̇ görüntüye katkıda bulunan tüzel kişi @tr
toolkit definition: Bir topluluğun somutlaştırdığı hareketli bir görüntü eserinin anlatımını oluşturan, topluluğa katkıda bulunan bir tüzel kişi. @tr
label: tiene cuerpo corporativo colaboradora de imagen en movimiento @es
definition: Relaciona una manifestación con un cuerpo corporativo que es un colaborador a un agregado y que crea una expresión de una obra de imagen en movimiento que está encarnada por un agregado. @es
toolkit label: cuerpo corporativo colaboradora de imagen en movimiento @es
toolkit definition: Un cuerpo corporativo que es un colaborador a un agregado y que crea una expresión de una obra de imagen en movimiento que está encarnada por un agregado. @es
has subproperty: P30398

has contributor corporate body of music
status: Published
lexical alias: contributorCorporateBodyOfMusic.en
definition: Relates a manifestation to a corporate body who is a contributor to aggregate who creates an expression of a musical work that is embodied by an aggregate.
toolkit label: contributor corporate body of music
toolkit definition: A corporate body who is a contributor to aggregate who creates an expression of a musical work that is embodied by an aggregate.
type: Property
domain: C10007
has element type: 2
sub property of: has contributor corporate body to aggregate
sub property of: has contributor collective agent of music
label: musiikkiin osallinen yhteisö @fi
definition: Liittää manifestaation aggregaattiin osalliseen yhteisöön, joka on luonut aggregaattiin sisältyvän musiikkiteoksen ekspression. @fi
toolkit label: musiikkiin osallinen yhteisö @fi
toolkit definition: Aggregaattiin osallinen yhteisö, joka on luonut aggregaattiin sisältyvän musiikkiteoksen ekspression. @fi
label: har bidragsyter til musikk (korporasjon) @no
definition: Relaterer en manifestasjon til en korporasjon som er en bidragsyter til aggregat som skaper et musikalsk verk som er realisert i et aggregat. @no
toolkit label: bidragsyter til musikk (korporasjon) @no
toolkit definition: En korporasjon som er en bidragsyter til aggregat som skaper et musikalsk verk som er realisert i et aggregat. @no
label: a pour collectivité contributrice de musique @fr
definition: Met une manifestation en relation avec une collectivité contributrice à un agrégat qui crée une expression d’une œuvre musicale matérialisée par un agrégat. @fr
toolkit label: collectivité contributrice de musique @fr
toolkit definition: Collectivité contributrice à un agrégat qui crée une expression d’une œuvre musicale matérialisée par un agrégat. @fr
label: heeft bijdrage-corporatie van muziek @nl
definition: Relateert een manifestatie aan een corporatie die een bijdrager aan aggregaat is die een expressie van een muziekwerk creëert die is verwezenlijkt in een aggregaat. @nl
toolkit label: bijdrage-corporatie van muziek @nl
toolkit definition: Een corporatie die een bijdrager aan aggregaat is die een expressie van een muziekwerk creëert die is verwezenlijkt in een aggregaat. @nl
label: له هيئة مساهمة بموسيقى @ar
definition: يربط بين تجسيدة وهيئة مساهمة في عمل تجميعي بإنشاء عمل موسيقي يتجسد في تجميعية. @ar
toolkit label: هيئة مساهمة بموسيقى @ar
toolkit definition: هيئة مساهمة في عمل تجميعي بإنشاء عمل موسيقي يتجسد في تجميعية. @ar
label: té com a entitat corporativa contribuïdora de música @ca
definition: Relaciona una manifestació amb una entitat corporativa que és un contribuïdor a un agregat que crea una expressió d’una obra musical que es materialitza en un agregat. @ca
toolkit label: entitat corporativa contribuïdora de música @ca
toolkit definition: Entitat corporativa que és un contribuïdor a un agregat que crea una expressió d’una obra musical que es materialitza en un agregat. @ca
label: har korporation, som er bidragsyder til musik @da
definition: Relaterer en manifestation til en korporation, som er bidragsyder til samling, som skaber et musikværk, der er indeholdt i en samling. @da
toolkit label: korporation, som er bidragsyder til musik @da
toolkit definition: Korporation, som er bidragsyder til samling, som skaber et musikværk, der er indeholdt i en samling. @da
label: muusikaline kaastööline (asutus) @et
definition: Seostab kehastuse asutusega, kes on liitumi kaastööline, luues muusikateose väljenduse, mis on teostatud liitumis. @et
toolkit label: muusikaline kaastööline (asutus) @et
toolkit definition: Asutus, kes on liitumi kaastööline, luues muusikateose väljenduse, mis on teostatud liitumis. @et
label: hat Beiträgerin/Beiträger einer Musik (Körperschaft) @de
definition: Setzt eine Manifestation in Beziehung zu einer Beiträgerin/einem Beiträger zu einem Aggregat (Körperschaft), die/der eine Expression eines Musikwerks erstellt, die durch ein Aggregat verkörpert wird. @de
toolkit label: Beiträgerin/Beiträger einer Musik (Körperschaft) @de
toolkit definition: Eine Beiträgerin/Ein Beiträger zu einem Aggregat (Körperschaft), die/der eine Expression eines Musikwerks erstellt, die durch ein Aggregat verkörpert wird. @de
label: zene közreműködő testülete a következő: @hu
definition: Hozzákapcsol egy megjelenési formát egy testülethez, amely aggregátor közreműködőként egy zenemű olyan kifejezési formáját hozza létre, amely egy aggregátumban testesül meg. @hu
toolkit label: zene közreműködő testülete @hu
toolkit definition: Egy testület, amely aggregátor közreműködőként egy zenemű olyan kifejezési formáját hozza létre, amely egy aggregátumban testesül meg. @hu
label: ha come contributore di musica ente @it
definition: Correla una manifestazione all'ente contributore a un aggregato, che crea un'opera musicale, materializzata in un aggregato. @it
toolkit label: contributore di musica ente @it
toolkit definition: Ente contributore a un aggregato, che crea un'opera musicale, materializzata in un aggregato. @it
label: mūzikas līdzradītājs (institūcija) @lv
definition: Sasaista manifestāciju ar institūciju, kas ir līdzradītājs, kas radījusi apkopojumā ietverto mūzikas darbu. @lv
toolkit label: mūzikas līdzradītājs (institūcija) @lv
toolkit definition: Institūcija - līdzradītājs, kas radījusi apkopojumā ietverto mūzikas darbu. @lv
label: 有音乐的贡献者团体 @zh-hans
definition: 将一种载体表现与作为合集的一个贡献者并创建被一种合集具体化的一种音乐作品的一种内容表达的一个团体关联起来。 @zh-hans
toolkit label: 音乐的贡献者团体 @zh-hans
toolkit definition: 作为合集的一个贡献者并创建被一种合集具体化的一种音乐作品的一种内容表达的一个团体 @zh-hans
label: müziğe katkıda bulunan tüzel kişi ile ilişkilidir @tr
definition: Bir gösterimi topluluk tarafından somutlaştırılan bir müzik eserinin anlatımını yaratan, topluluğa katkıda bulunan bir tüzel kişiyle ilişkilendirir. @tr
toolkit label: müzi̇ğe katkıda bulunan tüzel kişi @tr
toolkit definition: Bir topluluk tarafından somutlaştırılan bir müzik eserinin anlatımını yaratan, topluluğa katkıda bulunan bir tüzel kişilik. @tr
label: tiene cuerpo corporativo colaborador de música @es
definition: Relaciona una manifestación con un cuerpo corporativo que es un colaborador a un agregado y crea una expresión de una obra musical que está encarnada por un agregado. @es
toolkit label: cuerpo corporativo colaborador de música @es
toolkit definition: Un cuerpo corporativo que es un colaborador a un agregado y crea una expresión de una obra musical que está encarnada por un agregado. @es
has subproperty: P30399

has contributor corporate body of object
status: Published
lexical alias: contributorCorporateBodyOfObject.en
definition: Relates a manifestation to a corporate body who is a contributor to aggregate who creates an expression of an object work that is embodied by an aggregate.
toolkit label: contributor corporate body of object
toolkit definition: A corporate body who is a contributor to aggregate who creates an expression of an object work that is embodied by an aggregate.
type: Property
domain: C10007
has element type: 2
sub property of: has contributor corporate body to aggregate
sub property of: has contributor collective agent of object
label: esineeseen osallinen yhteisö @fi
definition: Liittää manifestaation aggregaattiin osalliseen yhteisöön, joka on luonut aggregaattiin sisältyvän esineteoksen ekspression. @fi
toolkit label: esineeseen osallinen yhteisö @fi
toolkit definition: Aggregaattiin osallinen yhteisö, joka on luonut aggregaattiin sisältyvän esineteoksen ekspression. @fi
label: har bidragsyter til gjenstand (korporasjon) @no
definition: Relaterer en manifestasjon til en korporasjon som er en bidragsyter til aggregat som skaper et verk som er en gjenstand som er realisert i et aggregat. @no
toolkit label: bidragsyter til gjenstand (korporasjon) @no
toolkit definition: En korporasjon som er en bidragsyter til aggregat som skaper et verk som er en gjenstand som er realisert i et aggregat. @no
label: a pour collectivité contributrice d’objet @fr
definition: Met une manifestation en relation avec une collectivité contributrice à un agrégat qui crée une expression d’une œuvre objet matérialisée par un agrégat. @fr
toolkit label: collectivité contributrice d’objet @fr
toolkit definition: Collectivité contributrice à un agrégat qui crée une expression d’une œuvre objet matérialisée par un agrégat. @fr
label: heeft bijdrage-corporatie van object @nl
definition: Relateert een manifestatie aan een corporatie die een bijdrager aan aggregaat is die een expressie van een objectwerk creëert die is verwezenlijkt in een aggregaat. @nl
toolkit label: bijdrage-corporatie van object @nl
toolkit definition: Een corporatie die een bijdrager aan aggregaat is die een expressie van een objectwerk creëert die is verwezenlijkt in een aggregaat. @nl
label: له هيئة مساهمة بكائن @ar
definition: يربط بين تجسيدة وهيئة مساهمة في عمل تجميعي ينشيء عمل شيء ما يتجسد في تجميعية. @ar
toolkit label: هيئة مساهمة بكائن @ar
toolkit definition: هيئة مساهمة في عمل تجميعي ينشيء عمل شيء ما يتجسد في تجميعية. @ar
label: té com a entitat corporativa contribuïdora d’objecte @ca
definition: Relaciona una manifestació amb una entitat corporativa que és un contribuïdor a un agregat que crea una expressió d’una obra d’objecte que es materialitza en un agregat. @ca
toolkit label: entitat corporativa contribuïdora d’objecte @ca
toolkit definition: Entitat corporativa que és un contribuïdor a un agregat que crea una expressió d’una obra d’objecte que es materialitza en un agregat. @ca
label: har korporation, som er bidragsyder til objekt @da
definition: Relaterer en manifestation til en korporation, som er bidragsyder til samling, som skaber et værk med objekt, der er indeholdt i en samling. @da
toolkit label: korporation, som er bidragsyder til objekt @da
toolkit definition: Korporation, som er bidragsyder til samling, som skaber et værk med objekt, der er indeholdt i en samling. @da
label: objektiloome kaastööline (asutus) @et
definition: Seostab kehastuse asutusega, kes on liitumi kaastööline, luues objektteose väljenduse, mis on teostatud liitumis. @et
toolkit label: objektiloome kaastööline (asutus) @et
toolkit definition: Asutus, kes on liitumi kaastööline, luues objektteose väljenduse, mis on teostatud liitumis. @et
label: hat Beiträgerin/Beiträger von einem Gegenstand (Körperschaft) @de
definition: Setzt eine Manifestation in Beziehung zu einer Beiträgerin/einem Beiträger zu einem Aggregat (Körperschaft), die/der eine Expression eines gegenständlichen Werks erstellt, die durch ein Aggregat verkörpert wird. @de
toolkit label: Beiträgerin/Beiträger von einem Gegenstand (Körperschaft) @de
toolkit definition: Eine Beiträgerin/Ein Beiträger zu einem Aggregat (Körperschaft), die/der eine Expression eines gegenständlichen Werks erstellt, die durch ein Aggregat verkörpert wird. @de
label: tárgy közreműködő testülete a következő: @hu
definition: Hozzákapcsol egy megjelenési formát egy testülethez, amely aggregátor közreműködőként egy tárgyi mű olyan kifejezési formáját hozza létre, amely egy aggregátumban testesül meg. @hu
toolkit label: tárgy közreműködő testülete @hu
toolkit definition: Egy testület, amely aggregátor közreműködőként egy tárgyi mű olyan kifejezési formáját hozza létre, amely egy aggregátumban testesül meg. @hu
label: ha come contributore di oggetto ente @it
definition: Correla una manifestazione all'ente contributore a un aggregato, che crea un’opera oggetto, materializzata in un aggregato. @it
toolkit label: contributore di oggetto ente @it
toolkit definition: Ente contributore a un aggregato, che crea un’opera oggetto, materializzata in un aggregato. @it
label: objekta līdzradītājs (institūcija) @lv
definition: Sasaista manifestāciju ar institūciju, kas ir līdzradītājs, kas radījusi apkopojumā ietverto objekta darbu. @lv
toolkit label: objekta līdzradītājs (institūcija) @lv
toolkit definition: Institūcija - līdzradītājs, kas radījusi apkopojumā ietverto objekta darbu. @lv
label: 有物体的贡献者团体 @zh-hans
definition: 将一种载体表现与作为合集的一个贡献者并创建被一种合集具体化的一种物体作品的一种内容表达的一个团体关联起来。 @zh-hans
toolkit label: 物体的贡献者团体 @zh-hans
toolkit definition: 作为合集的一个贡献者并创建被一种合集具体化的一种物体作品的一种内容表达的一个团体 @zh-hans
label: nesneye katkıda bulunan tüzel kişi ile ilişkilidir @tr
definition: Bir gösterimi, bir topluluğun somutlaştırdığı bir obje eserinin anlatımını yaratan, topluluğa katkıda bulunan bir tüzel kişi ile ilişkilendirir. @tr
toolkit label: nesneye katkıda bulunan tüzel kişi @tr
toolkit definition: Bir topluluk tarafından somutlaştırılan bir obje eserinin anlatımını yaratan, topluluğa katkıda bulunan bir tüzel kişi. @tr
label: tiene cuerpo corporativo contribuyente de objeto @es
definition: Relaciona una manifestación con un cuerpo corporativo que es colaborador al agregado y que crea una expresión de un objeto de trabajo que está encarnado por un agregado. @es
toolkit label: cuerpo corporativo contribuyente de objeto @es
toolkit definition: Un cuerpo corporativo que es colaborador al agregado y que crea una expresión de un objeto de trabajo que está encarnado por un agregado. @es
has subproperty: P30403

has contributor corporate body of speech
status: Published
lexical alias: contributorCorporateBodyOfSpeech.en
definition: Relates a manifestation to a corporate body who is a contributor to aggregate who creates an expression of a vocal work that is embodied by an aggregate.
toolkit label: contributor corporate body of speech
toolkit definition: A corporate body who is a contributor to aggregate who creates an expression of a vocal work that is embodied by an aggregate.
type: Property
domain: C10007
has element type: 2
sub property of: has contributor corporate body to aggregate
sub property of: has contributor collective agent of speech
label: puheeseen osallinen yhteisö @fi
definition: Liittää manifestaation aggregaattiin osalliseen yhteisöön, joka on luonut aggregaattiin sisältyvän puheteoksen ekspression. @fi
toolkit label: puheeseen osallinen yhteisö @fi
toolkit definition: Aggregaattiin osallinen yhteisö, joka on luonut aggregaattiin sisältyvän puheteoksen ekspression. @fi
label: har bidragsyter til tale (korporasjon) @no
definition: Relaterer en manifestasjon til en korporasjon som er en bidragsyter til aggregat som skaper et verk av tale som er realisert i et aggregat. @no
toolkit label: bidragsyter til tale (korporasjon) @no
toolkit definition: En korporasjon som er en bidragsyter til aggregat som skaper et verk av tale som er realisert i et aggregat. @no
label: a pour collectivité contributrice de contenu vocal @fr
definition: Met une manifestation en relation avec une collectivité contributrice à un agrégat qui crée une expression d’une œuvre vocale matérialisée par un agrégat. @fr
toolkit label: collectivité contributrice de contenu vocal @fr
toolkit definition: Collectivité contributrice à un agrégat qui crée une expression d’une œuvre vocale matérialisée par un agrégat. @fr
label: heeft bijdrage-corporatie van spraak @nl
definition: Relateert een manifestatie aan een corporatie die een bijdrager aan aggregaat is die een expressie van een vocaal werk creëert die is verwezenlijkt in een aggregaat. @nl
toolkit label: bijdrage-corporatie van spraak @nl
toolkit definition: Een corporatie die een bijdrager aan aggregaat is die een expressie van een vocaal werk creëert die is verwezenlijkt in een aggregaat. @nl
label: له هيئة مساهمة بحديث @ar
definition: يربط بين تجسيدة وهيئة مساهمة في عمل تجميعي ينشيء عمل من كلمات منطوقة يتجسد في تجميعية. @ar
toolkit label: هيئة مساهمة بحديث @ar
toolkit definition: هيئة مساهمة في عمل تجميعي ينشيء عمل من كلمات منطوقة يتجسد في تجميعية. @ar
label: té com a entitat corporativa contribuïdora de discurs @ca
definition: Relaciona una manifestació amb una entitat corporativa que és un contribuïdor a un agregat que crea una expressió d’una obra vocal que es materialitza en un agregat. @ca
toolkit label: entitat corporativa contribuïdora de discurs @ca
toolkit definition: Entitat corporativa que és un contribuïdor a un agregat que crea una expressió d’una obra vocal que es materialitza en un agregat. @ca
label: har korporation, som er bidragsyder til tale @da
definition: Relaterer en manifestation til en korporation, som er bidragsyder til samling, som skaber et værk med talte ord, der er indeholdt i en samling. @da
toolkit label: korporation, som er bidragsyder til tale @da
toolkit definition: Korporation, som er bidragsyder til samling, som skaber et værk med talte ord, der er indeholdt i en samling. @da
label: kõneloome kaastööline (asutus) @et
definition: Seostab kehastuse asutusega, kes on liitumi kaastööline, luues suulise teose väljenduse, mis on teostatud liitumis. @et
toolkit label: kõneloome kaastööline (asutus) @et
toolkit definition: Asutus, kes on liitumi kaastööline, luues suulise teose väljenduse, mis on teostatud liitumis. @et
label: hat Beiträgerin/Beiträger von einer Rede (Körperschaft) @de
definition: Setzt eine Manifestation in Beziehung zu einer Beiträgerin/einem Beiträger zu einem Aggregat (Körperschaft), die/der eine Expression eines gesprochenen Werks erstellt, die durch ein Aggregat verkörpert wird. @de
toolkit label: Beiträgerin/Beiträger von einer Rede (Körperschaft) @de
toolkit definition: Eine Beiträgerin/Ein Beiträger zu einem Aggregat (Körperschaft), die/der eine Expression eines gesprochenen Werks erstellt, die durch ein Aggregat verkörpert wird. @de
label: beszéd közreműködő testülete a következő: @hu
definition: Hozzákapcsol egy megjelenési formát egy testülethez, amely aggregátor közreműködőként egy beszédmű olyan kifejezési formáját hozza létre, amely egy aggregátumban testesül meg. @hu
toolkit label: beszéd közreműködő testülete @hu
toolkit definition: Egy testület, amely aggregátor közreműködőként egy beszédmű olyan kifejezési formáját hozza létre, amely egy aggregátumban testesül meg. @hu
label: ha come contributore di discorso ente @it
definition: Correla una manifestazione all'ente contributore a un aggregato, che crea un'opera parlata, materializzata in un aggregato. @it
toolkit label: contributore di discorso ente @it
toolkit definition: Ente contributore a un aggregato, che crea un'opera parlata, materializzata in un aggregato. @it
label: runas līdzradītājs (institūcija) @lv
definition: Sasaista manifestāciju ar institūciju, kas ir līdzradītājs, kas radījusi apkopojumā ietverto mutvārdu darbu. @lv
toolkit label: runas līdzradītājs (institūcija) @lv
toolkit definition: Institūcija - līdzradītājs, kas radījusi apkopojumā ietverto mutvārdu darbu. @lv
label: 有讲话的贡献者团体 @zh-hans
definition: 将一种载体表现与作为合集的一个贡献者并创建被一种合集具体化的一种人声作品的一种内容表达的一个团体关联起来。 @zh-hans
toolkit label: 讲话的贡献者团体 @zh-hans
toolkit definition: 作为合集的一个贡献者并创建被一种合集具体化的一种人声作品的一种内容表达的一个团体 @zh-hans
label: konuşmaya katkıda bulunan tüzel kişi ile ilişkilidir @tr
definition: Bir gösterimi, bir topluluğa katkıda bulunan ve bir topluluğa somutlaşan bir ses eserinin anlatımını yaratan bir tüzel kişiyle ilişkilendirir. @tr
toolkit label: konuşmaya katkıda bulunan tüzel kişi @tr
toolkit definition: Bir topluluğun somutlaştırdığı bir ses eserinin anlatımını yaratan, topluluğa katkıda bulunan bir tüzel kişilik. @tr
label: tiene cuerpo corporativo colaborador de discurso @es
definition: Relaciona una manifestación con un cuerpo corporativo que es un colaborador a un agregado que crea una expresión de una obra vocal que está encarnada por un agregado. @es
toolkit label: cuerpo corporativo colaborador de discurso @es
toolkit definition: Un cuerpo corporativo que es un colaborador a un agregado que crea una expresión de una obra vocal que está encarnada por un agregado. @es
has subproperty: P30400

has contributor corporate body of still image
status: Published
lexical alias: contributorCorporateBodyOfStillImage.en
definition: Relates a manifestation to a corporate body who is a contributor to aggregate who creates an expression of a still image work that is embodied by an aggregate.
toolkit label: contributor corporate body of still image
toolkit definition: A corporate body who is a contributor to aggregate who creates an expression of a still image work that is embodied by an aggregate.
type: Property
domain: C10007
has element type: 2
sub property of: has contributor corporate body to aggregate
sub property of: has contributor collective agent of still image
label: stillkuvaan osallinen yhteisö @fi
definition: Liittää manifestaation aggregaattiin osalliseen yhteisöön, joka on luonut aggregaattiin sisältyvän stillkuvateoksen ekspression. @fi
toolkit label: stillkuvaan osallinen yhteisö @fi
toolkit definition: Aggregaattiin osallinen yhteisö, joka on luonut aggregaattiin sisältyvän stillkuvateoksen ekspression. @fi
label: har bidragsyter til bilde (korporasjon) @no
definition: Relaterer en manifestasjon til en korporasjon som er en bidragsyter til aggregat som skaper et bildeverk som er realisert i et aggregat. @no
toolkit label: bidragsyter til bilde (korporasjon) @no
toolkit definition: En korporasjon som er en bidragsyter til aggregat som skaper et bildeverk som er realisert i et aggregat. @no
label: a pour collectivité contributrice d’image fixe @fr
definition: Met une manifestation en relation avec une collectivité contributrice à un agrégat qui crée une expression d’une œuvre d’image fixe matérialisée par un agrégat. @fr
toolkit label: collectivité contributrice d’image fixe @fr
toolkit definition: Collectivité contributrice à un agrégat qui crée une expression d’une œuvre d’image fixe matérialisée par un agrégat. @fr
label: heeft bijdrage-corporatie van stilstaand beeld @nl
definition: Relateert een manifestatie aan een corporatie die een bijdrager aan aggregaat is die een expressie van een stilstaand beeldwerk creëert die is verwezenlijkt in een aggregaat. @nl
toolkit label: bijdrage-corporatie van stilstaand beeld @nl
toolkit definition: Een corporatie die een bijdrager aan aggregaat is die een expressie van een stilstaand beeldwerk creëert die is verwezenlijkt in een aggregaat. @nl
label: له هيئة مساهمة بصور ثابتة @ar
definition: يربط بين تجسيدة وهيئة مساهمة في عمل تجميعي ينشيء عمل من صور ثابتة يتجسد في تجميعية. @ar
toolkit label: هيئة مساهمة بصور ثابتة @ar
toolkit definition: هيئة مساهمة في عمل تجميعي ينشيء عمل من صور ثابتة يتجسد في تجميعية. @ar
label: té com a entitat corporativa contribuïdora d’imatge fixa @ca
definition: Relaciona una manifestació amb una entitat corporativa que és un contribuïdor a un agregat que crea una expressió d’una obra d’imatge fixa que es materialitza en un agregat. @ca
toolkit label: entitat corporativa contribuïdora d’imatge fixa @ca
toolkit definition: Entitat corporativa que és un contribuïdor a un agregat que crea una expressió d’una obra d’imatge fixa que es materialitza en un agregat. @ca
label: har korporation, som er bidragsyder til stillbillede @da
definition: Relaterer en manifestation til en korporation, som er bidragsyder til samling, som skaber et værk med stillbilleder, der er indeholdt i en samling. @da
toolkit label: korporation, som er bidragsyder til stillbillede @da
toolkit definition: Korporation, som er bidragsyder til samling, som skaber et værk med stillbilleder, der er indeholdt i en samling. @da
label: kaastööline liikumatu pildi alal (asutus) @et
definition: Seostab kehastuse asutusega, kes on liitumi kaastööline, luues liikumatust pildist koosneva teose väljenduse, mis on teostatud liitumis. @et
toolkit label: kaastööline liikumatu pildi alal (asutus) @et
toolkit definition: Asutus, kes on liitumi kaastööline, luues liikumatust pildist koosneva teose väljenduse, mis on teostatud liitumis. @et
label: hat Illustratorin/Illustrator (Körperschaft) @de
definition: Setzt eine Manifestation in Beziehung zu einer Beiträgerin/einem Beiträger zu einem Aggregat (Körperschaft), die/der eine Expression eines unbewegten Bildwerks erstellt, die durch ein Aggregat verkörpert wird. @de
toolkit label: Illustratorin/Illustrator (Körperschaft) @de
toolkit definition: Eine Beiträgerin/Ein Beiträger zu einem Aggregat (Körperschaft), die/der eine Expression eines unbewegten Bildwerks erstellt, die durch ein Aggregat verkörpert wird. @de
label: állókép közreműködő testülete a következő: @hu
definition: Hozzákapcsol egy megjelenési formát egy testülethez, amely aggregátor közreműködőként egy állóképmű olyan kifejezési formáját hozza létre, amely egy aggregátumban testesül meg. @hu
toolkit label: állókép közreműködő testülete: @hu
toolkit definition: Egy testület, amely aggregátor közreműködőként egy állóképmű olyan kifejezési formáját hozza létre, amely egy aggregátumban testesül meg. @hu
label: ha come contributore di immagine fissa ente @it
definition: Correla una manifestazione all'ente contributore a un aggregato, che crea un'opera di immagine fissa, materializzata in un aggregato. @it
toolkit label: contributore di immagine fissa ente @it
toolkit definition: Ente contributore a un aggregato, che crea un'opera di immagine fissa, materializzata in un aggregato. @it
label: attēla līdzradītājs (institūcija) @lv
definition: Sasaista manifestāciju ar institūciju, kas ir līdzradītājs, kas radījusi apkopojumā ietverto attēla darbu. @lv
toolkit label: attēla līdzradītājs (institūcija) @lv
toolkit definition: Institūcija - līdzradītājs, kas radījusi apkopojumā ietverto attēla darbu. @lv
label: 有静态图像的贡献者团体 @zh-hans
definition: 将一种载体表现与作为合集的一个贡献者并创建被一种合集具体化的一种静态图像作品的一种内容表达的一个团体关联起来。 @zh-hans
toolkit label: 静态图像的贡献者团体 @zh-hans
toolkit definition: 作为合集的一个贡献者并创建被一种合集具体化的一种静态图像作品的一种内容表达的一个团体 @zh-hans
label: durağan görüntüye katkıda bulunan tüzel kişi ile ilişkilidir @tr
definition: Bir gösterimi, bir topluluğun somutlaştırdığı hareketsiz bir görüntü eserinin anlatımını yaratan, topluluğa katkıda bulunan bir tüzel kişiyle ilişkilendirir. @tr
toolkit label: hareketsiz görüntüye katkıda bulunan tüzel kişi @tr
toolkit definition: Bir topluluğun somutlaştırdığı bir hareketsiz görüntü eserinin anlatımını yaratan, topluluğa katkıda bulunan bir tüzel kişilik. @tr
label: tiene cuerpo corporativo contribuyente de imagen fija @es
definition: Relaciona una manifestación con un cuerpo corporativo que es colaborador al agregado y que crea una expresión de una obra de imagen fija que está encarnada por un agregado. @es
toolkit label: cuerpo corporativo contribuyente de imagen fija @es
toolkit definition: Un cuerpo corporativo que es colaborador al agregado y que crea una expresión de una obra de imagen fija que está encarnada por un agregado. @es
has subproperty: P30401

has contributor corporate body of text
status: Published
lexical alias: contributorCorporateBodyOfText.en
definition: Relates a manifestation to a corporate body who is a contributor to aggregate who creates an expression of a textual work that is embodied by an aggregate.
toolkit label: contributor corporate body of text
toolkit definition: A corporate body who is a contributor to aggregate who creates an expression of a textual work that is embodied by an aggregate.
type: Property
domain: C10007
has element type: 2
sub property of: has contributor corporate body to aggregate
sub property of: has contributor collective agent of text
label: tekstiin osallinen yhteisö @fi
definition: Liittää manifestaation aggregaattiin osalliseen yhteisöön, joka on luonut aggregaattiin sisältyvän tekstiteoksen ekspression. @fi
toolkit label: tekstiin osallinen yhteisö @fi
toolkit definition: Aggregaattiin osallinen yhteisö, joka on luonut aggregaattiin sisältyvän tekstiteoksen ekspression. @fi
label: har bidragsyter til tekst (korporasjon) @no
definition: Relaterer en manifestasjon til en korporasjon som er en bidragsyter til aggregat som skaper et tekstlig verk som er realisert i et aggregat. @no
toolkit label: bidragsyter til tekst (korporasjon) @no
toolkit definition: En korporasjon som er en bidragsyter til aggregat som skaper et tekstlig verk som er realisert i et aggregat. @no
label: a pour collectivité contributrice de texte @fr
definition: Met une manifestation en relation avec une collectivité contributrice à un agrégat qui crée une expression d’une œuvre textuelle matérialisée par un agrégat. @fr
toolkit label: collectivité contributrice de texte @fr
toolkit definition: Collectivité contributrice à un agrégat qui crée une expression d’une œuvre textuelle matérialisée par un agrégat. @fr
label: heeft bijdrage-corporatie van tekst @nl
definition: Relateert een manifestatie aan een corporatie die een bijdrager aan aggregaat is die een expressie van een tekstwerk creëert die is verwezenlijkt in een aggregaat. @nl
toolkit label: bijdrage-corporatie van tekst @nl
toolkit definition: Een corporatie die een bijdrager aan aggregaat is die een expressie van een tekstwerk creëert die is verwezenlijkt in een aggregaat. @nl
label: له هيئة مساهمة بنص @ar
definition: يربط بين تجسيدة وهيئة مساهمة في عمل تجميعي ينشيء عمل نصي يتجسد في تجميعية. @ar
toolkit label: هيئة مساهمة بنص @ar
toolkit definition: هيئة مساهمة في عمل تجميعي ينشيء عمل نصي يتجسد في تجميعية. @ar
label: té com a entitat corporativa contribuïdora de text @ca
definition: Relaciona una manifestació amb una entitat corporativa que és un contribuïdor a un agregat que crea una expressió d’una obra textual que es materialitza en un agregat. @ca
toolkit label: entitat corporativa contribuïdora de text @ca
toolkit definition: Entitat corporativa que és un contribuïdor a un agregat que crea una expressió d’una obra textual que es materialitza en un agregat. @ca
label: har korporation, som er bidragsyder til tekst @da
definition: Relaterer en manifestation til en korporation, som er bidragsyder til samling, som skaber et tekstværk, der er indeholdt i en samling. @da
toolkit label: korporation, som er bidragsyder til tekst @da
toolkit definition: Korporation, som er bidragsyder til samling, som skaber et tekstværk, der er indeholdt i en samling. @da
label: tekstiloome kaastööline (asutus) @et
definition: Seostab kehastuse asutusega, kes on liitumi kaastööline, luues tekstteose väljenduse, mis on teostatud liitumis. @et
toolkit label: tekstiloome kaastööline (asutus) @et
toolkit definition: Asutus, kes on liitumi kaastööline, luues tekstteose väljenduse, mis on teostatud liitumis. @et
label: hat Beiträgerin/Beiträger von ergänzendem Text (Körperschaft) @de
definition: Setzt eine Manifestation in Beziehung zu einer Beiträgerin/einem Beiträger zu einem Aggregat (Körperschaft), die/der eine Expression eines textlichen Werks erstellt, die durch ein Aggregat verkörpert wird. @de
toolkit label: Beiträgerin/Beiträger von ergänzendem Text (Körperschaft) @de
toolkit definition: Eine Beiträgerin/Ein Beiträger zu einem Aggregat (Körperschaft), die/der eine Expression eines textlichen Werks erstellt, die durch ein Aggregat verkörpert wird. @de
label: szöveg közreműködő testülete a következő: @hu
definition: Hozzákapcsol egy megjelenési formát egy testülethez, amely aggregátor közreműködőként egy szöveges mű olyan kifejezési formáját hozza létre, amely egy aggregátumban testesül meg. @hu
toolkit label: szöveg közreműködő testülete: @hu
toolkit definition: Egy testület, amely aggregátor közreműködőként egy szöveges mű olyan kifejezési formáját hozza létre, amely egy aggregátumban testesül meg. @hu
label: ha come contributore di testo ente @it
definition: Correla una manifestazione all'ente contributore a un aggregato, che crea un'opera testuale, materializzata in un aggregato. @it
toolkit label: contributore di testo ente @it
toolkit definition: Ente contributore a un aggregato, che crea un'opera testuale, materializzata in un aggregato. @it
label: teksta līdzradītājs (institūcija) @lv
definition: Sasaista manifestāciju ar institūciju, kas ir līdzradītājs, kas radījusi apkopojumā ietverto teksta darbu. @lv
toolkit label: teksta līdzradītājs (institūcija) @lv
toolkit definition: Institūcija - līdzradītājs, kas radījusi apkopojumā ietverto teksta darbu. @lv
label: 有文本的贡献者团体 @zh-hans
definition: 将一种载体表现与作为合集的一个贡献者并创建被一种合集具体化的一种文字作品的一种内容表达的一个团体关联起来。 @zh-hans
toolkit label: 文本的贡献者团体 @zh-hans
toolkit definition: 作为合集的一个贡献者并创建被一种合集具体化的一种文字作品的一种内容表达的一个团体 @zh-hans
label: metne katkıda bulunan tüzel kişi ile ilişkilidir @tr
definition: Bir gösterimi, bir topluluğun somutlaştırdığı metinsel bir eserin anlatımını yaratan, topluluğa katkıda bulunan bir tüzel kişiyle ilişkilendirir. @tr
toolkit label: metne katkıda bulunan tüzel kişi @tr
toolkit definition: Bir topluluğun somutlaştırdığı metinsel bir eserin anlatımını yaratan, topluluğa katkıda bulunan bir tüzel kişilik. @tr
label: tiene cuerpo corporativo colaborador de texto @es
definition: Relaciona una manifestación con un cuerpo corporativo que es colaborador a un agregado y que crea una expresión de una obra textual que está incorporada por un agregado. @es
toolkit label: cuerpo corporativo colaborador de texto @es
toolkit definition: Un cuerpo corporativo que es colaborador a un agregado y que crea una expresión de una obra textual que está incorporada por un agregado. @es
has subproperty: P30402

has contributor corporate body to aggregate
status: Published
lexical alias: contributorCorporateBodyToAggregate.en
definition: Relates a manifestation to a corporate body who is responsible for creating an expression of a work that is embodied by an aggregate.
toolkit label: contributor corporate body to aggregate
toolkit definition: A corporate body who is responsible for creating an expression of a work that is embodied by an aggregate.
type: Property
domain: C10007
has element type: 2
sub property of: has related corporate body of manifestation
sub property of: has contributor collective agent to aggregate
label: aggregaattiin osallinen yhteisö @fi
definition: Liittää manifestaation yhteisöön, joka on vastuussa aggregaattiin sisältyvän teoksen ekspression luomisesta. @fi
toolkit label: aggregaattiin osallinen yhteisö @fi
toolkit definition: Yhteisö, joka on vastuussa aggregaattiin sisältyvän teoksen ekspression luomisesta. @fi
label: har bidragsyter til aggregat (korporasjon) @no
definition: Relaterer en manifestasjon til en korporasjon som skaper et verk som er realisert i et aggregat. @no
toolkit label: bidragsyter til aggregat (korporasjon) @no
toolkit definition: En korporasjon som skaper et verk som er realisert i et aggregat. @no
label: a pour collectivité contributrice à un agrégat @fr
definition: Met une manifestation en relation avec une collectivité qui est responsable de la création d’une expression d’une œuvre matérialisée par un agrégat. @fr
toolkit label: collectivité contributrice à un agrégat @fr
toolkit definition: Collectivité qui est responsable de la création d’une expression d’une œuvre matérialisée par un agrégat. @fr
label: heeft bijdrage-corporatie aan aggregaat @nl
definition: Relateert een manifestatie aan een corporatie die verantwoordelijk is voor het creëren van een expressie van een werk die is verwezenlijkt in een aggregaat. @nl
toolkit label: bijdrage-corporatie aan aggregaat @nl
toolkit definition: Een corporatie die verantwoordelijk is voor het creëren van een expressie van een werk die is verwezenlijkt in een aggregaat. @nl
label: له هيئة مساهمة في تجميعة @ar
definition: يربط بين تجسيدة وهيئة تنشئ عمل يتجسد في تجميعية. @ar
toolkit label: هيئة مساهمة في تجميعة @ar
toolkit definition: هيئة تنشئ عمل يتجسد في تجميعية. @ar
label: té com a entitat corporativa contribuïdora a un agregat @ca
definition: Relaciona una manifestació amb una entitat corporativa que és responsable de la creació d’una expressió d’una obra que es materialitza en un agregat. @ca
toolkit label: entitat corporativa contribuïdora a un agregat @ca
toolkit definition: Entitat corporativa que és responsable de la creació d’una expressió d’una obra que es materialitza en un agregat. @ca
label: har korporation, som er bidragsyder til samling @da
definition: Relaterer en manifestation til en korporation, som skaber et værk, der er indeholdt i en samling. @da
toolkit label: korporation, som er bidragsyder til samling @da
toolkit definition: Korporation, som skaber et værk, der er indeholdt i en samling. @da
label: liitumi kaastööline (asutus) @et
definition: Seostab kehastuse asutusega, kes loob teose väljenduse, mis on teostatud liitumis. @et
toolkit label: liitumi kaastööline (asutus) @et
toolkit definition: Asutus, kes loob teose väljenduse, mis on teostatud liitumis. @et
label: hat Beiträgerin/Beiträger zu einem Aggregat (Körperschaft) @de
definition: Setzt eine Manifestation in Beziehung zu einer Körperschaft, die für die Schaffung einer Expression eines Werks verantwortlich ist, die durch ein Aggregat verkörpert wird. @de
toolkit label: Beiträgerin/Beiträger zu einem Aggregat (Körperschaft) @de
toolkit definition: Eine Körperschaft, die für die Schaffung einer Expression eines Werks verantwortlich ist, die durch ein Aggregat verkörpert wird. @de
label: aggregátum közreműködő testülete a következő: @hu
definition: Hozzákapcsol egy megjelenési formát egy kollektív ágenshez, amely egy mű olyan kifejezési formáját hozza létre, amely egy aggregátumban testesül meg. @hu
toolkit label: aggregátum közreműködő testülete @hu
toolkit definition: Egy kollektív ágens, amely egy mű olyan kifejezési formáját hozza létre, amely egy aggregátumban testesül meg. @hu
label: ha come contributore a un aggregato ente @it
definition: Correla una manifestazione all'ente creatore di un'opera materializzata in un aggregato. @it
toolkit label: contributore a un aggregato ente @it
toolkit definition: Ente creatore di un'opera materializzata in un aggregato. @it
label: apkopojuma līdzradītājs (institūcija) @lv
definition: Sasaista manifestāciju ar institūciju, kas radījusi apkopojumā ietverto darbu. @lv
toolkit label: apkopojuma līdzradītājs (institūcija) @lv
toolkit definition: Institūcija, kas radījusi apkopojumā ietverto darbu. @lv
label: 有合集的贡献者团体 @zh-hans
definition: 将一种载体表现与负责创建被一种合集具体化的一种作品的一种内容表达的一个团体关联起来。 @zh-hans
toolkit label: 合集的贡献者团体 @zh-hans
toolkit definition: 负责创建被一种合集具体化的一种作品的一种内容表达的一个团体 @zh-hans
label: toplamaya katkıda bulunan tüzel kişi ile ilişkilidir @tr
definition: Bir gösterimi, bir topluluğun somutlaştırdığı bir eserin anlatımı yaratmaktan sorumlu olan bir tüzel kişiyle ilişkilendirir. @tr
toolkit label: topluluğa katkıda bulunan tüzel kişi @tr
toolkit definition: Bir topluluğun somutlaştırdığı bir eserin anlatımını yaratmaktan sorumlu olan bir tüzel kişi. @tr
label: tiene un cuerpo corporativo colaborador para agregar @es
definition: Relaciona una manifestación con un cuerpo corporativo que es responsable de crear una expresión de una obra que está personificada por un agregado. @es
toolkit label: cuerpo corporativo colaborador para agregar @es
toolkit definition: Un cuerpo corporativo que es responsable de crear una expresión de una obra que está personificada por un agregado. @es
has subproperty: has contributor corporate body of cartography
has subproperty: has contributor corporate body of choreography
has subproperty: has contributor corporate body of computer content
has subproperty: has contributor corporate body of moving image
has subproperty: has contributor corporate body of music
has subproperty: has contributor corporate body of object
has subproperty: has contributor corporate body of speech
has subproperty: has contributor corporate body of still image
has subproperty: has contributor corporate body of text

has contributor family of cartography
status: Published
lexical alias: contributorFamilyOfCartography.en
definition: Relates a manifestation to a family who is a contributor to aggregate who creates an expression of a cartographic work that is embodied by an aggregate.
toolkit label: contributor family of cartography
toolkit definition: A family who is a contributor to aggregate who creates an expression of a cartographic work that is embodied by an aggregate.
type: Property
domain: C10007
has element type: 2
sub property of: has contributor family to aggregate
sub property of: has contributor collective agent of cartography
label: kartografiaan osallinen suku @fi
definition: Liittää manifestaation aggregaattiin osalliseen sukuun, joka on luonut aggregaattiin sisältyvän kartografisen teoksen ekspression. @fi
toolkit label: kartografiaan osallinen suku @fi
toolkit definition: Aggregaattiin osallinen suku, joka on luonut aggregaattiin sisältyvän kartografisen teoksen ekspression. @fi
label: har bidragsyter til kartografi (familie) @no
definition: Relaterer en manifestasjon til en familie som er en bidragsyter til aggregat som skaper et kartografisk verk som er realisert i et aggregat. @no
toolkit label: bidragsyter til kartografi (familie) @no
toolkit definition: En familie som er en bidragsyter til aggregat som skaper et kartografisk verk som er realisert i et aggregat. @no
label: a pour famille contributrice de cartographie @fr
definition: Met une manifestation en relation avec une famille contributrice à un agrégat qui crée une expression d’une œuvre cartographique matérialisée par un agrégat. @fr
toolkit label: famille contributrice de cartographie @fr
toolkit definition: Famille contributrice à un agrégat qui crée une expression d’une œuvre cartographique matérialisée par un agrégat. @fr
label: heeft bijdrage-familie van cartografie @nl
definition: Relateert een manifestatie aan een familie die een bijdrager aan aggregaat is die een expressie van een cartografisch werk creëert die is verwezenlijkt in een aggregaat. @nl
toolkit label: bijdrage-familie van cartografie @nl
toolkit definition: Een familie die een bijdrager aan aggregaat is die een expressie van een cartografisch werk creëert die is verwezenlijkt in een aggregaat. @nl
label: له عائلة مساهمة برسم خرائط @ar
definition: يربط بين تجسيدة وعائلة تساهم في عمل تجميعي ينشيء عمل خرائطي يتجسد في تجميعية. @ar
toolkit label: عائلة مساهمة برسم خرائط @ar
toolkit definition: عائلة تساهم في عمل تجميعي ينشيء عمل خرائطي يتجسد في تجميعية. @ar
label: té com a família contribuïdora de cartografia @ca
definition: Relaciona una manifestació amb una família que és un contribuïdor a un agregat que crea una expressió d’una obra cartogràfica que es materialitza en un agregat. @ca
toolkit label: família contribuïdora de cartografia @ca
toolkit definition: Família que és un contribuïdor a un agregat que crea una expressió d’una obra cartogràfica que es materialitza en un agregat. @ca
label: har familie, som er bidragsyder til kartografi @da
definition: Relaterer en manifestation til en agent, som er bidragsyder til samling, som skaber et kartografisk værk, der er indeholdt i en samling. @da
toolkit label: familie, som er bidragsyder til kartografi @da
toolkit definition: Familie, som er bidragsyder til samling, som skaber et kartografisk værk, der er indeholdt i en samling. @da
label: kaastööline kartograafia alal (perekond) @et
definition: Seostab kehastuse perekonnaga, kes on liitumi kaastööline, luues kartograafilise teose väljenduse, mis on teostatud liitumis. @et
toolkit label: kaastööline kartograafia alal (perekond) @et
toolkit definition: Perekond, kes on liitumi kaastööline, luues kartograafilise teose väljenduse, mis on teostatud liitumis. @et
label: hat Beiträgerin/Beiträger von einer Kartografie (Familie) @de
definition: Setzt eine Manifestation in Beziehung zu einer Beiträgerin/einem Beiträger zu einem Aggregat (Familie), die/der eine Expression eines kartografischen Werks erstellt, die durch ein Aggregat verkörpert wird. @de
toolkit label: Beiträgerin/Beiträger von einer Kartografie (Familie) @de
toolkit definition: Eine Beiträgerin/Ein Beiträger zu einem Aggregat (Familie), die/der eine Expression eines kartografischen Werks erstellt, die durch ein Aggregat verkörpert wird. @de
label: térképészet közreműködő családja a következő: @hu
definition: Hozzákapcsol egy megjelenési formát egy családhoz, amely aggregátor közreműködőként egy kartográfiai mű olyan kifejezési formáját hozza létre, amely egy aggregátumban testesül meg. @hu
toolkit label: térképészet közreműködő családja @hu
toolkit definition: Egy család, amely aggregátor közreműködőként egy kartográfiai mű olyan kifejezési formáját hozza létre, amely egy aggregátumban testesül meg. @hu
label: ha come contributore di cartografia famiglia @it
definition: Correla una manifestazione alla famiglia contributrice a un aggregato che crea un'opera cartografica, materializzata in un aggregato. @it
toolkit label: contributore di cartografia famiglia @it
toolkit definition: Famiglia contributore a un aggregato che crea un'opera cartografica, materializzata in un aggregato. @it
label: kartogrāfijas līdzradītājs (dzimta/ģimene) @lv
definition: Sasaista manifestāciju ar dzimtu/ģimeni, kas ir līdzradītājs, kas radījusi apkopojumā ietverto kartogrāfijas darbu. @lv
toolkit label: kartogrāfijas līdzradītājs (dzimta/ģimene) @lv
toolkit definition: Dzimta/ģimene - līdzradītājs, kas radījusi apkopojumā ietverto kartogrāfijas darbu. @lv
label: 有测绘者家族 @zh-hans
definition: 将一种载体表现与作为合集的一个贡献者并创建被一种合集具体化的一种地图作品的一种内容表达的一个家族关联起来。 @zh-hans
toolkit label: 测绘者家族 @zh-hans
toolkit definition: 作为合集的一个贡献者并创建被一种合集具体化的一种地图作品的一种内容表达的一个家族 @zh-hans
label: kartografiye katkıda bulunan aile ile ilişkilidir @tr
definition: Bir gösterimi; bütün tarafından somutlaştırılmış kartografik eserin ifadesini oluşturan, bütüne katkı sağlayan aileyle ilişkilendirir. @tr
toolkit label: kartografyaya katkıda bulunan aile @tr
toolkit definition: Topluluk tarafından somutlaştırılmış kartografik eserin ifadesini oluşturan, toplayana katkı sağlayan aile. @tr
label: tiene familia contribuidora de cartografía @es
definition: Relaciona una manifestación con una familia que es contribuidor a un agregado quien crea una expresión de una obra cartográfica que es materializada por un agregado. @es
toolkit label: familia contribuidora de cartografía @es
toolkit definition: Una familia que es contribuidor a un agregado quien crea una expresión de una obra cartográfica que es materializada por un agregado. @es
has subproperty: has surveyor family
has subproperty: P30425

has contributor family of choreography
status: Published
lexical alias: contributorFamilyOfChoreography.en
definition: Relates a manifestation to a family who is a contributor to aggregate who creates an expression of a choreographic work that is embodied by an aggregate.
toolkit label: contributor family of choreography
toolkit definition: A family who is a contributor to aggregate who creates an expression of a choreographic work that is embodied by an aggregate.
type: Property
domain: C10007
has element type: 2
sub property of: has contributor family to aggregate
sub property of: has contributor collective agent of choreography
label: koreografiaan osallinen suku @fi
definition: Liittää manifestaation aggregaattiin osalliseen sukuun, joka on luonut aggregaattiin sisältyvän koreografisen teoksen ekspression. @fi
toolkit label: koreografiaan osallinen suku @fi
toolkit definition: Aggregaattiin osallinen suku, joka on luonut aggregaattiin sisältyvän koreografisen teoksen ekspression. @fi
label: har bidragsyter til koreografi (familie) @no
definition: Relaterer en manifestasjon til en familie som er en bidragsyter til aggregat som skaper et koreografisk verk som er realisert i et aggregat. @no
toolkit label: bidragsyter til koreografi (familie) @no
toolkit definition: En familie som er en bidragsyter til aggregat som skaper et koreografisk verk som er realisert i et aggregat. @no
label: a pour famille contributrice de chorégraphie @fr
definition: Met une manifestation en relation avec une famille contributrice à un agrégat qui crée une expression d’une œuvre chorégraphique matérialisée par un agrégat. @fr
toolkit label: famille contributrice de chorégraphie @fr
toolkit definition: Famille contributrice à un agrégat qui crée une expression d’une œuvre chorégraphique matérialisée par un agrégat. @fr
label: heeft bijdrage-familie van choreografie @nl
definition: Relateert een manifestatie aan een familie die een bijdrager aan aggregaat is die een expressie van een choreografisch werk creëert die is verwezenlijkt in een aggregaat. @nl
toolkit label: bijdrage-familie van choreografie @nl
toolkit definition: Een familie die een bijdrager aan aggregaat is die een expressie van een choreografisch werk creëert die is verwezenlijkt in een aggregaat. @nl
label: له عائلة مساهمة برسم خرائط @ar
definition: يربط بين تجسيدة وعائلة مساهمة في عمل تجميعي ينشيء عمل من تصميم الرقصات يتجسيد في تجميعية. @ar
toolkit label: عائلة مساهمة برسم خرائط @ar
toolkit definition: عائلة مساهمة في عمل تجميعي ينشيء عمل من تصميم الرقصات يتجسيد في تجميعية. @ar
label: té com a família contribuïdora de coreografia @ca
definition: Relaciona una manifestació amb una família que és un contribuïdor a un agregat que crea una expressió d’una obra coreogràfica que es materialitza en un agregat. @ca
toolkit label: família contribuïdora de coreografia @ca
toolkit definition: Família que és un contribuïdor a un agregat que crea una expressió d’una obra coreogràfica que es materialitza en un agregat. @ca
label: har familie, som er bidragsyder til koreografi @da
definition: Relaterer en manifestation til en familie, som er bidragsyder til samling, som skaber et koreografisk værk, der er indeholdt i en samling. @da
toolkit label: familie, som er bidragsyder til koreografi @da
toolkit definition: Familie, som er bidragsyder til samling, som skaber et koreografisk værk, der er indeholdt i en samling. @da
label: kaastööline koreograafia alal (perekond) @et
definition: Seostab kehastuse perekonnaga, kes on liitumi kaastööline, luues koreograafilise teose väljenduse, mis on teostatud liitumis. @et
toolkit label: kaastööline koreograafia alal (perekond) @et
toolkit definition: Perekond, kes on liitumi kaastööline, luues koreograafilise teose väljenduse, mis on teostatud liitumis. @et
label: hat Beiträgerin/Beiträger von einer Choreografie (Familie) @de
definition: Setzt eine Manifestation in Beziehung zu einer Beiträgerin/einem Beiträger zu einem Aggregat (Familie), die/der eine Expression eines choreografischen Werks erstellt, die durch ein Aggregat verkörpert wird. @de
toolkit label: Beiträgerin/Beiträger von einer Choreografie (Familie) @de
toolkit definition: Eine Beiträgerin/Ein Beiträger zu einem Aggregat (Familie), die/der eine Expression eines choreografischen Werks erstellt, die durch ein Aggregat verkörpert wird. @de
label: koreográfia közreműködő családja a következő: @hu
definition: Hozzákapcsol egy megjelenési formát egy családhoz, amely aggregátor közreműködőként egy koreografikus mű olyan kifejezési formáját hozza létre, amely egy aggregátumban testesül meg. @hu
toolkit label: koreográfia közreműködő családja @hu
toolkit definition: Egy család, amely aggregátor közreműködőként egy koreografikus mű olyan kifejezési formáját hozza létre, amely egy aggregátumban testesül meg. @hu
label: ha come contributore di coreografia famiglia @it
definition: Correla una manifestazione alla famiglia contributrice a un aggregato che crea un'opera coreografica, materializzata in un aggregato. @it
toolkit label: contributore di coreografia famiglia @it
toolkit definition: Famiglia contributore a un aggregato che crea un'opera coreografica, materializzata in un aggregato. @it
label: horeogrāfijas līdzradītājs (dzimta/ģimene) @lv
definition: Sasaista manifestāciju ar dzimtu/ģimeni, kas ir līdzradītājs, kas radījusi apkopojumā ietverto horeogrāfijas darbu. @lv
toolkit label: horeogrāfijas līdzradītājs (dzimta/ģimene) @lv
toolkit definition: Dzimta/ģimene - līdzradītājs, kas radījusi apkopojumā ietverto horeogrāfijas darbu. @lv
label: 有编舞贡献者家族 @zh-hans
definition: 将一种载体表现与作为作为合集的一个贡献者并创建被一种合集具体化的一种地图作品的一种内容表达的一个家族关联起来。 @zh-hans
toolkit label: 编舞贡献者家族 @zh-hans
toolkit definition: 作为合集的一个贡献者并创建被一种合集具体化的一种编舞作品的一种内容表达的一个家族 @zh-hans
label: koreografiye katkıda bulunan aile ile ilişkilidir @tr
definition: Bir gösterimi, bütün tarafından somutlaştırılan koreografik eserin ifadesini yaratmış bütüne katkı sağlayan aileyle ilişkilendirir. @tr
toolkit label: koreografiye katkıda bulunan aile @tr
toolkit definition: Topluluk tarafından somutlaştırılan koreografik eserin ifadesini yaratmış toplayana katkı sağlayan aile. @tr
label: tiene familia contribuidora de coreografía @es
definition: Relaciona una manifestación con una familia que es contribuidora a un agregado quien crea una expresión de una obra coreográfica que es materializada por un agregado. @es
toolkit label: familia contribuidora de coreografía @es
toolkit definition: Una familia que es contribuidora a un agregado quien crea una expresión de una obra coreográfica que es materializada por un agregado. @es
has subproperty: P30426

has contributor family of computer content
status: Published
lexical alias: contributorFamilyOfComputerContent.en
definition: Relates a manifestation to a family who is a contributor to aggregate who creates an expression of computer content that is embodied by an aggregate.
toolkit label: contributor family of computer content
toolkit definition: A family who is a contributor to aggregate who creates an expression of computer content that is embodied by an aggregate.
type: Property
domain: C10007
has element type: 2
sub property of: has contributor family to aggregate
sub property of: has contributor collective agent of computer content
label: digitaaliseen sisältöön osallinen suku @fi
definition: Liittää manifestaation aggregaattiin osalliseen sukuun, joka on luonut aggregaattiin sisältyvän digitaalisen sisällön ekspression. @fi
toolkit label: digitaaliseen sisältöön osallinen suku @fi
toolkit definition: Aggregaattiin osallinen suku, joka on luonut aggregaattiin sisältyvän digitaalisen sisällön ekspression. @fi
label: har bidragsyter til datamaskininnhold (familie) @no
definition: Relaterer en manifestasjon til en familie som er en bidragsyter til aggregat som skaper datamaskininnhold som er realisert i et aggregat. @no
toolkit label: bidragsyter til datamaskininnhold (familie) @no
toolkit definition: En familie som er en bidragsyter til aggregat som skaper datamaskininnhold som er realisert i et aggregat. @no
label: a pour famille contributrice de contenu informatique @fr
definition: Met une manifestation en relation avec une famille contributrice à un agrégat qui crée une expression d’un contenu informatique matérialisée par un agrégat. @fr
toolkit label: famille contributrice de contenu informatique @fr
toolkit definition: Famille contributrice à un agrégat qui crée une expression d’un contenu informatique matérialisée par un agrégat. @fr
label: heeft bijdrage-familie van computercontent @nl
definition: Relateert een manifestatie aan een familie die een bijdrager aan aggregaat is die expressie van computercontent creëert die is verwezenlijkt in een aggregaat. @nl
toolkit label: bijdrage-familie van computercontent @nl
toolkit definition: Een familie die een bijdrager aan aggregaat is die expressie van computercontent creëert die is verwezenlijkt in een aggregaat. @nl
label: له عائلة مساهمة بمحتوى كمبيوتر @ar
definition: يربط بين تجسيدة وعائلة مساهمة في عمل تجميعي ينشيء محتوى كمبيوتر يتجسد في تجميعية. @ar
toolkit label: عائلة مساهمة بمحتوى كمبيوتر @ar
toolkit definition: عائلة مساهمة في عمل تجميعي ينشيء محتوى كمبيوتر يتجسد في تجميعية. @ar
label: té com a família contribuïdora de contingut informàtic @ca
definition: Relaciona una manifestació amb una família que és un contribuïdor a un agregat que crea una expressió de contingut informàtic que es materialitza en un agregat. @ca
toolkit label: família contribuïdora de contingut informàtic @ca
toolkit definition: Família que és un contribuïdor a un agregat que crea una expressió de contingut informàtic que es materialitza en un agregat. @ca
label: har familie, som er bidragsyder til computerindhold @da
definition: Relaterer en manifestation til en familie, som er bidragsyder til samling, som skaber computerindhold, der er indeholdt i en samling. @da
toolkit label: familie, som er bidragsyder til computerindhold @da
toolkit definition: Familie, som er bidragsyder til samling, som skaber computerindhold, der er indeholdt i en samling. @da
label: digisisu kaastööline (perekond) @et
definition: Seostab kehastuse perekonnaga, kes on liitumi kaastööline, luues digisisu väljenduse, mis on teostatud liitumis. @et
toolkit label: digisisu kaastööline (perekond) @et
toolkit definition: Perekond, kes on liitumi kaastööline, luues digisisu väljenduse, mis on teostatud liitumis. @et
label: hat Beiträgerin/Beiträger von Computer Content (Familie) @de
definition: Setzt eine Manifestation in Beziehung zu einer Beiträgerin/einem Beiträger zu einem Aggregat (Familie), die/der eine Expression von Computer Content erstellt, die durch ein Aggregat verkörpert wird. @de
toolkit label: Beiträgerin/Beiträger von Computer Content (Familie) @de
toolkit definition: Eine Beiträgerin/Ein Beiträger zu einem Aggregat (Familie), die/der eine Expression von Computer Content erstellt, die durch ein Aggregat verkörpert wird. @de
label: számítógépes tartalom közreműködő családja a következő: @hu
definition: Hozzákapcsol egy megjelenési formát egy családhoz, amely aggregátor közreműködőként egy számítógépes tartalom olyan kifejezési formáját hozza létre, amely egy aggregátumban testesül meg. @hu
toolkit label: számítógépes tartalom közreműködő családja: @hu
toolkit definition: Egy család, amely aggregátor közreműködőként egy számítógépes tartalom olyan kifejezési formáját hozza létre, amely egy aggregátumban testesül meg. @hu
label: ha come contributore di contenuto informatico famiglia @it
definition: Correla una manifestazione alla famiglia contributrice a un aggregato che crea un contenuto informatico materializzato in un aggregato. @it
toolkit label: contributore di contenuto informatico famiglia @it
toolkit definition: Famiglia contributore a un aggregato che crea un contenuto informatico, materializzato in un aggregato. @it
label: datororientēta satura līdzradītājs (dzimta/ģimene) @lv
definition: Sasaista manifestāciju ar dzimtu/ģimeni, kas ir līdzradītājs, kas radījusi apkopojumā ietverto datororientēto saturu. @lv
toolkit label: datororientēta satura līdzradītājs (dzimta/ģimene) @lv
toolkit definition: Dzimta/ģimene - līdzradītājs, kas radījusi apkopojumā ietverto datororientēto saturu. @lv
label: 有计算机内容的贡献者家族 @zh-hans
definition: 将一种载体表现与作为合集的一个贡献者并创建被一种合集具体化的一种计算机内容的一种内容表达的一个家族关联起来。 @zh-hans
toolkit label: 计算机内容的贡献者家族 @zh-hans
toolkit definition: 作为合集的一个贡献者并创建被一种合集具体化的一种计算机内容的一种内容表达的一个家族 @zh-hans
label: bilgisayar içeriğine katkıda bulunan aile ile ilişkilidir @tr
definition: Bir gösterimi, bütün tarafından somutlaştırılmış bilgisayar içeriğinin ifadesini yaratan bütüne katkı sağlamış aileyle ilişkilendirir. @tr
toolkit label: bilgisayar içeriğine katkıda bulunan aile @tr
toolkit definition: Topluluk tarafından somutlaştırılmış bilgisayar içeriğinin anlatımını yaratan toplayana katkı sağlayan bir aile. @tr
label: tiene familia contribuidora de contenido por computadora @es
definition: Relaciona una manifestación con una familia que es contribuidora a un agregado quien crea una expresión de contenido por computadora que es materializada por un agregado. @es
toolkit label: familia contribuidora de contenido por computadora @es
toolkit definition: Una familia que es contribuidora a un agregado quien crea una expresión de contenido por computadora que es materializada por un agregado. @es
has subproperty: P30433

has contributor family of moving image
status: Published
lexical alias: contributorFamilyOfMovingImage.en
definition: Relates a manifestation to a family who is a contributor to aggregate who creates an expression of a moving image work that is embodied by an aggregate.
toolkit label: contributor family of moving image
toolkit definition: A family who is a contributor to aggregate who creates an expression of a moving image work that is embodied by an aggregate.
type: Property
domain: C10007
has element type: 2
sub property of: has contributor family to aggregate
sub property of: has contributor collective agent of moving image
label: liikkuvaan kuvaan osallinen suku @fi
definition: Liittää manifestaation aggregaattiin osalliseen sukuun, joka on luonut aggregaattiin sisältyvän liikkuvan kuvan teoksen ekspression. @fi
toolkit label: liikkuvaan kuvaan osallinen suku @fi
toolkit definition: Aggregaattiin osallinen suku, joka on luonut aggregaattiin sisältyvän liikkuvan kuvan teoksen ekspression. @fi
label: har bidragsyter til levende bilder (familie) @no
definition: Relaterer en manifestasjon til en familie som er en bidragsyter til aggregat som skaper et verk med levende bilder som er realisert i et aggregat. @no
toolkit label: bidragsyter til levende bilder (familie) @no
toolkit definition: En familie som er en bidragsyter til aggregat som skaper et verk med levende bilder som er realisert i et aggregat. @no
label: a pour famille contributrice d’images animées @fr
definition: Met une manifestation en relation avec une famille contributrice à un agrégat qui crée une expression d’une œuvre d’images animées matérialisée par un agrégat. @fr
toolkit label: famille contributrice d’images animées @fr
toolkit definition: Famille contributrice à un agrégat qui crée une expression d’une œuvre d’images animées matérialisée par un agrégat. @fr
label: heeft bijdrage-familie van bewegend beeld @nl
definition: Relateert een manifestatie aan een familie die een bijdrager aan aggregaat is die een expressie van een bewegend beeldwerk creëert die is verwezenlijkt in een aggregaat. @nl
toolkit label: bijdrage-familie van bewegend beeld @nl
toolkit definition: Een familie die een bijdrager aan aggregaat is die een expressie van een bewegend beeldwerk creëert die is verwezenlijkt in een aggregaat. @nl
label: له عائلة مساهمة بصور متحركة @ar
definition: يربط بين تجسيدة وعائلة مساهمة في عمل تجميعي ينشيء عمل من صور متحركة يتجسد في تجميعية. @ar
toolkit label: عائلة مساهمة بصور متحركة @ar
toolkit definition: عائلة مساهمة في عمل تجميعي ينشيء عمل من صور متحركة يتجسد في تجميعية. @ar
label: té com a família contribuïdora d’imatge en moviment @ca
definition: Relaciona una manifestació amb una família que és un contribuïdor a un agregat que crea una expressió d’una obra d’imatge en moviment que es materialitza en un agregat. @ca
toolkit label: família contribuïdora d’imatge en moviment @ca
toolkit definition: Família que és un contribuïdor a un agregat que crea una expressió d’una obra d’imatge en moviment que es materialitza en un agregat. @ca
label: har familie, som er bidragsyder til levende billede @da
definition: Relaterer en manifestation til en familie, som er bidragsyder til samling, som skaber et værk med levende billeder, der er indeholdt i en samling. @da
toolkit label: familie, som er bidragsyder til levende billede @da
toolkit definition: Familie, som er bidragsyder til samling, som skaber et værk med levende billeder, der er indeholdt i en samling. @da
label: kaastööline liikuva pildi alal (perekond) @et
definition: Seostab kehastuse perekonnaga, kes on liitumi kaastööline, luues liikuvast pildist koosneva teose väljenduse, mis on teostatud liitumis. @et
toolkit label: kaastööline liikuva pildi alal (perekond) @et
toolkit definition: Perekond, kes on liitumi kaastööline, luues liikuvast pildist koosneva teose väljenduse, mis on teostatud liitumis. @et
label: hat Beiträgerin/Beiträger von einem Bewegtbild (Familie) @de
definition: Setzt eine Manifestation in Beziehung zu einer Beiträgerin/einem Beiträger zu einem Aggregat (Familie), die/der eine Expression eines Bewegtbildwerks erstellt, die durch ein Aggregat verkörpert wird. @de
toolkit label: Beiträgerin/Beiträger von einem Bewegtbild (Familie) @de
toolkit definition: Eine Beiträgerin/Ein Beiträger zu einem Aggregat (Familie), die/der eine Expression eines Bewegtbildwerks erstellt, die durch ein Aggregat verkörpert wird. @de
label: mozgókép közreműködő családja a következő: @hu
definition: Hozzákapcsol egy megjelenési formát egy családhoz, amely aggregátor közreműködőként egy mozgóképmű olyan kifejezési formáját hozza létre, amely egy aggregátumban testesül meg. @hu
toolkit label: mozgókép közreműködő családja: @hu
toolkit definition: Egy család, amely aggregátor közreműködőként egy mozgóképmű olyan kifejezési formáját hozza létre, amely egy aggregátumban testesül meg. @hu
label: ha come contributore di immagini in movimento famiglia @it
definition: Correla una manifestazione alla famiglia contributrice a un aggregato che crea un'opera di immagini in movimento, materializzata in un aggregato. @it
toolkit label: contributore di immagini in movimento famiglia @it
toolkit definition: Famiglia contributore a un aggregato che crea un'opera di immagini in movimento, materializzata in un aggregato. @it
label: kustīga attēla līdzradītājs (dzimta/ģimene) @lv
definition: Sasaista manifestāciju ar dzimtu/ģimeni, kas ir līdzradītājs, kas radījusi apkopojumā ietverto kustīgā attēla darbu. @lv
toolkit label: kustīga attēla līdzradītājs (dzimta/ģimene) @lv
toolkit definition: Dzimta/ģimene - līdzradītājs, kas radījusi apkopojumā ietverto kustīgā attēla darbu. @lv
label: 有动态图像的贡献者家族 @zh-hans
definition: 将一种载体表现与作为合集的一个贡献者并创建被一种合集具体化的一种动态图像作品的一种内容表达的一个家族关联起来。 @zh-hans
toolkit label: 动态图像的贡献者家族 @zh-hans
toolkit definition: 作为合集的一个贡献者并创建被一种合集具体化的一种动态图像作品的一种内容表达的一个家族 @zh-hans
label: hareketli görüntüye katkıda bulunan aile ile ilişkilidir @tr
definition: Bir gösterimi, bütün tarafından somutlaştırılmış hareketli görüntü eserinin ifadesini yaratan bütünün katkıcısı ailesiyle ilişkilendirir. @tr
toolkit label: hareketli̇ görüntüye katkıda bulunan aile @tr
toolkit definition: Topluluk tarafından somutlaştırılmış hareketli görüntü eserinin anlatımını yaratan toplayana katkı sağlayan bir aile. @tr
label: tiene familia contribuidora de imagen en movimiento @es
definition: Relaciona una manifestación con una familia que es contribuidora a un agregado quien crea una expresión de una obra de imagen en movimiento que es materializada por un agregado. @es
toolkit label: familia contribuidora de imagen en movimiento @es
toolkit definition: Una familia que es contribuidora a un agregado quien crea una expresión de una obra de imagen en movimiento que es materializada por un agregado. @es
has subproperty: P30427

has contributor family of music
status: Published
lexical alias: contributorFamilyOfMusic.en
definition: Relates a manifestation to a family who is a contributor to aggregate who creates an expression of a musical work that is embodied by an aggregate.
toolkit label: contributor family of music
toolkit definition: A family who is a contributor to aggregate who creates an expression of a musical work that is embodied by an aggregate.
type: Property
domain: C10007
has element type: 2
sub property of: has contributor family to aggregate
sub property of: has contributor collective agent of music
label: musiikkiin osallinen suku @fi
definition: Liittää manifestaation aggregaattiin osalliseen sukuun, joka on luonut aggregaattiin sisältyvän musiikkiteoksen ekspression. @fi
toolkit label: musiikkiin osallinen suku @fi
toolkit definition: Aggregaattiin osallinen suku, joka on luonut aggregaattiin sisältyvän musiikkiteoksen ekspression. @fi
label: har bidragsyter til musikk (familie) @no
definition: Relaterer en manifestasjon til en familie som er en bidragsyter til aggregat som skaper et musikalsk verk som er realisert i et aggregat. @no
toolkit label: bidragsyter til musikk (familie) @no
toolkit definition: En familie som er en bidragsyter til aggregat som skaper et musikalsk verk som er realisert i et aggregat. @no
label: a pour famille contributrice de musique @fr
definition: Met une manifestation en relation avec une famille contributrice à un agrégat qui crée une expression d’une œuvre musicale matérialisée par un agrégat. @fr
toolkit label: famille contributrice de musique @fr
toolkit definition: Famille contributrice à un agrégat qui crée une expression d’une œuvre musicale matérialisée par un agrégat. @fr
label: heeft bijdrage-familie van muziek @nl
definition: Relateert een manifestatie aan een familie die een bijdrager aan aggregaat is die een expressie van een muziekwerk creëert die is verwezenlijkt in een aggregaat. @nl
toolkit label: bijdrage-familie van muziek @nl
toolkit definition: Een familie die een bijdrager aan aggregaat is die een expressie van een muziekwerk creëert die is verwezenlijkt in een aggregaat. @nl
label: له عائلة مساهمة بموسيقى @ar
definition: يربط بين تجسيدة وعائلة مساهمة في عمل تجميعي بإنشاء عمل موسيقي يتجسد في تجميعية. @ar
toolkit label: عائلة مساهمة بموسيقى @ar
toolkit definition: عائلة مساهمة في عمل تجميعي بإنشاء عمل موسيقي يتجسد في تجميعية. @ar
label: té com a família contribuïdora de música @ca
definition: Relaciona una manifestació amb una família que és un contribuïdor a un agregat que crea una expressió d’una obra musical que es materialitza en un agregat. @ca
toolkit label: família contribuïdora de música @ca
toolkit definition: Família que és un contribuïdor a un agregat que crea una expressió d’una obra musical que es materialitza en un agregat. @ca
label: har familie, som er bidragsyder til musik @da
definition: Relaterer en manifestation til en familie, som er bidragsyder til samling, som skaber et musikværk, der er indeholdt i en samling. @da
toolkit label: familie, som er bidragsyder til musik @da
toolkit definition: Familie, som er bidragsyder til samling, som skaber et musikværk, der er indeholdt i en samling. @da
label: muusikaline kaastööline (perekond) @et
definition: Seostab kehastuse perekonnaga, kes on liitumi kaastööline, luues muusikateose väljenduse, mis on teostatud liitumis. @et
toolkit label: muusikaline kaastööline (perekond) @et
toolkit definition: Perekond, kes on liitumi kaastööline, luues muusikateose väljenduse, mis on teostatud liitumis. @et
label: hat Beiträgerin/Beiträger einer Musik (Familie) @de
definition: Setzt eine Manifestation in Beziehung zu einer Beiträgerin/einem Beiträger zu einem Aggregat (Familie), die/der eine Expression eines Musikwerks erstellt, die durch ein Aggregat verkörpert wird. @de
toolkit label: Beiträgerin/Beiträger einer Musik (Familie) @de
toolkit definition: Eine Beiträgerin/Ein Beiträger zu einem Aggregat (Familie), die/der eine Expression eines Musikwerks erstellt, die durch ein Aggregat verkörpert wird. @de
label: zene közreműködő családja a következő: @hu
definition: Hozzákapcsol egy megjelenési formát egy családhoz, amely aggregátor közreműködőként egy zenemű olyan kifejezési formáját hozza létre, amely egy aggregátumban testesül meg. @hu
toolkit label: zene közreműködő családja @hu
toolkit definition: Egy család, amely aggregátor közreműködőként egy zenemű olyan kifejezési formáját hozza létre, amely egy aggregátumban testesül meg. @hu
label: ha come contributore di musica famiglia @it
definition: Correla una manifestazione alla famiglia contributrice a un aggregato che crea un'opera musicale, materializzata in un aggregato. @it
toolkit label: contributore di musica famiglia @it
toolkit definition: Famiglia contributore a un aggregato che crea un'opera musicale, materializzata in un aggregato. @it
label: mūzikas līdzradītājs (dzimta/ģimene) @lv
definition: Sasaista manifestāciju ar dzimtu/ģimeni, kas ir līdzradītājs, kas radījusi apkopojumā ietverto mūzikas darbu. @lv
toolkit label: mūzikas līdzradītājs (dzimta/ģimene) @lv
toolkit definition: Dzimta/ģimene - līdzradītājs, kas radījusi apkopojumā ietverto mūzikas darbu. @lv
label: 有音乐的贡献者家族 @zh-hans
definition: 将一种载体表现与作为合集的一个贡献者并创建被一种合集具体化的一种音乐作品的一种内容表达的一个家族关联起来。 @zh-hans
toolkit label: 音乐的贡献者家族 @zh-hans
toolkit definition: 作为合集的一个贡献者并创建被一种合集具体化的一种音乐作品的一种内容表达的一个家族 @zh-hans
label: müziğe katkıda bulunan aile ile ilişkilidir @tr
definition: Bir gösterimi, bütün tarafından somutlaştırılmış müzikal eserin ifadesini yaratan bütünün katkıcı ailesiyle ilişkilendirir. @tr
toolkit label: müzi̇ğe katkıda bulunan aile @tr
toolkit definition: topluluk tarafından somutlaştırılmış müzikal eserin anlatımını yaratan toplayana katkı sağlayan bir aile. @tr
label: tiene familia contribuidora de música @es
definition: Relaciona una manifestación con una familia que es contribuidora a un agregado quien crea una expresión de una obra musical que es materializada por un agregado. @es
toolkit label: familia contribuidora de música @es
toolkit definition: Una familia que es contribuidora a un agregado quien crea una expresión de una obra musical que es materializada por un agregado. @es
has subproperty: P30428

has contributor family of object
status: Published
lexical alias: contributorFamilyOfObject.en
definition: Relates a manifestation to a family who is a contributor to aggregate who creates an expression of an object work that is embodied by an aggregate.
toolkit label: contributor family of object
toolkit definition: A family who is a contributor to aggregate who creates an expression of an object work that is embodied by an aggregate.
type: Property
domain: C10007
has element type: 2
sub property of: has contributor family to aggregate
sub property of: has contributor collective agent of object
label: esineeseen osallinen suku @fi
definition: Liittää manifestaation aggregaattiin osalliseen sukuun, joka on luonut aggregaattiin sisältyvän esineteoksen ekspression. @fi
toolkit label: esineeseen osallinen suku @fi
toolkit definition: Aggregaattiin osallinen suku, joka on luonut aggregaattiin sisältyvän esineteoksen ekspression. @fi
label: har bidragsyter til gjenstand (familie) @no
definition: Relaterer en manifestasjon til en familie som er en bidragsyter til aggregat som skaper et verk som er en gjenstand som er realisert i et aggregat. @no
toolkit label: bidragsyter til gjenstand (familie) @no
toolkit definition: En familie som er en bidragsyter til aggregat som skaper et verk som er en gjenstand som er realisert i et aggregat. @no
label: a pour famille contributrice d’objet @fr
definition: Met une manifestation en relation avec une famille contributrice à un agrégat qui crée une expression d’une œuvre objet matérialisée par un agrégat. @fr
toolkit label: famille contributrice d’objet @fr
toolkit definition: Famille contributrice à un agrégat qui crée une expression d’une œuvre objet matérialisée par un agrégat. @fr
label: heeft bijdrage-familie van object @nl
definition: Relateert een manifestatie aan een familie die een bijdrager aan aggregaat is die een expressie van een objectwerk creëert die is verwezenlijkt in een aggregaat. @nl
toolkit label: bijdrage-familie van object @nl
toolkit definition: Een familie die een bijdrager aan aggregaat is die een expressie van een objectwerk creëert die is verwezenlijkt in een aggregaat. @nl
label: له عائلة مساهمة بكائن @ar
definition: يربط بين تجسيدة وعائلة مساهمة في عمل تجميعي ينشيء عمل شيء ما يتجسد في تجميعية. @ar
toolkit label: عائلة مساهمة بكائن @ar
toolkit definition: عائلة مساهمة في عمل تجميعي ينشيء عمل شيء ما يتجسد في تجميعية. @ar
label: té com a família contribuïdora d’objecte @ca
definition: Relaciona una manifestació amb una família que és un contribuïdor a un agregat que crea una expressió d’una obra d’objecte que es materialitza en un agregat. @ca
toolkit label: família contribuïdora d’objecte @ca
toolkit definition: Família que és un contribuïdor a un agregat que crea una expressió d’una obra d’objecte que es materialitza en un agregat. @ca
label: har familie, som er bidragsyder til objekt @da
definition: Relaterer en manifestation til en familie, som er bidragsyder til samling, som skaber et værk med objekt, der er indeholdt i en samling. @da
toolkit label: familie, som er bidragsyder til objekt @da
toolkit definition: Familie, som er bidragsyder til samling, som skaber et værk med objekt, der er indeholdt i en samling. @da
label: objektiloome kaastööline (perekond) @et
definition: Seostab kehastuse perekonnaga, kes on liitumi kaastööline, luues objektteose väljenduse, mis on teostatud liitumis. @et
toolkit label: objektiloome kaastööline (perekond) @et
toolkit definition: Perekond, kes on liitumi kaastööline, luues objektteose väljenduse, mis on teostatud liitumis. @et
label: hat Beiträgerin/Beiträger von einem Gegenstand (Familie) @de
definition: Setzt eine Manifestation in Beziehung zu einer Beiträgerin/einem Beiträger zu einem Aggregat (Familie), die/der eine Expression eines gegenständlichen Werks erstellt, die durch ein Aggregat verkörpert wird. @de
toolkit label: Beiträgerin/Beiträger von einem Gegenstand (Familie) @de
toolkit definition: Eine Beiträgerin/Ein Beiträger zu einem Aggregat (Familie), die/der eine Expression eines gegenständlichen Werks erstellt, die durch ein Aggregat verkörpert wird. @de
label: tárgy közreműködő családja a következő: @hu
definition: Hozzákapcsol egy megjelenési formát egy családhoz, amely aggregátor közreműködőként egy tárgyi mű olyan kifejezési formáját hozza létre, amely egy aggregátumban testesül meg. @hu
toolkit label: tárgy közreműködő családja: @hu
toolkit definition: Egy család, amely aggregátor közreműködőként egy tárgyi mű olyan kifejezési formáját hozza létre, amely egy aggregátumban testesül meg. @hu
label: ha come contributore di oggetto famiglia @it
definition: Correla una manifestazione alla famiglia contributrice a un aggregato che crea un’opera oggetto, materializzata in un aggregato. @it
toolkit label: contributore di oggetto famiglia @it
toolkit definition: Famiglia contributore a un aggregato che crea un’opera oggetto, materializzata in un aggregato. @it
label: objekta līdzradītājs (dzimta/ģimene) @lv
definition: Sasaista manifestāciju ar dzimtu/ģimeni, kas ir līdzradītājs, kas radījusi apkopojumā ietverto objekta darbu. @lv
toolkit label: objekta līdzradītājs (dzimta/ģimene) @lv
toolkit definition: Dzimta/ģimene - līdzradītājs, kas radījusi apkopojumā ietverto objekta darbu. @lv
label: 有物体的贡献者家族 @zh-hans
definition: 将一种载体表现与作为合集的一个贡献者并创建被一种合集具体化的一种物体作品的一种内容表达的一个家族关联起来。 @zh-hans
toolkit label: 物体的贡献者家族 @zh-hans
toolkit definition: 作为合集的一个贡献者并创建被一种合集具体化的一种物体作品的一种内容表达的一个家族 @zh-hans
label: nesneye katkıda bulunan aile ile ilişkilidir @tr
definition: Bir gösterimi, bütün tarafından somutlaştırılmış nesne eserinin ifadesini yaratan bütüne katkı sağlamış aileyle ilişkilendirir. @tr
toolkit label: nesneye katkıda bulunan aile @tr
toolkit definition: Topluluk tarafından somutlaştırılmış nesne eserinin anlatımını yaratan toplayana katkı sağlayan bir aile. @tr
label: tiene familia contribuidora de objeto @es
definition: Relaciona una manifestación con una familia que es contribuidora a un agregado quien crea una expresión de una obra de objeto que es materializada por un agregado. @es
toolkit label: familia contribuidora de objeto @es
toolkit definition: Una familia que es contribuidora a un agregado quien crea una expresión de una obra de objeto que es materializada por un agregado. @es
has subproperty: P30432

has contributor family of speech
status: Published
lexical alias: contributorFamilyOfSpeech.en
definition: Relates a manifestation to a family who is a contributor to aggregate who creates an expression of a vocal work that is embodied by an aggregate.
toolkit label: contributor family of speech
toolkit definition: A family who is a contributor to aggregate who creates an expression of a vocal work that is embodied by an aggregate.
type: Property
domain: C10007
has element type: 2
sub property of: has contributor family to aggregate
sub property of: has contributor collective agent of speech
label: puheeseen osallinen suku @fi
definition: Liittää manifestaation aggregaattiin osalliseen sukuun, joka on luonut aggregaattiin sisältyvän puheteoksen ekspression. @fi
toolkit label: puheeseen osallinen suku @fi
toolkit definition: Aggregaattiin osallinen suku, joka on luonut aggregaattiin sisältyvän puheteoksen ekspression. @fi
label: har bidragsyter til tale (familie) @no
definition: Relaterer en manifestasjon til en familie som er en bidragsyter til aggregat som skaper et verk av tale som er realisert i et aggregat. @no
toolkit label: bidragsyter til tale (familie) @no
toolkit definition: En familie som er en bidragsyter til aggregat som skaper et verk av tale som er realisert i et aggregat. @no
label: a pour famille contributrice de contenu vocal @fr
definition: Met une manifestation en relation avec une famille contributrice à un agrégat qui crée une expression d’une œuvre vocale matérialisée par un agrégat. @fr
toolkit label: famille contributrice de contenu vocal @fr
toolkit definition: Famille contributrice à un agrégat qui crée une expression d’une œuvre vocale matérialisée par un agrégat. @fr
label: heeft bijdrage-familie van spraak @nl
definition: Relateert een manifestatie aan een familie die een bijdrager aan aggregaat is die een expressie van een vocaal werk creëert die is verwezenlijkt in een aggregaat. @nl
toolkit label: bijdrage-familie van spraak @nl
toolkit definition: Een familie die een bijdrager aan aggregaat is die een expressie van een vocaal werk creëert die is verwezenlijkt in een aggregaat. @nl
label: له عائلة مساهمة بحديث @ar
definition: يربط بين تجسيدة وعائلة مساهمة في عمل تجميعي ينشيء عمل من كلمات منطوقة يتجسد في تجميعية. @ar
toolkit label: عائلة مساهمة بحديث @ar
toolkit definition: عائلة مساهمة في عمل تجميعي ينشيء عمل من كلمات منطوقة يتجسد في تجميعية. @ar
label: té com a família contribuïdora de discurs @ca
definition: Relaciona una manifestació amb una família que és un contribuïdor a un agregat que crea una expressió d’una obra vocal que es materialitza en un agregat. @ca
toolkit label: família contribuïdora de discurs @ca
toolkit definition: Família que és un contribuïdor a un agregat que crea una expressió d’una obra vocal que es materialitza en un agregat. @ca
label: har familie, som er bidragsyder til tale @da
definition: Relaterer en manifestation til en familie, som er bidragsyder til samling, som skaber et værk med talte ord, der er indeholdt i en samling. @da
toolkit label: familie, som er bidragsyder til tale @da
toolkit definition: Familie, som er bidragsyder til samling, som skaber et værk med talte ord, der er indeholdt i en samling. @da
label: kõneloome kaastööline (perekond) @et
definition: Seostab kehastuse perekonnaga, kes on liitumi kaastööline, luues suulise teose väljenduse, mis on teostatud liitumis. @et
toolkit label: kõneloome kaastööline (perekond) @et
toolkit definition: Perekond, kes on liitumi kaastööline, luues suulise teose väljenduse, mis on teostatud liitumis. @et
label: hat Beiträgerin/Beiträger von einer Rede (Familie) @de
definition: Setzt eine Manifestation in Beziehung zu einer Beiträgerin/einem Beiträger zu einem Aggregat (Familie), die/der eine Expression eines gesprochenen Werks erstellt, die durch ein Aggregat verkörpert wird. @de
toolkit label: Beiträgerin/Beiträger von einer Rede (Familie) @de
toolkit definition: Eine Beiträgerin/Ein Beiträger zu einem Aggregat (Familie), die/der eine Expression eines gesprochenen Werks erstellt, die durch ein Aggregat verkörpert wird. @de
label: beszéd közreműködő családja a következő: @hu
definition: Hozzákapcsol egy megjelenési formát egy családhoz, amely aggregátor közreműködőként egy beszédmű olyan kifejezési formáját hozza létre, amely egy aggregátumban testesül meg. @hu
toolkit label: beszéd közreműködő családja @hu
toolkit definition: Egy család, amely aggregátor közreműködőként egy beszédmű olyan kifejezési formáját hozza létre, amely egy aggregátumban testesül meg. @hu
label: ha come contributore di discorso famiglia @it
definition: Correla una manifestazione alla famiglia contributrice a un aggregato che crea un'opera parlata materializzata in un aggregato. @it
toolkit label: contributore di discorso famiglia @it
toolkit definition: Famiglia contributore a un aggregato che crea un'opera parlata, materializzata in un aggregato. @it
label: runas līdzradītājs (dzimta/ģimene) @lv
definition: Sasaista manifestāciju ar dzimtu/ģimeni, kas ir līdzradītājs, kas radījusi apkopojumā ietverto mutvārdu darbu. @lv
toolkit label: runas līdzradītājs (dzimta/ģimene) @lv
toolkit definition: Dzimta/ģimene - līdzradītājs, kas radījusi apkopojumā ietverto mutvārdu darbu. @lv
label: 有讲话的贡献者家族 @zh-hans
definition: 将一种载体表现与作为合集的一个贡献者并创建被一种合集具体化的一种人声作品的一种内容表达的一个家族关联起来。 @zh-hans
toolkit label: 讲话的贡献者家族 @zh-hans
toolkit definition: 作为合集的一个贡献者并创建被一种合集具体化的一种人声作品的一种内容表达的一个家族 @zh-hans
label: konuşmaya katkıda bulunan aile ile ilişkilidir @tr
definition: Bir gösterimi, bütün tarafından somutlaştırılmış sözlü eserin ifadesini yaratan bütüne katkı sağlayan aileyle ilişkilendirir. @tr
toolkit label: konuşmaya katkıda bulunan aile @tr
toolkit definition: topluluk tarafından somutlaştırılmış sözlü eserin anlatımını yaratan toplayana katkı sağlayan bir aile. @tr
label: tiene familia contribuidora de @es
definition: Relaciona una manifestación con una familia que es contribuidora a un agregado quien crea una expresión de una obra vocal que es materializada por un agregado. @es
toolkit label: familia contribuidora de @es
toolkit definition: Una familia que es contribuidora a un agregado quien crea una expresión de una obra vocal que es materializada por un agregado. @es
has subproperty: P30429

has contributor family of still image
status: Published
lexical alias: contributorFamilyOfStillImage.en
definition: Relates a manifestation to a family who is a contributor to aggregate who creates an expression of a still image work that is embodied by an aggregate.
toolkit label: contributor family of still image
toolkit definition: A family who is a contributor to aggregate who creates an expression of a still image work that is embodied by an aggregate.
type: Property
domain: C10007
has element type: 2
sub property of: has contributor family to aggregate
sub property of: has contributor collective agent of still image
label: stillkuvaan osallinen suku @fi
definition: Liittää manifestaation aggregaattiin osalliseen sukuun, joka on luonut aggregaattiin sisältyvän stillkuvateoksen ekspression. @fi
toolkit label: stillkuvaan osallinen suku @fi
toolkit definition: Aggregaattiin osallinen suku, joka on luonut aggregaattiin sisältyvän stillkuvateoksen ekspression. @fi
label: har bidragsyter til bilde (familie) @no
definition: Relaterer en manifestasjon til en familie som er en bidragsyter til aggregat som skaper et bildeverk som er realisert i et aggregat. @no
toolkit label: bidragsyter til bilde (familie) @no
toolkit definition: En familie som er en bidragsyter til aggregat som skaper et bildeverk som er realisert i et aggregat. @no
label: a pour famille contributrice d’image fixe @fr
definition: Met une manifestation en relation avec une famille contributrice à un agrégat qui crée une expression d’une œuvre d’image fixe matérialisée par un agrégat. @fr
toolkit label: famille contributrice d’image fixe @fr
toolkit definition: Famille contributrice à un agrégat qui crée une expression d’une œuvre d’image fixe matérialisée par un agrégat. @fr
label: heeft bijdrage-familie van stilstaand beeld @nl
definition: Relateert een manifestatie aan een familie die een bijdrager aan aggregaat is die een expressie van een stilstaand beeldwerk creëert dat is verwezenlijkt in een aggregaat. @nl
toolkit label: bijdrage-familie van stilstaand beeld @nl
toolkit definition: Een familie die een bijdrager aan aggregaat is die een expressie van een stilstaand beeldwerk creëert dat is verwezenlijkt in een aggregaat. @nl
label: له عائلة مساهمة بصور ثابتة @ar
definition: يربط بين تجسيدة وعائلة مساهمة في عمل تجميعي ينشيء عمل من صور ثابتة يتجسد في تجميعية. @ar
toolkit label: عائلة مساهمة بصور ثابتة @ar
toolkit definition: عائلة مساهمة في عمل تجميعي ينشيء عمل من صور ثابتة يتجسد في تجميعية. @ar
label: té com a família contribuïdora d’imatge fixa @ca
definition: Relaciona una manifestació amb una família que és un contribuïdor a un agregat que crea una expressió d’una obra d’imatge fixa que es materialitza en un agregat. @ca
toolkit label: família contribuïdora d’imatge fixa @ca
toolkit definition: Família que és un contribuïdor a un agregat que crea una expressió d’una obra d’imatge fixa que es materialitza en un agregat. @ca
label: har familie, som er bidragsyder til stillbillede @da
definition: Relaterer en manifestation til en familie, som er bidragsyder til samling, som skaber et værk med stillbilleder, der er indeholdt i en samling. @da
toolkit label: familie, som er bidragsyder til stillbillede @da
toolkit definition: Familie, som er bidragsyder til samling, som skaber et værk med stillbilleder, der er indeholdt i en samling. @da
label: kaastööline liikumatu pildi alal (perekond) @et
definition: Seostab kehastuse perekonnaga, kes on liitumi kaastööline, luues liikumatust pildist koosneva teose väljenduse, mis on teostatud liitumis. @et
toolkit label: kaastööline liikumatu pildi alal (perekond) @et
toolkit definition: Perekond, kes on liitumi kaastööline, luues liikumatust pildist koosneva teose väljenduse, mis on teostatud liitumis. @et
label: hat Illustratorin/Illustrator (Familie) @de
definition: Setzt eine Manifestation in Beziehung zu einer Beiträgerin/einem Beiträger zu einem Aggregat (Familie), die/der eine Expression eines unbewegten Bildwerks erstellt, die durch ein Aggregat verkörpert wird. @de
toolkit label: Illustratorin/Illustrator (Familie) @de
toolkit definition: Eine Beiträgerin/Ein Beiträger zu einem Aggregat (Familie), die/der eine Expression eines unbewegten Bildwerks erstellt, die durch ein Aggregat verkörpert wird. @de
label: állókép közreműködő családja a következő: @hu
definition: Hozzákapcsol egy megjelenési formát egy családhoz, amely aggregátor közreműködőként egy állóképmű olyan kifejezési formáját hozza létre, amely egy aggregátumban testesül meg. @hu
toolkit label: állókép közreműködő családja: @hu
toolkit definition: Egy család, amely aggregátor közreműködőként egy állóképmű olyan kifejezési formáját hozza létre, amely egy aggregátumban testesül meg. @hu
label: ha come contributore di immagini fisse famiglia @it
definition: Correla una manifestazione alla famiglia contributrice a un aggregato che crea un'opera di immagini fisse materializzata in un aggregato. @it
toolkit label: contributore di immagini fisse famiglia @it
toolkit definition: Famiglia contributore a un aggregato che crea un'opera di immagini fisse materializzata in un aggregato. @it
label: attēla līdzradītājs (dzimta/ģimene) @lv
definition: Sasaista manifestāciju ar dzimtu/ģimeni, kas ir līdzradītājs, kas radījusi apkopojumā ietverto attēla darbu. @lv
toolkit label: attēla līdzradītājs (dzimta/ģimene) @lv
toolkit definition: Dzimta/ģimene - līdzradītājs, kas radījusi apkopojumā ietverto attēla darbu. @lv
label: 有静态图像的贡献者家族 @zh-hans
definition: 将一种载体表现与作为合集的一个贡献者并创建被一种合集具体化的一种静态图像作品的一种内容表达的一个家族关联起来。 @zh-hans
toolkit label: 静态图像的贡献者家族 @zh-hans
toolkit definition: 作为合集的一个贡献者并创建被一种合集具体化的一种静态图像作品的一种内容表达的一个家族 @zh-hans
label: durağan görüntüye katkıda bulunan aile ile ilişkilidir @tr
definition: Bir gösterimi, bütün tarafından somutlaştırılmış hareketsiz görünütünün ifadesini yaratan bütüne katkı sağlamış aileyle ilişkilendirir. @tr
toolkit label: hareketsiz görüntüye katkıda bulunan aile @tr
toolkit definition: Topluluk tarafından somutlaştırılmış durağan görünütünün anlatımını yaratan toplayana katkı sağlayan bir aile. @tr
label: tiene familia contribuidora de imagen fija @es
definition: Relaciona una manifestación con una familia que es contribuidora a un agregado quien crea una expresión de una obra de imagen fija que es materializada por un agregado. @es
toolkit label: familia contribuidora de imagen fija @es
toolkit definition: Una familia que es contribuidora a un agregado quien crea una expresión de una obra de imagen fija que es materializada por un agregado. @es
has subproperty: P30430

has contributor family of text
status: Published
lexical alias: contributorFamilyOfText.en
definition: Relates a manifestation to a family who is a contributor to aggregate who creates an expression of a textual work that is embodied by an aggregate.
toolkit label: contributor family of text
toolkit definition: A family who is a contributor to aggregate who creates an expression of a textual work that is embodied by an aggregate.
type: Property
domain: C10007
has element type: 2
sub property of: has contributor family to aggregate
sub property of: has contributor collective agent of text
label: tekstiin osallinen suku @fi
definition: Liittää manifestaation aggregaattiin osalliseen sukuun, joka on luonut aggregaattiin sisältyvän tekstiteoksen ekspression. @fi
toolkit label: tekstiin osallinen suku @fi
toolkit definition: Aggregaattiin osallinen suku, joka on luonut aggregaattiin sisältyvän tekstiteoksen ekspression. @fi
label: har bidragsyter til tekst (familie) @no
definition: Relaterer en manifestasjon til en familie som er en bidragsyter til aggregat som skaper et tekstlig verk som er realisert i et aggregat. @no
toolkit label: bidragsyter til tekst (familie) @no
toolkit definition: En familie som er en bidragsyter til aggregat som skaper et tekstlig verk som er realisert i et aggregat. @no
label: a pour famille contributrice de texte @fr
definition: Met une manifestation en relation avec une famille contributrice à un agrégat qui crée une expression d’une œuvre textuelle matérialisée par un agrégat. @fr
toolkit label: famille contributrice de texte @fr
toolkit definition: Famille contributrice à un agrégat qui crée une expression d’une œuvre textuelle matérialisée par un agrégat. @fr
label: heeft bijdrage-familie van tekst @nl
definition: Relateert een manifestatie aan een familie die een bijdrager aan aggregaat is die een expressie van een tekstwerk creëert die is verwezenlijkt in een aggregaat. @nl
toolkit label: bijdrage-familie van tekst @nl
toolkit definition: Een familie die een bijdrager aan aggregaat is die een expressie van een tekstwerk creëert die is verwezenlijkt in een aggregaat. @nl
label: له عائلة مساهمة بنص @ar
definition: يربط بين تجسيدة وعائلة مساهمة في عمل تجميعي ينشيء عمل نصي يتجسد في تجميعية. @ar
toolkit label: عائلة مساهمة بنص @ar
toolkit definition: عائلة مساهمة في عمل تجميعي ينشيء عمل نصي يتجسد في تجميعية. @ar
label: té com a família contribuïdora de text @ca
definition: Relaciona una manifestació amb una família que és un contribuïdor a un agregat que crea una expressió d’una obra textual que es materialitza en un agregat. @ca
toolkit label: família contribuïdora de text @ca
toolkit definition: Família que és un contribuïdor a un agregat que crea una expressió d’una obra textual que es materialitza en un agregat. @ca
label: har familie, som er bidragsyder til tekst @da
definition: Relaterer en manifestation til en familie, som er bidragsyder til samling, som skaber et tekstværk, der er indeholdt i en samling. @da
toolkit label: familie, som er bidragsyder til tekst @da
toolkit definition: Familie, som er bidragsyder til samling, som skaber et tekstværk, der er indeholdt i en samling. @da
label: tekstiloome kaastööline (perekond) @et
definition: Seostab kehastuse perekonnaga, kes on liitumi kaastööline, luues tekstteose väljenduse, mis on teostatud liitumis. @et
toolkit label: tekstiloome kaastööline (perekond) @et
toolkit definition: Perekond, kes on liitumi kaastööline, luues tekstteose väljenduse, mis on teostatud liitumis. @et
label: hat Beiträgerin/Beiträger von ergänzendem Text (Familie) @de
definition: Setzt eine Manifestation in Beziehung zu einer Beiträgerin/einem Beiträger zu einem Aggregat (Familie), die/der eine Expression eines textlichen Werks erstellt, die durch ein Aggregat verkörpert wird. @de
toolkit label: Beiträgerin/Beiträger von ergänzendem Text (Familie) @de
toolkit definition: Eine Beiträgerin/Ein Beiträger zu einem Aggregat (Familie), die/der eine Expression eines textlichen Werks erstellt, die durch ein Aggregat verkörpert wird. @de
label: szöveg közreműködő családja a következő: @hu
definition: Hozzákapcsol egy megjelenési formát egy családhoz, amely aggregátor közreműködőként egy szöveges mű olyan kifejezési formáját hozza létre, amely egy aggregátumban testesül meg. @hu
toolkit label: szöveg közreműködő családja: @hu
toolkit definition: Egy család, amely aggregátor közreműködőként egy szöveges mű olyan kifejezési formáját hozza létre, amely egy aggregátumban testesül meg. @hu
label: ha come contributore di testo famiglia @it
definition: Correla una manifestazione alla famiglia contributrice a un aggregato che crea un'opera testuale materializzata in un aggregato. @it
toolkit label: contributore di testo famiglia @it
toolkit definition: Famiglia contributore a un aggregato che crea un'opera testuale, materializzata in un aggregato. @it
label: teksta līdzradītājs (dzimta/ģimene) @lv
definition: Sasaista manifestāciju ar dzimtu/ģimeni, kas ir līdzradītājs, kas radījusi apkopojumā ietverto teksta darbu. @lv
toolkit label: teksta līdzradītājs (dzimta/ģimene) @lv
toolkit definition: Dzimta/ģimene - līdzradītājs, kas radījusi apkopojumā ietverto teksta darbu. @lv
label: 有文本的贡献者家族 @zh-hans
definition: 将一种载体表现与作为合集的一个贡献者并创建被一种合集具体化的一种文字作品的一种内容表达的一个家族关联起来。 @zh-hans
toolkit label: 文本的贡献者家族 @zh-hans
toolkit definition: 作为合集的一个贡献者并创建被一种合集具体化的一种文字作品的一种内容表达的一个家族 @zh-hans
label: metne katkıda bulunan aile ile ilişkilidir @tr
definition: Bir gösterimi, bütün tarafından somutlaştırılmış metinsel eserin ifadesini yaratan bütüne katkı sağlamış aileyle ilişkilendirir. @tr
toolkit label: metne katkıda bulunan aile @tr
toolkit definition: Topluluk tarafından somutlaştırılmış metinsel eserin anlatımını yaratan toplayana katkı sağlayan bir aile. @tr
label: tiene familia contribuidora de texto @es
definition: Relaciona una manifestación con una familia que es contribuidora a un agregado quien crea una expresión de una obra textual que es materializada por un agregado. @es
toolkit label: familia contribuidora de texto @es
toolkit definition: Una familia que es contribuidora a un agregado quien crea una expresión de una obra textual que es materializada por un agregado. @es
has subproperty: P30431

has contributor family to aggregate
status: Published
lexical alias: contributorFamilyToAggregate.en
definition: Relates a manifestation to a family who is responsible for creating an expression of a work that is embodied by an aggregate.
toolkit label: contributor family to aggregate
toolkit definition: A family who is responsible for creating an expression of a work that is embodied by an aggregate.
type: Property
domain: C10007
has element type: 2
sub property of: has related family of manifestation
sub property of: has contributor collective agent to aggregate
label: aggregaattiin osallinen suku @fi
definition: Liittää manifestaation sukuun, joka on vastuussa aggregaattiin sisältyvän teoksen ekspression luomisesta. @fi
toolkit label: aggregaattiin osallinen suku @fi
toolkit definition: Suku, joka on vastuussa aggregaattiin sisältyvän teoksen ekspression luomisesta. @fi
label: har bidragsyter til aggregat (familie) @no
definition: Relaterer en manifestasjon til en familie som skaper et verk som er realisert i et aggregat. @no
toolkit label: bidragsyter til aggregat (familie) @no
toolkit definition: En familie som skaper et verk som er realisert i et aggregat. @no
label: a pour famille contributrice à un agrégat @fr
definition: Met une manifestation en relation avec une famille qui est responsable de la création d’une expression d’une œuvre matérialisée par un agrégat. @fr
toolkit label: famille contributrice à un agrégat @fr
toolkit definition: Famille qui est responsable de la création d’une expression d’une œuvre matérialisée par un agrégat. @fr
label: heeft bijdrage-familie aan aggregaat @nl
definition: Relateert een manifestatie aan een familie die verantwoordelijk is voor het creëren van een expressie van een werk die is verwezenlijkt in een aggregaat. @nl
toolkit label: bijdrage-familie aan aggregaat @nl
toolkit definition: Een familie die verantwoordelijk is voor het creëren van een expressie van een werk die is verwezenlijkt in een aggregaat. @nl
label: له عائلة مساهمة في تجميعة @ar
definition: يربط بين تجسيدة وعائلة تنشئ عمل يتجسد في تجميعية. @ar
toolkit label: عائلة مساهمة في تجميعة @ar
toolkit definition: عائلة تنشئ عمل يتجسد في تجميعية. @ar
label: té com a família contribuïdora a un agregat @ca
definition: Relaciona una manifestació amb una família que és responsable de la creació d’una expressió d’una obra que es materialitza en un agregat. @ca
toolkit label: família contribuïdora a un agregat @ca
toolkit definition: Família que és responsable de la creació d’una expressió d’una obra que es materialitza en un agregat. @ca
label: har familie, som er bidragsyder til samling @da
definition: Relaterer en manifestation til en familie, som skaber et værk, der er indeholdt i en samling. @da
toolkit label: familie, som er bidragsyder til samling @da
toolkit definition: Familie, som skaber et værk, der er indeholdt i en samling. @da
label: liitumi kaastööline (perekond) @et
definition: Seostab kehastuse perekonnaga, kes loob teose väljenduse, mis on teostatud liitumis. @et
toolkit label: liitumi kaastööline (perekond) @et
toolkit definition: Perekond, kes loob teose väljenduse, mis on teostatud liitumis. @et
label: hat Beiträgerin/Beiträger zu einem Aggregat (Familie) @de
definition: Setzt eine Manifestation in Beziehung zu einer Familie, die für die Schaffung einer Expression eines Werks verantwortlich ist, die durch ein Aggregat verkörpert wird. @de
toolkit label: Beiträgerin/Beiträger zu einem Aggregat (Familie) @de
toolkit definition: Eine Familie, die für die Schaffung einer Expression eines Werks verantwortlich ist, die durch ein Aggregat verkörpert wird. @de
label: aggregátum közreműködő családja a következő: @hu
definition: Hozzákapcsol egy megjelenési formát egy családhoz, amely egy mű olyan kifejezési formáját hozza létre, amely egy aggregátumban testesül meg. @hu
toolkit label: aggregátum közreműködő családja @hu
toolkit definition: Egy család, amely egy mű olyan kifejezési formáját hozza létre, amely egy aggregátumban testesül meg. @hu
label: ha come contributore a un aggregato famiglia @it
definition: Correla una manifestazione alla famiglia creatrice di un'opera materializzata in un aggregato. @it
toolkit label: contributore a un aggregato famiglia @it
toolkit definition: Famiglia creatore di un'opera materializzata in un aggregato. @it
label: apkopojuma līdzradītājs (dzimta/ģimene) @lv
definition: Sasaista manifestāciju ar dzimtu/ģimeni, kas radījusi apkopojumā ietverto darbu. @lv
toolkit label: apkopojuma līdzradītājs (dzimta/ģimene) @lv
toolkit definition: Dzimta/ģimene, kas radījusi apkopojumā ietverto darbu. @lv
label: 有合集的贡献者家族 @zh-hans
definition: 将一种载体表现与负责创建被一种合集具体化的一种作品的一种内容表达的一个家族关联起来。 @zh-hans
toolkit label: 合集的贡献者家族 @zh-hans
toolkit definition: 负责创建被一种合集具体化的一种作品的一种内容表达的一个家族 @zh-hans
label: toplamaya katkıda bulunan aile ile ilişkilidir @tr
definition: Bir gösterimi, bütün tarafından somutlaştırılmış eserin ifadesini oluşturulmasından sorumlu aileyle ilişkilendirir. @tr
toolkit label: topluluğa katkıda bulunan aile @tr
toolkit definition: Topluluk tarafından somutlaştırılmış eserin anlatımının oluşturulmasından sorumlu aile. @tr
label: tiene familia colaboradora para agregar @es
definition: Relaciona una manifestación con una familia que es responsable de crear una expresión de una obra que es encarnada por un agregado. @es
toolkit label: familia colaboradora para agregar @es
toolkit definition: Una familia que es responsable de crear una expresión de una obra que es encarnada por un agregado. @es
has subproperty: has contributor family of cartography
has subproperty: has contributor family of choreography
has subproperty: has contributor family of computer content
has subproperty: has contributor family of moving image
has subproperty: has contributor family of music
has subproperty: has contributor family of object
has subproperty: has contributor family of speech
has subproperty: has contributor family of still image
has subproperty: has contributor family of text

has contributor person of cartography
status: Published
lexical alias: contributorPersonOfCartography.en
definition: Relates a manifestation to a person who is a contributor to aggregate who creates an expression of a cartographic work that is embodied by an aggregate.
toolkit label: contributor person of cartography
toolkit definition: A person who is a contributor to aggregate who creates an expression of a cartographic work that is embodied by an aggregate.
type: Property
domain: C10007
has element type: 2
sub property of: has contributor person to aggregate
sub property of: has contributor agent of cartography
label: kartografiaan osallinen henkilö @fi
definition: Liittää manifestaation aggregaattiin osalliseen henkilöön, joka on luonut aggregaattiin sisältyvän kartografisen teoksen ekspression. @fi
toolkit label: kartografiaan osallinen henkilö @fi
toolkit definition: Aggregaattiin osallinen henkilö, joka on luonut aggregaattiin sisältyvän kartografisen teoksen ekspression. @fi
label: har bidragsyter til kartografi (person) @no
definition: Relaterer en manifestasjon til en person som er en bidragsyter til aggregat som skaper et kartografisk verk som er realisert i et aggregat. @no
toolkit label: bidragsyter til kartografi (person) @no
toolkit definition: En person som er en bidragsyter til aggregat som skaper et kartografisk verk som er realisert i et aggregat. @no
label: a pour personne contributrice de cartographie @fr
definition: Met une manifestation en relation avec une personne contributrice à un agrégat qui crée une expression d’une œuvre cartographique matérialisée par un agrégat. @fr
toolkit label: personne contributrice de cartographie @fr
toolkit definition: Personne contributrice à un agrégat qui crée une expression d’une œuvre cartographique matérialisée par un agrégat. @fr
label: heeft bijdrage-persoon van cartografie @nl
definition: Relateert een manifestatie aan een persoon die een bijdrager aan aggregaat is die een expressie van een cartografisch werk creëert die is verwezenlijkt in een aggregaat. @nl
toolkit label: bijdrage-persoon van cartografie @nl
toolkit definition: Een persoon die een bijdrager aan aggregaat is die een expressie van een cartografisch werk creëert die is verwezenlijkt in een aggregaat. @nl
label: له شخص مساهم برسم خرائط @ar
definition: يربط بين تجسيدة وشخص مساهم في عمل تجميعي ينشيء عمل خرائطي ويتجسد في تجميعية. @ar
toolkit label: شخص مساهم برسم خرائط @ar
toolkit definition: شخص يساهم في عمل تجميعي ينشيء عمل خرائطي يتجسد في تجميعية. @ar
label: té com a persona contribuïdora de cartografia @ca
definition: Relaciona una manifestació amb una persona que és un contribuïdor a un agregat i que crea una expressió d’una obra cartogràfica que es materialitza en un agregat. @ca
toolkit label: persona contribuïdora de cartografia @ca
toolkit definition: Persona que és un contribuïdor a un agregat i que crea una expressió d’una obra cartogràfica que es materialitza en un agregat. @ca
label: har person, som er bidragsyder til kartografi @da
definition: Relaterer en manifestation til en person, som er bidragsyder til samling, som skaber et kartografisk værk, der er indeholdt i en samling. @da
toolkit label: person, som er bidragsyder til kartografi @da
toolkit definition: Person, som er bidragsyder til samling, som skaber et kartografisk værk, der er indeholdt i en samling. @da
label: kaastööline kartograafia alal (isik) @et
definition: Seostab kehastuse isikuga, kes on liitumi kaastööline, luues kartograafilise teose väljenduse, mis on teostatud liitumis. @et
toolkit label: kaastööline kartograafia alal (isik) @et
toolkit definition: Isik, kes on liitumi kaastööline, luues kartograafilise teose väljenduse, mis on teostatud liitumis. @et
label: hat Beiträgerin/Beiträger von einer Kartografie (Person) @de
definition: Setzt eine Manifestation in Beziehung zu einer Beiträgerin/einem Beiträger zu einem Aggregat (Person), die/der eine Expression eines kartografischen Werks erstellt, die durch ein Aggregat verkörpert wird. @de
toolkit label: Beiträgerin/Beiträger von einer Kartografie (Person) @de
toolkit definition: Eine Beiträgerin/Ein Beiträger zu einem Aggregat (Person), die/der eine Expression eines kartografischen Werks erstellt, die durch ein Aggregat verkörpert wird. @de
label: térképészet közreműködő személye a következő: @hu
definition: Hozzákapcsol egy megjelenési formát egy személyhez, aki egy aggregátum közreműködőjeként egy kartográfiai mű olyan kifejezési formáját hozza létre, amely egy aggregátumban testesül meg. @hu
toolkit label: térképészet közreműködő személye @hu
toolkit definition: Egy személy, aki egy aggregátum közreműködőjeként egy kartográfiai mű olyan kifejezési formáját hozza létre, amely egy aggregátumban testesül meg. @hu
label: ha come contributore di cartografia persona @it
definition: Correla una manifestazione alla persona contributrice a un aggregato che crea un'opera cartografica, materializzata in un aggregato. @it
toolkit label: contributore di cartografia persona @it
toolkit definition: Persona contributrice a un aggregato che crea un'opera cartografica, materializzata in un aggregato. @it
label: kartogrāfijas līdzradītājs (persona) @lv
definition: Sasaista manifestāciju ar personu, kura ir līdzradītājs, kura radījusi apkopojumā ietverto kartogrāfijas darbu. @lv
toolkit label: kartogrāfijas līdzradītājs (persona) @lv
toolkit definition: Persona - līdzradītājs, kura radījusi apkopojumā ietverto kartogrāfijas darbu. @lv
label: 有地图绘制贡献者个人 @zh-hans
definition: 将一种载体表现与作为合集的一个贡献者并创建被一种合集具体化的一种地图作品的一种内容表达的一个个人关联起来。 @zh-hans
toolkit label: 地图绘制贡献者个人 @zh-hans
toolkit definition: 作为合集的一个贡献者并创建被一种合集具体化的一种地图作品的一种内容表达的一个个人 @zh-hans
label: kartografiye katkıda bulunan kişi ile ilişkilidir @tr
definition: Bir gösterimi, bütün tarafından somutlaştırılan bir kartografik çalışmanın öğesini oluşturan bütünün bir parçası olan kişiyle ilişkilendirir. @tr
toolkit label: kartografyaya katkıda bulunan ki̇şi̇ @tr
toolkit definition: Bir topluluk tarafından somutlaştırılan bir kartografik eserin anlatımını oluşturan, topluluğa katkıda bulunan kişi. @tr
label: tiene persona colaboradora de cartografía @es
definition: Relaciona una manifestación con una persona que es colaborador de un agregado que crea una expresión de una obra cartográfica que es plasmada por un agregado. @es
toolkit label: persona colaboradora de cartografía @es
toolkit definition: Una persona que es colaborador de un agregado que crea una expresión de una obra cartográfica que es plasmada por un agregado. @es
has subproperty: has surveyor person
has subproperty: P30338

has contributor person of choreography
status: Published
lexical alias: contributorPersonOfChoreography.en
definition: Relates a manifestation to a person who is a contributor to aggregate who creates an expression of a choreographic work that is embodied by an aggregate.
toolkit label: contributor person of choreography
toolkit definition: A person who is a contributor to aggregate who creates an expression of a choreographic work that is embodied by an aggregate.
type: Property
domain: C10007
has element type: 2
sub property of: has contributor person to aggregate
sub property of: has contributor agent of choreography
label: koreografiaan osallinen henkilö @fi
definition: Liittää manifestaation aggregaattiin osalliseen henkilöön, joka on luonut aggregaattiin sisältyvän koreagrafisen teoksen ekspression. @fi
toolkit label: koreografiaan osallinen henkilö @fi
toolkit definition: Aggregaattiin osallinen henkilö, joka on luonut aggregaattiin sisältyvän koreagrafisen teoksen ekspression. @fi
label: har bidragsyter til koreografi (person) @no
definition: Relaterer en manifestasjon til en person som er en bidragsyter til aggregat som skaper et koreografisk verk som er realisert i et aggregat. @no
toolkit label: bidragsyter til koreografi (person) @no
toolkit definition: En person som er en bidragsyter til aggregat som skaper et koreografisk verk som er realisert i et aggregat. @no
label: a pour personne contributrice de chorégraphie @fr
definition: Met une manifestation en relation avec une personne contributrice à un agrégat qui crée une expression d’une œuvre chorégraphique matérialisée par un agrégat. @fr
toolkit label: personne contributrice de chorégraphie @fr
toolkit definition: Personne contributrice à un agrégat qui crée une expression d’une œuvre chorégraphique matérialisée par un agrégat. @fr
label: heeft bijdrage-persoon van choreografie @nl
definition: Relateert een manifestatie aan een persoon die een bijdrager aan aggregaat is die een expressie van een choreografisch werk creëert die is verwezenlijkt in een aggregaat. @nl
toolkit label: bijdrage-persoon van choreografie @nl
toolkit definition: Een persoon die een bijdrager aan aggregaat is die een expressie van een choreografisch werk creëert die is verwezenlijkt in een aggregaat. @nl
label: له شخص مساهم بتصميم رقصات @ar
definition: يربط بين تجسيدة وشخص مساهم في عمل تجميعي ينشيء عمل من تصميم الرقصات يتجسيد في تجميعية. @ar
toolkit label: شخص مساهم بتصميم رقصات @ar
toolkit definition: شخص مساهم في عمل تجميعي ينشيء عمل من تصميم الرقصات يتجسيد في تجميعية. @ar
label: té com a persona contribuïdora de coreografia @ca
definition: Relaciona una manifestació amb una persona que és un contribuïdor a un agregat i que crea una obra coreogràfica que es materialitza en un agregat. @ca
toolkit label: persona contribuïdora de coreografia @ca
toolkit definition: Persona que és un contribuïdor a un agregat i que crea una obra coreogràfica que es materialitza en un agregat. @ca
label: har person, som er bidragsyder til koreografi @da
definition: Relaterer en manifestation til en person, som er bidragsyder til samling, som skaber et koreografisk værk, der er indeholdt i en samling. @da
toolkit label: person, som er bidragsyder til koreografi @da
toolkit definition: Person, som er bidragsyder til samling, som skaber et koreografisk værk, der er indeholdt i en samling. @da
label: kaastööline koreograafia alal (isik) @et
definition: Seostab kehastuse isikuga, kes on liitumi kaastööline, luues koreograafilise teose väljenduse, mis on teostatud liitumis. @et
toolkit label: kaastööline koreograafia alal (isik) @et
toolkit definition: Isik, kes on liitumi kaastööline, luues koreograafilise teose väljenduse, mis on teostatud liitumis. @et
label: hat Beiträgerin/Beiträger von einer Choreografie (Person) @de
definition: Setzt eine Manifestation in Beziehung zu einer Beiträgerin/einem Beiträger zu einem Aggregat (Person), die/der eine Expression eines choreografischen Werks erstellt, die durch ein Aggregat verkörpert wird. @de
toolkit label: Beiträgerin/Beiträger von einer Choreografie (Person) @de
toolkit definition: Eine Beiträgerin/Ein Beiträger zu einem Aggregat (Person), die/der eine Expression eines choreografischen Werks erstellt, die durch ein Aggregat verkörpert wird. @de
label: koreográfia közreműködő személye a következő: @hu
definition: Hozzákapcsol egy megjelenési formát egy személyhez, aki egy aggregátum közreműködőjeként egy koreografikus mű olyan kifejezési formáját hozza létre, amely egy aggregátumban testesül meg. @hu
toolkit label: koreográfia közreműködő személye @hu
toolkit definition: Egy személy, aki egy aggregátum közreműködőjeként egy koreografikus mű olyan kifejezési formáját hozza létre, amely egy aggregátumban testesül meg. @hu
label: ha come contributore di coreografia persona @it
definition: Correla una manifestazione alla persona contributrice a un aggregato che crea un'opera coreografica, materializzata in un aggregato. @it
toolkit label: contributore di coreografia persona @it
toolkit definition: Persona contributrice a un aggregato che crea un'opera coreografica, materializzata in un aggregato. @it
label: horeogrāfijas līdzradītājs (persona) @lv
definition: Sasaista manifestāciju ar personu, kura ir līdzradītājs, kura radījusi apkopojumā ietverto horeogrāfijas darbu. @lv
toolkit label: horeogrāfijas līdzradītājs (persona) @lv
toolkit definition: Persona - līdzradītājs, kura radījusi apkopojumā ietverto horeogrāfijas darbu. @lv
label: 有编舞贡献者个人 @zh-hans
definition: 将一种载体表现与作为合集的一个贡献者并创建被一种合集具体化的一种编舞作品的一种内容表达的一个个人关联起来。 @zh-hans
toolkit label: 编舞贡献者个人 @zh-hans
toolkit definition: 作为合集的一个贡献者并创建被一种合集具体化的一种编舞作品的一种内容表达的一个个人 @zh-hans
label: koreografiye katkıda bulunan kişi ile ilişkilidir @tr
definition: Bir gösterimi, bütün tarafından somutlaştırılan bir koreografik çalışmanın anlatımını oluşturan bütünün bir parçası olan bir kişiyle ilişkilendirir. @tr
toolkit label: koreografiye katkıda bulunan kişi @tr
toolkit definition: Bir topluluk tarafından somutlaştırılan bir koreografik eserin anlatımını oluşturan, topluluğa katkıda bulunan kişi. @tr
label: tiene persona colaboradora de coreografía @es
definition: Relaciona una manifestación con una persona colaboradora de un agregado que crea una expresión de una obra coreográfica que es encarnada por un agregado. @es
toolkit label: persona colaboradora de coreografía @es
toolkit definition: Una persona colaboradora de un agregado que crea una expresión de una obra coreográfica que es encarnada por un agregado. @es
has subproperty: P30339

has contributor person of computer content
status: Published
lexical alias: contributorPersonOfComputerContent.en
definition: Relates a manifestation to a person who is a contributor to aggregate who creates an expression of computer content that is embodied by an aggregate.
toolkit label: contributor person of computer content
toolkit definition: A person who is a contributor to aggregate who creates an expression of computer content that is embodied by an aggregate.
type: Property
domain: C10007
has element type: 2
sub property of: has contributor person to aggregate
sub property of: has contributor agent of computer content
label: digitaaliseen sisältöön osallinen henkilö @fi
definition: Liittää manifestaation aggregaattiin osalliseen henkilöön, joka on luonut aggregaattiin sisältyvän digitaalisen sisällön ekspression. @fi
toolkit label: digitaaliseen sisältöön osallinen henkilö @fi
toolkit definition: Aggregaattiin osallinen henkilö, joka on luonut aggregaattiin sisältyvän digitaalisen sisällön ekspression. @fi
label: har bidragsyter til datamaskininnhold (person) @no
definition: Relaterer en manifestasjon til en person som er en bidragsyter til aggregat som skaper datamaskininnhold som er realisert i et aggregat. @no
toolkit label: bidragsyter til datamaskininnhold (person) @no
toolkit definition: En person som er en bidragsyter til aggregat som skaper datamaskininnhold som er realisert i et aggregat. @no
label: a pour personne contributrice de contenu informatique @fr
definition: Met une manifestation en relation avec une personne contributrice à un agrégat qui crée une expression d’un contenu informatique matérialisée par un agrégat. @fr
toolkit label: personne contributrice de contenu informatique @fr
toolkit definition: Personne contributrice à un agrégat qui crée une expression d’un contenu informatique matérialisée par un agrégat. @fr
label: heeft bijdrage-persoon van computercontent @nl
definition: Relateert een manifestatie aan een persoon die een bijdrager aan aggregaat is die een expressie van computercontent creëert die is verwezenlijkt in een aggregaat. @nl
toolkit label: bijdrage-persoon van computercontent @nl
toolkit definition: Een persoon die een bijdrager aan aggregaat is die een expressie van computercontent creëert die is verwezenlijkt in een aggregaat. @nl
label: له شخص مساهم بمحتوى كمبيوتر @ar
definition: يربط بين تجسيدة وشخص مساهم في عمل تجميعي ينشيء محتوى كمبيوتر يتجسد في تجميعية. @ar
toolkit label: شخص مساهم بمحتوى كمبيوتر @ar
toolkit definition: شخص مساهم في عمل تجميعي ينشيء محتوى كمبيوتر يتجسد في تجميعية. @ar
label: té com a persona contribuïdora de contingut informàtic @ca
definition: Relaciona una manifestació amb una persona que és un contribuïdor a un agregat i que crea una expressió de contingut informàtic que es materialitza en un agregat. @ca
toolkit label: persona contribuïdora de contingut informàtic @ca
toolkit definition: Persona que és un contribuïdor a un agregat i que crea una expressió de contingut informàtic que es materialitza en un agregat. @ca
label: har person, som er bidragsyder til computerindhold @da
definition: Relaterer en manifestation til en person, som er bidragsyder til samling, som skaber computerindhold, der er indeholdt i en samling. @da
toolkit label: person, som er bidragsyder til computerindhold @da
toolkit definition: Person, som er bidragsyder til samling, som skaber computerindhold, der er indeholdt i en samling. @da
label: digisisu kaastööline (isik) @et
definition: Seostab kehastuse isikuga, kes on liitumi kaastööline, luues digisisu väljenduse, mis on teostatud liitumis. @et
toolkit label: digisisu kaastööline (isik) @et
toolkit definition: Isik, kes on liitumi kaastööline, luues digisisu väljenduse, mis on teostatud liitumis. @et
label: hat Beiträgerin/Beiträger von Computer Content (Person) @de
definition: Setzt eine Manifestation in Beziehung zu einer Beiträgerin/einem Beiträger zu einem Aggregat (Person), die/der eine Expression von Computer Content erstellt, die durch ein Aggregat verkörpert wird. @de
toolkit label: Beiträgerin/Beiträger von Computer Content (Person) @de
toolkit definition: Eine Beiträgerin/Ein Beiträger zu einem Aggregat (Person), die/der eine Expression von Computer Content erstellt, die durch ein Aggregat verkörpert wird. @de
label: számítógépes tartalom közreműködő személye a következő: @hu
definition: Hozzákapcsol egy megjelenési formát egy személyhez, aki egy aggregátum közreműködőjeként egy számítógépes tartalom olyan kifejezési formáját hozza létre, amely egy aggregátumban testesül meg. @hu
toolkit label: számítógépes tartalom közreműködő személye: @hu
toolkit definition: Egy személy, aki egy aggregátum közreműködőjeként egy számítógépes tartalom olyan kifejezési formáját hozza létre, amely egy aggregátumban testesül meg. @hu
label: ha come contributore di contenuto informatico persona @it
definition: Correla una nanifestazione alla persona contributrice a un aggregato che crea un contenuto informatico, materializzato in un aggregato. @it
toolkit label: contributore di contenuto informatico persona @it
toolkit definition: Persona contributrice a un aggregato che crea un contenuto informatico, materializzato in un aggregato. @it
label: datororientēta satura līdzradītājs (persona) @lv
definition: Sasaista manifestāciju ar personu, kura ir līdzradītājs, kura radījusi apkopojumā ietverto datororientēto saturu. @lv
toolkit label: datororientēta satura līdzradītājs (persona) @lv
toolkit definition: Persona - līdzradītājs, kura radījusi apkopojumā ietverto datororientēto saturu. @lv
label: 有计算机内容的贡献者个人 @zh-hans
definition: 将一种载体表现与作为合集的一个贡献者并创建被一种合集具体化的一种计算机内容的一种内容表达的一个个人关联起来。 @zh-hans
toolkit label: 计算机内容的贡献者个人 @zh-hans
toolkit definition: 作为合集的一个贡献者并创建被一种合集具体化的一种计算机内容的一种内容表达的一个个人 @zh-hans
label: bilgisayar içeriğine katkıda bulunan kişi ile ilişkilidir @tr
definition: Bir gösterimi, bir bütün tarafından somutlaştırılan bilgisayar içeriğinin bir görünümünü oluşturan bütünün bir katılımcısı olan bir kişiyle ilişkilendirir. @tr
toolkit label: bilgisayar içeriğine katkıda bulunan kişi @tr
toolkit definition: Bir topluluk tarafından somutlaştırılan bir bilgisyar içeriğinin anlatımını oluşturan, topluluğa katkıda bulunan kişi. @tr
label: tiene persona colaboradora de contenidos informáticos @es
definition: Relaciona una manifestación con una persona que contribuye a un agregado y que crea una expresión de contenido informático que está plasmado en un agregado. @es
toolkit label: persona colaboradora de contenidos informáticos @es
toolkit definition: Una persona que contribuye a un agregado y que crea una expresión de contenido informático que está plasmado en un agregado. @es
has subproperty: P30346

has contributor person of moving image
status: Published
lexical alias: contributorPersonOfMovingImage.en
definition: Relates a manifestation to a person who is a contributor to aggregate who creates an expression of a moving image work that is embodied by an aggregate.
toolkit label: contributor person of moving image
toolkit definition: A person who is a contributor to aggregate who creates an expression of a moving image work that is embodied by an aggregate.
type: Property
domain: C10007
has element type: 2
sub property of: has contributor person to aggregate
sub property of: has contributor agent of moving image
label: liikkuvaan kuvaan osallinen henkilö @fi
definition: Liittää manifestaation aggregaattiin osalliseen henkilöön, joka on luonut aggregaattiin sisältyvän liikkuvan kuvan teoksen ekspression. @fi
toolkit label: liikkuvaan kuvaan osallinen henkilö @fi
toolkit definition: Aggregaattiin osallinen henkilö, joka on luonut aggregaattiin sisältyvän liikkuvan kuvan teoksen ekspression. @fi
label: har bidragsyter til levende bilder (person) @no
definition: Relaterer en manifestasjon til en person som er en bidragsyter til aggregat som skaper et verk med levende bilder som er realisert i et aggregat. @no
toolkit label: bidragsyter til levende bilder (person) @no
toolkit definition: En person som er en bidragsyter til aggregat som skaper et verk med levende bilder som er realisert i et aggregat. @no
label: a pour personne contributrice d’images animées @fr
definition: Met une manifestation en relation avec une personne contributrice à un agrégat qui crée une expression d’une œuvre d’images animées matérialisée par un agrégat. @fr
toolkit label: personne contributrice d’images animées @fr
toolkit definition: Personne contributrice à un agrégat qui crée une expression d’une œuvre d’images animées matérialisée par un agrégat. @fr
label: heeft bijdrage-persoon van bewegend beeld @nl
definition: Relateert een manifestatie aan een persoon die een bijdrager aan aggregaat is die een expressie van een bewegend beeldwerk creëert die is verwezenlijkt in een aggregaat. @nl
toolkit label: bijdrage-persoon van bewegend beeld @nl
toolkit definition: Een persoon die een bijdrager aan aggregaat is die een expressie van een bewegend beeldwerk creëert die is verwezenlijkt in een aggregaat. @nl
label: له شخص مساهم بصور متحركة @ar
definition: يربط بين تجسيدة وشخص مساهم في عمل تجميعي ينشيء عمل من صور متحركة يتجسد في تجميعية. @ar
toolkit label: شخص مساهم بصور متحركة @ar
toolkit definition: شخص مساهم في عمل تجميعي ينشيء عمل من صور متحركة يتجسد في تجميعية. @ar
label: té com a persona contribuïdora d’imatge en moviment @ca
definition: Relaciona una manifestació amb una persona que és un contribuïdor a un agregat i que crea una expressió d’una obra d’imatge en moviment que es materialitza en un agregat. @ca
toolkit label: persona contribuïdora d’imatge en moviment @ca
toolkit definition: Persona que és un contribuïdor a un agregat i que crea una expressió d’una obra d’imatge en moviment que es materialitza en un agregat. @ca
label: har person, som er bidragsyder til levende billede @da
definition: Relaterer en manifestation til en person, som er bidragsyder til samling, som skaber et værk med levende billeder, der er indeholdt i en samling. @da
toolkit label: person, som er bidragsyder til levende billede @da
toolkit definition: Person, som er bidragsyder til samling, som skaber et værk med levende billeder, der er indeholdt i en samling. @da
label: kaastööline liikuva pildi alal (isik) @et
definition: Seostab kehastuse isikuga, kes on liitumi kaastööline, luues liikuvast pildist koosneva teose väljenduse, mis on teostatud liitumis. @et
toolkit label: kaastööline liikuva pildi alal (isik) @et
toolkit definition: Isik, kes on liitumi kaastööline, luues liikuvast pildist koosneva teose väljenduse, mis on teostatud liitumis. @et
label: hat Beiträgerin/Beiträger von einem Bewegtbild (Person) @de
definition: Setzt eine Manifestation in Beziehung zu einer Beiträgerin/einem Beiträger zu einem Aggregat (Person), die/der eine Expression eines Bewegtbildwerks erstellt, die durch ein Aggregat verkörpert wird. @de
toolkit label: Beiträgerin/Beiträger von einem Bewegtbild (Person) @de
toolkit definition: Eine Beiträgerin/Ein Beiträger zu einem Aggregat (Person), die/der eine Expression eines Bewegtbildwerks erstellt, die durch ein Aggregat verkörpert wird. @de
label: mozgókép közreműködő személye a következő: @hu
definition: Hozzákapcsol egy megjelenési formát egy személyhez, aki egy aggregátum közreműködőjeként egy mozgóképmű olyan kifejezési formáját hozza létre, amely egy aggregátumban testesül meg. @hu
toolkit label: mozgókép közreműködő személye: @hu
toolkit definition: Egy személy, aki egy aggregátum közreműködőjeként egy mozgóképmű olyan kifejezési formáját hozza létre, amely egy aggregátumban testesül meg. @hu
label: ha come contributore di immagine in movimento persona @it
definition: Correla una manifestazione alla persona contributrice a un aggregato che crea un'opera di immagini in movimento, materializzata in un aggregato. @it
toolkit label: contributore di immagine in movimento persona @it
toolkit definition: Persona contributrice a un aggregato che crea un'opera di immagini in movimento, materializzata in un aggregato. @it
label: kustīga attēla līdzradītājs (persona) @lv
definition: Sasaista manifestāciju ar personu, kura ir līdzradītājs, kura radījusi apkopojumā ietverto kustīgā attēla darbu. @lv
toolkit label: kustīga attēla līdzradītājs (persona) @lv
toolkit definition: Persona - līdzradītājs, kura radījusi apkopojumā ietverto kustīgā attēla darbu. @lv
label: 有动态图像的贡献者个人 @zh-hans
definition: 将一种载体表现与作为合集的一个贡献者并创建被一种合集具体化的一种动态图像作品的一种内容表达的一个个人关联起来。 @zh-hans
toolkit label: 动态图像的贡献者个人 @zh-hans
toolkit definition: 作为合集的一个贡献者并创建被一种合集具体化的一种动态图像作品的一种内容表达的一个个人 @zh-hans
label: hareketli görüntüye katkıda bulunan kişi ile ilişkilidir @tr
definition: Bir gösterimi, bir bütün tarafından somutlaştırılan bir hareketli görüntü çalışmasının görüntüsünü oluşturan bütünün bir parçası olan bir kişiyle ilişkilendirir. @tr
toolkit label: hareketli görüntüye katkıda bulunan kişi @tr
toolkit definition: Bir topluluk tarafından somutlaştırılan bir hareketli görüntü eserinin anlatımını oluşturan, topluluğa katkıda bulunan kişi. @tr
label: tiene persona colaboradora de imagen en movimiento @es
definition: Relaciona una manifestación con una persona que es un colaborador de un agregado que crea una expresión de una obra de imagen en movimiento que es encarnada por un agregado. @es
toolkit label: persona colaboradora de imagen en movimiento @es
toolkit definition: Una persona que es un colaborador de un agregado que crea una expresión de una obra de imagen en movimiento que es encarnada por un agregado. @es
has subproperty: P30340

has contributor person of music
status: Published
lexical alias: contributorPersonOfMusic.en
definition: Relates a manifestation to a person who is a contributor to aggregate who creates an expression of a musical work that is embodied by an aggregate.
toolkit label: contributor person of music
toolkit definition: A person who is a contributor to aggregate who creates an expression of a musical work that is embodied by an aggregate.
type: Property
domain: C10007
has element type: 2
sub property of: has contributor person to aggregate
sub property of: has contributor agent of music
label: musiikkiin osallinen henkilö @fi
definition: Liittää manifestaation aggregaattiin osalliseen henkilöön, joka on luonut aggregaattiin sisältyvän musiikkiteoksen ekspression. @fi
toolkit label: musiikkiin osallinen henkilö @fi
toolkit definition: Aggregaattiin osallinen henkilö, joka on luonut aggregaattiin sisältyvän musiikkiteoksen ekspression. @fi
label: har bidragsyter til musikk (person) @no
definition: Relaterer en manifestasjon til en person som er en bidragsyter til aggregat som skaper et musikalsk verk som er realisert i et aggregat. @no
toolkit label: bidragsyter til musikk (person) @no
toolkit definition: En person som er en bidragsyter til aggregat som skaper et musikalsk verk som er realisert i et aggregat. @no
label: a pour personne contributrice de musique @fr
definition: Met une manifestation en relation avec une personne contributrice à un agrégat qui crée une expression d’une œuvre musicale matérialisée par un agrégat. @fr
toolkit label: personne contributrice de musique @fr
toolkit definition: Personne contributrice à un agrégat qui crée une expression d’une œuvre musicale matérialisée par un agrégat. @fr
label: heeft bijdrage-persoon van muziek @nl
definition: Relateert een manifestatie aan een persoon die een bijdrager aan aggregaat is die een expressie van een muziekwerk creëert die is verwezenlijkt in een aggregaat. @nl
toolkit label: bijdrage-persoon van muziek @nl
toolkit definition: Een persoon die een bijdrager aan aggregaat is die een expressie van een muziekwerk creëert die is verwezenlijkt in een aggregaat. @nl
label: له شخص مساهم بموسيقى @ar
definition: يربط بين تجسيدة وشخص مساهم في عمل تجميعي بإنشاء عمل موسيقي يتجسد في تجميعية. @ar
toolkit label: شخص مساهم بموسيقى @ar
toolkit definition: شخص مساهم في عمل تجميعي بإنشاء عمل موسيقي يتجسد في تجميعية. @ar
label: té com a persona contribuïdora de música @ca
definition: Relaciona una manifestació amb una persona que és un contribuïdor a un agregat i que crea una expressió d’una obra musical que es materialitza en un agregat. @ca
toolkit label: persona contribuïdora de música @ca
toolkit definition: Persona que és un contribuïdor a un agregat i que crea una expressió d’una obra musical que es materialitza en un agregat. @ca
label: har person, som er bidragsyder til musik @da
definition: Relaterer en manifestation til en person, som er bidragsyder til samling, som skaber et musikværk, der er indeholdt i en samling. @da
toolkit label: person, som er bidragsyder til musik @da
toolkit definition: Person, som er bidragsyder til samling, som skaber et musikværk, der er indeholdt i en samling. @da
label: muusikaline kaastööline (isik) @et
definition: Seostab kehastuse isikuga, kes on liitumi kaastööline, luues muusikateose väljenduse, mis on teostatud liitumis. @et
toolkit label: muusikaline kaastööline (isik) @et
toolkit definition: Isik, kes on liitumi kaastööline, luues muusikateose väljenduse, mis on teostatud liitumis. @et
label: hat Beiträgerin/Beiträger einer Musik (Person) @de
definition: Setzt eine Manifestation in Beziehung zu einer Beiträgerin/einem Beiträger zu einem Aggregat (Person), die/der eine Expression eines Musikwerks erstellt, die durch ein Aggregat verkörpert wird. @de
toolkit label: Beiträgerin/Beiträger einer Musik (Person) @de
toolkit definition: Eine Beiträgerin/Ein Beiträger zu einem Aggregat (Person), die/der eine Expression eines Musikwerks erstellt, die durch ein Aggregat verkörpert wird. @de
label: zene közreműködő személye a következő: @hu
definition: Hozzákapcsol egy megjelenési formát egy személyhez, aki egy aggregátum közreműködőjeként egy zenemű olyan kifejezési formáját hozza létre, amely egy aggregátumban testesül meg. @hu
toolkit label: zene közreműködő személye @hu
toolkit definition: Egy személy, aki egy aggregátum közreműködőjeként egy zenemű olyan kifejezési formáját hozza létre, amely egy aggregátumban testesül meg. @hu
label: ha come contributore di musica persona @it
definition: Correla una manifestazione alla persona contributrice a un aggregato che crea un'opera musicale, materializzata in un aggregato. @it
toolkit label: contributore di musica persona @it
toolkit definition: Persona contributrice a un aggregato che crea un'opera musicale, materializzata in un aggregato. @it
label: mūzikas līdzradītājs (persona) @lv
definition: Sasaista manifestāciju ar personu, kura ir līdzradītājs, kura radījusi apkopojumā ietverto mūzikas darbu. @lv
toolkit label: mūzikas līdzradītājs (persona) @lv
toolkit definition: Persona - līdzradītājs, kura radījusi apkopojumā ietverto mūzikas darbu. @lv
label: 有音乐的贡献者个人 @zh-hans
definition: 将一种载体表现与作为合集的一个贡献者并创建被一种合集具体化的一种音乐作品的一种内容表达的一个个人关联起来。 @zh-hans
toolkit label: 音乐的贡献者个人 @zh-hans
toolkit definition: 作为合集的一个贡献者并创建被一种合集具体化的一种音乐作品的一种内容表达的一个个人 @zh-hans
label: müziğe katkıda bulunan kişi ile ilişkilidir @tr
definition: Bir gösterimi, bir bütün tarafından somutlaştırılan bir müzik eserinin yorumunu oluşturan bütünün bir parçası olan bir kişiyle ilişkilendirir. @tr
toolkit label: müzi̇ğe katkıda bulunan ki̇şi̇ @tr
toolkit definition: Bir topluluk tarafından somutlaştırılan bir müzikal eserin anlatımını oluşturan, topluluğa katkıda bulunan kişi. @tr
label: tiene persona colaboradora de la música @es
definition: Relaciona una manifestación con una persona que es colaborador de un agregado y que crea una expresión de una obra musical que es encarnada por un agregado. @es
toolkit label: persona colaboradora de la música @es
toolkit definition: Una persona que es colaborador de un agregado y que crea una expresión de una obra musical que es encarnada por un agregado. @es
has subproperty: P30341

has contributor person of object
status: Published
lexical alias: contributorPersonOfObject.en
definition: Relates a manifestation to a person who is a contributor to aggregate who creates an expression of an object work that is embodied by an aggregate.
toolkit label: contributor person of object
toolkit definition: A person who is a contributor to aggregate who creates an expression of an object work that is embodied by an aggregate.
type: Property
domain: C10007
has element type: 2
sub property of: has contributor person to aggregate
sub property of: has contributor agent of object
label: esineeseen osallinen henkilö @fi
definition: Liittää manifestaation aggregaattiin osalliseen henkilöön, joka on luonut aggregaattiin sisältyvän esineteoksen ekspression. @fi
toolkit label: esineeseen osallinen henkilö @fi
toolkit definition: Aggregaattiin osallinen henkilö, joka on luonut aggregaattiin sisältyvän esineteoksen ekspression. @fi
label: har bidragsyter til gjenstand (person) @no
definition: Relaterer en manifestasjon til en person som er en bidragsyter til aggregat som skaper et verk som er en gjenstand som er realisert i et aggregat. @no
toolkit label: bidragsyter til gjenstand (person) @no
toolkit definition: En person som er en bidragsyter til aggregat som skaper et verk som er en gjenstand som er realisert i et aggregat. @no
label: a pour personne contributrice d’objet @fr
definition: Met une manifestation en relation avec une personne contributrice à un agrégat qui crée une expression d’une œuvre objet matérialisée par un agrégat. @fr
toolkit label: personne contributrice d’objet @fr
toolkit definition: Personne contributrice à un agrégat qui crée une expression d’une œuvre objet matérialisée par un agrégat. @fr
label: heeft bijdrage-persoon van object @nl
definition: Relateert een manifestatie aan een persoon die een bijdrager aan aggregaat is die een expressie van een objectwerk creëert die is verwezenlijkt in een aggregaat. @nl
toolkit label: bijdrage-persoon van object @nl
toolkit definition: Een persoon die een bijdrager aan aggregaat is die een expressie van een objectwerk creëert die is verwezenlijkt in een aggregaat. @nl
label: له شخص مساهم بكائن @ar
definition: يربط بين تجسيدة وشخص مساهم في عمل تجميعي ينشيء عمل شيء ما يتجسد في تجميعية. @ar
toolkit label: شخص مساهم بكائن @ar
toolkit definition: شخص مساهم في عمل تجميعي ينشيء عمل شيء ما يتجسد في تجميعية. @ar
label: té com a persona contribuïdora d’objecte @ca
definition: Relaciona una manifestació amb una persona que és un contribuïdor a un agregat i que crea una expressió d’una obra d’objecte que es materialitza en un agregat. @ca
toolkit label: persona contribuïdora d’objecte @ca
toolkit definition: Persona que és un contribuïdor a un agregat i que crea una expressió d’una obra d’objecte que es materialitza en un agregat. @ca
label: har person, som er bidragsyder til objekt @da
definition: Relaterer en manifestation til en person, som er bidragsyder til samling, som skaber et værk med objekt, der er indeholdt i en samling. @da
toolkit label: person, som er bidragsyder til objekt @da
toolkit definition: Person, som er bidragsyder til samling, som skaber et værk med objekt, der er indeholdt i en samling. @da
label: objektiloome kaastööline (isik) @et
definition: Seostab kehastuse isikuga, kes on liitumi kaastööline, luues objektteose väljenduse, mis on teostatud liitumis. @et
toolkit label: objektiloome kaastööline (isik) @et
toolkit definition: Isik, kes on liitumi kaastööline, luues objektteose väljenduse, mis on teostatud liitumis. @et
label: hat Beiträgerin/Beiträger von einem Gegenstand (Person) @de
definition: Setzt eine Manifestation in Beziehung zu einer Beiträgerin/einem Beiträger zu einem Aggregat (Person), die/der eine Expression eines gegenständlichen Werks erstellt, die durch ein Aggregat verkörpert wird. @de
toolkit label: Beiträgerin/Beiträger von einem Gegenstand (Person) @de
toolkit definition: Eine Beiträgerin/Ein Beiträger zu einem Aggregat (Akteur), die/der eine Expression eines gegenständlichen Werks erstellt, die durch ein Aggregat verkörpert wird. @de
label: tárgy közreműködő személye a következő: @hu
definition: Hozzákapcsol egy megjelenési formát egy személyhez, aki egy aggregátum közreműködőjeként egy tárgyi mű olyan kifejezési formáját hozza létre, amely egy aggregátumban testesül meg. @hu
toolkit label: tárgy közreműködő személye @hu
toolkit definition: Egy személy, aki egy aggregátum közreműködőjeként egy tárgyi mű olyan kifejezési formáját hozza létre, amely egy aggregátumban testesül meg. @hu
label: ha come contributore di oggetto persona @it
definition: Correla una manifestazione alla persona contributrice a un aggregato che crea un’opera oggetto, materializzata in un aggregato. @it
toolkit label: contributore di oggetto persona @it
toolkit definition: Persona contributrice a un aggregato che crea un’opera oggetto, materializzata in un aggregato. @it
label: objekta līdzradītājs (persona) @lv
definition: Sasaista manifestāciju ar personu, kura ir līdzradītājs, kura radījusi apkopojumā ietverto objekta darbu. @lv
toolkit label: objekta līdzradītājs (persona) @lv
toolkit definition: Persona - līdzradītājs, kura radījusi apkopojumā ietverto objekta darbu. @lv
label: 有物体的贡献者个人 @zh-hans
definition: 将一种载体表现与作为合集的一个贡献者并创建被一种合集具体化的一种物体作品的一种内容表达的一个个人关联起来。 @zh-hans
toolkit label: 物体的贡献者个人 @zh-hans
toolkit definition: 作为合集的一个贡献者并创建被一种合集具体化的一种物体作品的一种内容表达的一个个人 @zh-hans
label: nesneye katkıda bulunan kişi ile ilişkilidir @tr
definition: Bir gösterimi, bir bütün tarafından somutlaştırılan bir nesne çalışmasının anlatımını oluşturan bütünün bir katılımcısı olan bir kişiyle ilişkilendirir. @tr
toolkit label: nesneye katkıda bulunan kişi @tr
toolkit definition: Bir topluluk tarafından somutlaştırılan bir nesne çalışmasının anlatımını oluşturan, topluluğa katkıda bulunan kişi. @tr
label: tiene persona contribuyente de objeto @es
definition: Relaciona una manifestación con una persona que es un colaborador de un agregado que crea una expresión de un objeto de obra que está encarnado por un agregado. @es
toolkit label: persona contribuyente de objeto @es
toolkit definition: Una persona que es un colaborador de un agregado que crea una expresión de un objeto de obra que está encarnado por un agregado. @es
has subproperty: P30345

has contributor person of speech
status: Published
lexical alias: contributorPersonOfSpeech.en
definition: Relates a manifestation to a person who is a contributor to aggregate who creates an expression of a vocal work that is embodied by an aggregate.
toolkit label: contributor person of speech
toolkit definition: A person who is a contributor to aggregate who creates an expression of a vocal work that is embodied by an aggregate.
type: Property
domain: C10007
has element type: 2
sub property of: has contributor person to aggregate
sub property of: has contributor agent of speech
label: puheeseen osallinen henkilö @fi
definition: Liittää manifestaation aggregaattiin osalliseen henkilöön, joka on luonut aggregaattiin sisältyvän puheteoksen ekspression. @fi
toolkit label: puheeseen osallinen henkilö @fi
toolkit definition: Aggregaattiin osallinen henkilö, joka on luonut aggregaattiin sisältyvän puheteoksen ekspression. @fi
label: har bidragsyter til tale (person) @no
definition: Relaterer en manifestasjon til en person som er en bidragsyter til aggregat som skaper et verk av tale som er realisert i et aggregat. @no
toolkit label: bidragsyter til tale (person) @no
toolkit definition: En person som er en bidragsyter til aggregat som skaper et verk av tale som er realisert i et aggregat. @no
label: a pour personne contributrice de contenu vocal @fr
definition: Met une manifestation en relation avec une personne contributrice à un agrégat qui crée une expression d’une œuvre vocale matérialisée par un agrégat. @fr
toolkit label: personne contributrice de contenu vocal @fr
toolkit definition: Personne contributrice à un agrégat qui crée une expression d’une œuvre vocale matérialisée par un agrégat. @fr
label: heeft bijdrage-persoon van spraak @nl
definition: Relateert een manifestatie aan een persoon die een bijdrager aan aggregaat is die een expressie van een vocaal werk creëert die is verwezenlijkt in een aggregaat. @nl
toolkit label: bijdrage-persoon van spraak @nl
toolkit definition: Een persoon die een bijdrager aan aggregaat is die een expressie van een vocaal werk creëert die is verwezenlijkt in een aggregaat. @nl
label: له شخص مساهم بحديث @ar
definition: يربط بين تجسيدة وشخص مساهم في عمل تجميعي ينشيء عمل من كلمات منطوقة يتجسد في تجميعية. @ar
toolkit label: شخص مساهم بحديث @ar
toolkit definition: شخص مساهم في عمل تجميعي ينشيء عمل من كلمات منطوقة يتجسد في تجميعية. @ar
label: té com a persona contribuïdora de discurs @ca
definition: Relaciona una manifestació amb una persona que és un contribuïdor a un agregat i que crea una expressió d’una obra vocal que es materialitza en un agregat. @ca
toolkit label: persona contribuïdora de discurs @ca
toolkit definition: Persona que és un contribuïdor a un agregat i que crea una expressió d’una obra vocal que es materialitza en un agregat. @ca
label: har person, som er bidragsyder til tale @da
definition: Relaterer en manifestation til en person, som er bidragsyder til samling, som skaber et værk med talte ord, der er indeholdt i en samling. @da
toolkit label: person, som er bidragsyder til tale @da
toolkit definition: Person, som er bidragsyder til samling, som skaber et værk med talte ord, der er indeholdt i en samling. @da
label: kõneloome kaastööline (isik) @et
definition: Seostab kehastuse isikuga, kes on liitumi kaastööline, luues suulise teose väljenduse, mis on teostatud liitumis. @et
toolkit label: kõneloome kaastööline (isik) @et
toolkit definition: Isik, kes on liitumi kaastööline, luues suulise teose väljenduse, mis on teostatud liitumis. @et
label: hat Beiträgerin/Beiträger von einer Rede (Person) @de
definition: Setzt eine Manifestation in Beziehung zu einer Beiträgerin/einem Beiträger zu einem Aggregat (Person), die/der eine Expression eines gesprochenen Werks erstellt, die durch ein Aggregat verkörpert wird. @de
toolkit label: Beiträgerin/Beiträger von einer Rede (Person) @de
toolkit definition: Eine Beiträgerin/Ein Beiträger zu einem Aggregat (Akteur), die/der eine Expression eines gesprochenen Werks erstellt, die durch ein Aggregat verkörpert wird. @de
label: beszéd közreműködő személye a következő: @hu
definition: Hozzákapcsol egy megjelenési formát egy személyhez, aki egy aggregátum közreműködőjeként egy beszédmű olyan kifejezési formáját hozza létre, amely egy aggregátumban testesül meg. @hu
toolkit label: beszéd közreműködő személye @hu
toolkit definition: Egy személy, aki egy aggregátum közreműködőjeként egy beszédmű olyan kifejezési formáját hozza létre, amely egy aggregátumban testesül meg. @hu
label: ha come contributore di discorso persona @it
definition: Correla una manifestazione alla persona contributrice a un aggregato che crea un'opera parlata, materializzata in un aggregato. @it
toolkit label: contributore di discorso persona @it
toolkit definition: Persona contributrice a un aggregato che crea un'opera parlata, materializzata in un aggregato. @it
label: runas līdzradītājs (persona) @lv
definition: Sasaista manifestāciju ar personu, kura ir līdzradītājs, kura radījusi apkopojumā ietverto mutvārdu darbu. @lv
toolkit label: runas līdzradītājs (persona) @lv
toolkit definition: Persona - līdzradītājs, kura radījusi apkopojumā ietverto mutvārdu darbu. @lv
label: 有讲话的贡献者个人 @zh-hans
definition: 将一种载体表现与作为合集的一个贡献者并创建被一种合集具体化的一种人声作品的一种内容表达的一个个人关联起来。 @zh-hans
toolkit label: 讲话的贡献者个人 @zh-hans
toolkit definition: 作为合集的一个贡献者并创建被一种合集具体化的一种人声作品的一种内容表达的一个个人 @zh-hans
label: konuşmaya katkıda bulunan kişi ile ilişkilidir @tr
definition: Bir gösterimi, bir bütün tarafından somutlaştırılan bir vokal eserin yorumunu yapan ve bütüne katkıda bulunan bir kişiyle ilişkilendirir. @tr
toolkit label: konuşmaya katkıda bulunan kişi @tr
toolkit definition: Bir topluluk tarafından somutlaştırılan bir vokal eserin anlatımını oluşturan, topluluğa katkıda bulunan kişi. @tr
label: tiene persona colaboradora del discurso @es
definition: Relaciona una manifestación con una persona que es colaborador de un agregado que crea una expresión de una obra vocal que es encarnada por un agregado. @es
toolkit label: persona colaboradora del discurso @es
toolkit definition: Una persona que es colaborador de un agregado que crea una expresión de una obra vocal que es encarnada por un agregado. @es
has subproperty: P30342

has contributor person of still image
status: Published
lexical alias: contributorPersonOfStillImage.en
definition: Relates a manifestation to a person who is a contributor to aggregate who creates an expression of a still image work that is embodied by an aggregate.
toolkit label: contributor person of still image
toolkit definition: A person who is a contributor to aggregate who creates an expression of a still image work that is embodied by an aggregate.
type: Property
domain: C10007
has element type: 2
sub property of: has contributor person to aggregate
sub property of: has contributor agent of still image
label: stillkuvaan osallinen henkilö @fi
definition: Liittää manifestaation aggregaattiin osalliseen henkilöön, joka on luonut aggregaattiin sisältyvän stillkuvateoksen ekspression. @fi
toolkit label: stillkuvaan osallinen henkilö @fi
toolkit definition: Aggregaattiin osallinen henkilö, joka on luonut aggregaattiin sisältyvän stillkuvateoksen ekspression. @fi
label: har bidragsyter til bilde (person) @no
definition: Relaterer en manifestasjon til en person som er en bidragsyter til aggregat som skaper et bildeverk som er realisert i et aggregat. @no
toolkit label: bidragsyter til bilde (person) @no
toolkit definition: En person som er en bidragsyter til aggregat som skaper et bildeverk som er realisert i et aggregat. @no
label: a pour personne contributrice d’image fixe @fr
definition: Met une manifestation en relation avec une personne contributrice à un agrégat qui crée une expression d’une œuvre d’image fixe matérialisée par un agrégat. @fr
toolkit label: personne contributrice d’image fixe @fr
toolkit definition: Personne contributrice à un agrégat qui crée une expression d’une œuvre d’image fixe matérialisée par un agrégat. @fr
label: heeft bijdrage-persoon van stilstaand beeld @nl
definition: Relateert een manifestatie aan een persoon die een bijdrager aan aggregaat is die een expressie van een stilstaand beeldwerk creëert die is verwezenlijkt in een aggregaat. @nl
toolkit label: bijdrage-persoon van stilstaand beeld @nl
toolkit definition: Een persoon die een bijdrager aan aggregaat is die een expressie van een stilstaand beeldwerk creëert die is verwezenlijkt in een aggregaat. @nl
label: له شخص مساهم بصور ثابتة @ar
definition: يربط بين تجسيدة وشخص مساهم في عمل تجميعي ينشيء عمل من صور ثابتة يتجسد في تجميعية. @ar
toolkit label: شخص مساهم بصور ثابتة @ar
toolkit definition: شخص مساهم في عمل تجميعي ينشيء عمل من صور ثابتة يتجسد في تجميعية. @ar
label: té com a persona contribuïdora d’imatge fixa @ca
definition: Relaciona una manifestació amb una persona que és un contribuïdor a un agregat i que crea una expressió d’una obra d’imatge fixa que es materialitza en un agregat. @ca
toolkit label: persona contribuïdora d’imatge fixa @ca
toolkit definition: Persona que és un contribuïdor a un agregat i que crea una expressió d’una obra d’imatge fixa que es materialitza en un agregat. @ca
label: har person, som er bidragsyder til stillbillede @da
definition: Relaterer en manifestation til en person, som er bidragsyder til samling, som skaber et værk med stillbilleder, der er indeholdt i en samling. @da
toolkit label: person, som er bidragsyder til stillbillede @da
toolkit definition: Person, som er bidragsyder til samling, som skaber et værk med stillbilleder, der er indeholdt i en samling. @da
label: kaastööline liikumatu pildi alal (isik) @et
definition: Seostab kehastuse isikuga, kes on liitumi kaastööline, luues liikumatust pildist koosneva teose väljenduse, mis on teostatud liitumis. @et
toolkit label: kaastööline liikumatu pildi alal (isik) @et
toolkit definition: Isik, kes on liitumi kaastööline, luues liikumatust pildist koosneva teose väljenduse, mis on teostatud liitumis. @et
label: hat Illustratorin/Illustrator (Person) @de
definition: Setzt eine Manifestation in Beziehung zu einer Beiträgerin/einem Beiträger zu einem Aggregat (Person), die/der eine Expression eines unbewegten Bildwerks erstellt, die durch ein Aggregat verkörpert wird. @de
toolkit label: Illustratorin/Illustrator (Person) @de
toolkit definition: Eine Beiträgerin/Ein Beiträger zu einem Aggregat (Person), die/der eine Expression eines unbewegten Bildwerks erstellt, die durch ein Aggregat verkörpert wird. @de
label: állókép közreműködője személye a következő: @hu
definition: Hozzákapcsol egy megjelenési formát egy személyhez, aki egy aggregátum közreműködőjeként egy állóképmű olyan kifejezési formáját hozza létre, amely egy aggregátumban testesül meg. @hu
toolkit label: állókép közreműködő személye: @hu
toolkit definition: Egy személy, aki egy aggregátum közreműködőjeként egy állóképmű olyan kifejezési formáját hozza létre, amely egy aggregátumban testesül meg. @hu
label: ha come contributore di immagine fissa persona @it
definition: Correla una manifestazione alla persona contributrice a un aggregato che crea un'opera di immagini fisse, materializzata in un aggregato. @it
toolkit label: contributore di immagine fissa persona @it
toolkit definition: Persona contributrice a un aggregato che crea un'opera di immagini fisse, materializzata in un aggregato. @it
label: attēla līdzradītājs (persona) @lv
definition: Sasaista manifestāciju ar personu, kura ir līdzradītājs, kura radījusi apkopojumā ietverto attēla darbu. @lv
toolkit label: attēla līdzradītājs (persona) @lv
toolkit definition: Persona - līdzradītājs, kura radījusi apkopojumā ietverto attēla darbu. @lv
label: 有静态图像的贡献者个人 @zh-hans
definition: 将一种载体表现与作为合集的一个贡献者并创建被一种合集具体化的一种静态图像作品的一种内容表达的一个个人关联起来。 @zh-hans
toolkit label: 静态图像的贡献者个人 @zh-hans
toolkit definition: 作为合集的一个贡献者并创建被一种合集具体化的一种静态图像作品的一种内容表达的一个个人 @zh-hans
label: durağan görüntüye katkıda bulunan kişi ile ilişkilidir @tr
definition: Bir gösterimi, bir bütün tarafından somutlaştırılan bir hareketsiz görüntü çalışmasının görüntüsünün oluşturduğu bütüne katkıda bulunan bir kişiyle ilişkilendirir. @tr
toolkit label: hareketsiz görüntüye katkıda bulunan kişi @tr
toolkit definition: Bir topluluk tarafından somutlaştırılan bir durağan görüntü eserinin anlatımını oluşturan, topluluğa katkıda bulunan kişi. @tr
label: tiene persona colaboradora de la imagen fija @es
definition: Relaciona una manifestación con una persona que contribuye al agregado y que crea una expresión de una obra de imagen fija que está encarnada por un agregado. @es
toolkit label: persona colaboradora de la imagen fija @es
toolkit definition: Una persona que contribuye al agregado y que crea una expresión de una obra de imagen fija que está encarnada por un agregado. @es
has subproperty: P30343

has contributor person of text
status: Published
lexical alias: contributorPersonOfText.en
definition: Relates a manifestation to a person who is a contributor to aggregate who creates an expression of a textual work that is embodied by an aggregate.
toolkit label: contributor person of text
toolkit definition: A person who is a contributor to aggregate who creates an expression of a textual work that is embodied by an aggregate.
type: Property
domain: C10007
has element type: 2
sub property of: has contributor person to aggregate
sub property of: has contributor agent of text
label: tekstiin osallinen henkilö @fi
definition: Liittää manifestaation aggregaattiin osalliseen henkilöön, joka on luonut aggregaattiin sisältyvän tekstiteoksen ekspression. @fi
toolkit label: tekstiin osallinen henkilö @fi
toolkit definition: Aggregaattiin osallinen henkilö, joka on luonut aggregaattiin sisältyvän tekstiteoksen ekspression. @fi
label: har bidragsyter til tekst (person) @no
definition: Relaterer en manifestasjon til en person som er en bidragsyter til aggregat som skaper et tekstlig verk som er realisert i et aggregat. @no
toolkit label: bidragsyter til tekst (person) @no
toolkit definition: En person som er en bidragsyter til aggregat som skaper et tekstlig verk som er realisert i et aggregat. @no
label: a pour personne contributrice de texte @fr
definition: Met une manifestation en relation avec une personne contributrice à un agrégat qui crée une expression d’une œuvre textuelle matérialisée par un agrégat. @fr
toolkit label: personne contributrice de texte @fr
toolkit definition: Personne contributrice à un agrégat qui crée une expression d’une œuvre textuelle matérialisée par un agrégat. @fr
label: heeft bijdrage-persoon van tekst @nl
definition: Relateert een manifestatie aan een persoon die een bijdrager aan aggregaat is die een expressie van een tekstwerk creëert die is verwezenlijkt in een aggregaat. @nl
toolkit label: bijdrage-persoon van tekst @nl
toolkit definition: Een persoon die een bijdrager aan aggregaat is die een expressie van een tekstwerk creëert die is verwezenlijkt in een aggregaat. @nl
label: له شخص مساهم بنص @ar
definition: يربط بين تجسيدة وشخص مساهم في عمل تجميعي ينشيء عمل نصي يتجسد في تجميعية. @ar
toolkit label: شخص مساهم بنص @ar
toolkit definition: شخص مساهم في عمل تجميعي ينشيء عمل نصي يتجسد في تجميعية. @ar
label: té com a persona contribuïdora de text @ca
definition: Relaciona una manifestació amb una persona que és un contribuïdor a un agregat i que crea una expressió d’una obra textual que es materialitza en un agregat. @ca
toolkit label: persona contribuïdora de text @ca
toolkit definition: Persona que és un contribuïdor a un agregat i que crea una expressió d’una obra textual que es materialitza en un agregat. @ca
label: har person, som er bidragsyder til tekst @da
definition: Relaterer en manifestation til en person, som er bidragsyder til samling, som skaber et tekstværk, der er indeholdt i en samling. @da
toolkit label: person, som er bidragsyder til tekst @da
toolkit definition: Person, som er bidragsyder til samling, som skaber et tekstværk, der er indeholdt i en samling. @da
label: tekstiloome kaastööline (isik) @et
definition: Seostab kehastuse isikuga, kes on liitumi kaastööline, luues tekstteose väljenduse, mis on teostatud liitumis. @et
toolkit label: tekstiloome kaastööline (isik) @et
toolkit definition: Isik, kes on liitumi kaastööline, luues tekstteose väljenduse, mis on teostatud liitumis. @et
label: hat Beiträgerin/Beiträger von ergänzendem Text (Person) @de
definition: Setzt eine Manifestation in Beziehung zu einer Beiträgerin/einem Beiträger zu einem Aggregat (Person), die/der eine Expression eines textlichen Werks erstellt, die durch ein Aggregat verkörpert wird. @de
toolkit label: Beiträgerin/Beiträger von ergänzendem Text (Person) @de
toolkit definition: Eine Beiträgerin/Ein Beiträger zu einem Aggregat (Person), die/der eine Expression eines textlichen Werks erstellt, die durch ein Aggregat verkörpert wird. @de
label: szöveg közreműködő személye a következő: @hu
definition: Hozzákapcsol egy megjelenési formát egy személyhez, aki egy aggregátum közreműködőjeként egy szöveges mű olyan kifejezési formáját hozza létre, amely egy aggregátumban testesül meg. @hu
toolkit label: szöveg közreműködő személye: @hu
toolkit definition: Egy személy, aki egy aggregátum közreműködőjeként egy szöveges mű olyan kifejezési formáját hozza létre, amely egy aggregátumban testesül meg. @hu
label: ha come contributore di testo persona @it
definition: Correla una manifestazione alla persona contributrice a un aggregato che crea un'opera testuale, materializzata in un aggregato. @it
toolkit label: contributore di testo persona @it
toolkit definition: Persona contributrice a un aggregato che crea un'opera testuale, materializzata in un aggregato. @it
label: teksta līdzradītājs (persona) @lv
definition: Sasaista manifestāciju ar personu, kura ir līdzradītājs, kura radījusi apkopojumā ietverto teksta darbu. @lv
toolkit label: teksta līdzradītājs (persona) @lv
toolkit definition: Persona - līdzradītājs, kura radījusi apkopojumā ietverto teksta darbu. @lv
label: 有文本的贡献者个人 @zh-hans
definition: 将一种载体表现与作为合集的一个贡献者并创建被一种合集具体化的一种文字作品的一种内容表达的一个个人关联起来。 @zh-hans
toolkit label: 文本的贡献者个人 @zh-hans
toolkit definition: 作为合集的一个贡献者并创建被一种合集具体化的一种文字作品的一种内容表达的一个个人 @zh-hans
label: metne katkıda bulunan kişi ile ilişkilidir @tr
definition: Bir gösterimi, bir bütün tarafından somutlaştırılan metinsel bir eserin metinsel bir ifadesini oluşturan ve bütüne katkıda bulunan bir kişiyle ilişkilendirir. @tr
toolkit label: metne katkıda bulunan kişi @tr
toolkit definition: Bir topluluk tarafından somutlaştırılan bir metinsel eserin anlatımını oluşturan, topluluğa katkıda bulunan kişi. @tr
label: tiene persona colaboradora del texto @es
definition: Relaciona una manifestación con una persona que es un colaborador de un agregado que crea una expresión de una obra textual que está plasmada en un agregado. @es
toolkit label: persona colaboradora del texto @es
toolkit definition: Una persona que es un colaborador de un agregado que crea una expresión de una obra textual que está plasmada en un agregado. @es
has subproperty: P30344

has contributor person to aggregate
status: Published
lexical alias: contributorPersonToAggregate.en
definition: Relates a manifestation to a person who is responsible for creating an expression of a work that is embodied by an aggregate.
toolkit label: contributor person to aggregate
toolkit definition: A person who is responsible for creating an expression of a work that is embodied by an aggregate.
type: Property
domain: C10007
has element type: 2
sub property of: has related person of manifestation
sub property of: has contributor agent to aggregate
label: aggregaattiin osallinen henkilö @fi
definition: Liittää manifestaation henkilöön, joka on vastuussa aggregaattiin sisältyvän teoksen ekspression luomisesta. @fi
toolkit label: aggregaattiin osallinen henkilö @fi
toolkit definition: Henkilö, joka on vastuussa aggregaattiin sisältyvän teoksen ekspression luomisesta. @fi
label: har bidragsyter til aggregat (person) @no
definition: Relaterer en manifestasjon til en person som skaper et verk som er realisert i et aggregat. @no
toolkit label: bidragsyter til aggregat (person) @no
toolkit definition: En person som skaper et verk som er realisert i et aggregat. @no
label: a pour personne contributrice à un agrégat @fr
definition: Met une manifestation en relation avec une personne qui est responsable de la création d’une expression d’une œuvre matérialisée par un agrégat. @fr
toolkit label: personne contributrice à un agrégat @fr
toolkit definition: Personne qui est responsable de la création d’une expression d’une œuvre matérialisée par un agrégat. @fr
label: heeft bijdrage-persoon aan aggregaat @nl
definition: Relateert een manifestatie aan een persoon die verantwoordelijk is voor het creëren van een expressie van een werk die is verwezenlijkt in een aggregaat. @nl
toolkit label: bijdrage-persoon aan aggregaat @nl
toolkit definition: Een persoon die verantwoordelijk is voor het creëren van een expressie van een werk die is verwezenlijkt in een aggregaat. @nl
label: له شخص مساهم في تجميعة @ar
definition: يربط بين تجسيدة وشخص ينشيء عمل يتجسد في تجميعية. @ar
toolkit label: شخص مساهم في تجميعة @ar
toolkit definition: شخص ينشيء عمل يتجسد في تجميعية. @ar
label: té com a persona contribuïdora a un agregat @ca
definition: Relaciona una manifestació amb una persona que és responsable de la creació d’una expressió d’una obra que es materialitza en un agregat. @ca
toolkit label: persona contribuïdora a un agregat @ca
toolkit definition: Persona que és responsable de la creació d’una expressió d’una obra que es materialitza en un agregat. @ca
label: har person, som er bidragsyder til samling @da
definition: Relaterer en manifestation til en person, som skaber et værk, der er indeholdt i en samling. @da
toolkit label: person, som er bidragsyder til samling @da
toolkit definition: Person, som skaber et værk, der er indeholdt i en samling. @da
label: liitumi kaastööline (isik) @et
definition: Seostab kehastuse isikuga, kes loob teose väljenduse, mis on teostatud liitumis. @et
toolkit label: liitumi kaastööline (isik) @et
toolkit definition: Isik, kes loob teose väljenduse, mis on teostatud liitumis. @et
label: hat Beiträgerin/Beiträger zu einem Aggregat (Person) @de
definition: Setzt eine Manifestation in Beziehung zu einer Person, die für die Schaffung einer Expression eines Werks verantwortlich ist, die durch ein Aggregat verkörpert wird. @de
toolkit label: Beiträgerin/Beiträger zu einem Aggregat (Person) @de
toolkit definition: Eine Person, die für die Schaffung einer Expression eines Werks verantwortlich ist, die durch ein Aggregat verkörpert wird. @de
label: aggregátum közreműködő személye a következő: @hu
definition: Hozzákapcsol egy megjelenési formát egy személyhez, aki egy aggregátumban megtestesülő mű kifejezési formájának létrehozásáért felelős. @hu
toolkit label: aggregátum közreműködő személye @hu
toolkit definition: Egy személy, aki egy aggregátumban megtestesülő mű kifejezési formájának létrehozásáért felelős. @hu
label: ha come contributore a un aggregato persona @it
definition: Correla una manifestazione alla persona creatrice di un'opera materializzata in un aggregato. @it
toolkit label: contributore a un aggregato persona @it
toolkit definition: Persona creatrice di un'opera materializzata in un aggregato. @it
label: apkopojuma līdzradītājs (persona) @lv
definition: Sasaista manifestāciju ar personu, kura radījusi apkopojumā ietverto darbu. @lv
toolkit label: apkopojuma līdzradītājs (persona) @lv
toolkit definition: Persona, kura radījusi apkopojumā ietverto darbu. @lv
label: 有合集的贡献者个人 @zh-hans
definition: 将一种载体表现与负责创建被一种合集具体化的一种作品的一种内容表达的一个个人关联起来。 @zh-hans
toolkit label: 合集的贡献者个人 @zh-hans
toolkit definition: 负责创建被一种合集具体化的一种作品的一种内容表达的一个个人 @zh-hans
label: toplamaya katkıda bulunan kişi ile ilişkilidir @tr
definition: Bir gösterimi, bir bütün tarafından somutlaştırılan bir ifadesini oluşturmaktan sorumlu olan bir kişiyle ilişkilendirir. @tr
toolkit label: topluluğa katkıda bulunan kişi @tr
toolkit definition: Bir topluluk tarafından somutlaştırılan bir eserin anlatımını oluşturmaktan sorumlu olan kişi. @tr
label: tiene una persona contribuyente para agregar @es
definition: Relaciona una manifestación con una persona que se encarga de crear una expresión de una obra que está plasmada en un agregado. @es
toolkit label: persona contribuyente para agregar @es
toolkit definition: Una persona que se encarga de crear una expresión de una obra que está plasmada en un agregado. @es
has subproperty: has contributor person of cartography
has subproperty: has contributor person of choreography
has subproperty: has contributor person of computer content
has subproperty: has contributor person of moving image
has subproperty: has contributor person of music
has subproperty: has contributor person of object
has subproperty: has contributor person of speech
has subproperty: has contributor person of still image
has subproperty: has contributor person of text

has copyright date
status: Published
definition: Relates a manifestation to a timespan associated with a claim of protection under copyright or a similar regime.
type: Property
domain: C10007
lexical alias: copyrightDate.en
scope note: A copyright date includes a phonogram date associated with a claim of protection for an audio recording.
instruction number: 2.11
toolkit label: copyright date
toolkit definition: A timespan associated with a claim of protection under copyright or a similar regime.
label: a pour date de copyright @fr
definition: Met une manifestation en relation avec un laps de temps associé à une revendication de protection en vertu du copyright ou d’un régime similaire. @fr
scope note: Une date de copyright comprend une date de phonogramme associée à une revendication de protection pour un enregistrement audio. @fr
toolkit label: date de copyright @fr
toolkit definition: Laps de temps associé à une revendication de protection en vertu du copyright ou d’un régime similaire. @fr
toolkit label: fecha de derechos de autor @es
toolkit definition: Un espacio de tiempo asociado con un derecho de protección bajo derechos de autor o un régimen similar. @es
label: har copyrightår @sv
toolkit label: copyrightår @sv
toolkit label: copyrightdatum @nl
toolkit definition: Een tijdspanne geassocieerd met een claim van bescherming onder copyright of soortgelijk stelsel. @nl
label: có ngày bản quyền @vi
definition: Liên kết biểu thị với ngày liên quan với tuyên bố bảo hộ dưới chế độ bản quyền hoặc tương tự. @vi
scope note: Ngày bản quyền bao gồm ngày ghi âm, nghĩa là, ngày liên quan tới tuyên bố bảo hộ cho bản ghi audio. @vi
toolkit label: ngày bản quyền @vi
toolkit definition: Ngày liên quan với tuyên bố bảo hộ dưới chế độ bản quyền hoặc tương tự. @vi
scope note: Een copyrightdatum omvat een phonogramdatum, geassocieerd met een claim van bescherming voor een geluidsopname. @nl
label: har copyrightdato @da
definition: Relaterer en manifestation til en tidsperiode, som er knyttet til et beskyttelseskrav under copyright eller et lignende system. @da
scope note: Copyrightdato omfatter en fonogramdato knyttet til et beskyttelseskrav for en lydoptagelse. @da
toolkit label: copyrightdato @da
toolkit definition: Tidsperiode, som er knyttet til et beskyttelseskrav under copyright eller et lignende system. @da
label: hat Copyright-Datum @de
definition: Setzt eine Manifestation in Beziehung zu einem Zeitraum, der mit einem Schutzanspruch nach dem Urheberrecht oder einem ähnlichen Regelwerk in Verbindung steht. @de
scope note: Darunter fallen Phonogramm-Daten, das heißt Datumsangaben, die mit einem Schutzanspruch für Audioaufnahmen in Verbindung stehen. @de
toolkit label: Copyright-Datum @de
toolkit definition: Ein Zeitraum, der mit einem Schutzanspruch nach dem Urheberrecht oder einem ähnlichen Regelwerk in Verbindung steht. @de
label: té com a data de copyright @ca
definition: Relaciona una manifestació amb un interval de temps associat amb una declaració de protecció en virtut del copyright o d’un règim similar. @ca
scope note: Una data de copyright inclou una data de fonograma associada amb una declaració de protecció per a un enregistrament àudio. @ca
toolkit label: data de copyright @ca
toolkit definition: Interval de temps associat amb una declaració de protecció en virtut del copyright o d’un règim similar. @ca
definition: Liittää manifestaation ajanjaksoon, joka liittyy copyright-säädösten tai vastaavien säädösten alaiseen copyright-suojaukseen. @fi
toolkit label: copyright-vuosi @fi
toolkit definition: Ajanjakso, joka liittyy copyright-säädösten tai vastaavien säädösten alaiseen copyright-suojaukseen. @fi
toolkit label: tidsrom for copyright @no
toolkit definition: Et tidsrom knyttet til krav om copyrightbeskyttelse eller lignende ordning. @no
label: έχει χρονολογία copyright @el
definition: Συνδέει μια εκδήλωση με μια χρονολογία που συνδέεται με την αξίωση της προστασίας των πνευματικών δικαιωμάτων ή με ένα παρόμοιο καθεστώς. @el
scope note: Οι χρονολογίες copyright περιλαμβάνουν τις χρονολογίες φωνογραφήματος δηλαδή τις χρονολογίες που συνδέονται με τις αξιώσεις της προστασίας των ηχογραφήσεων. @el
toolkit label: χρονολογία copyright @el
toolkit definition: Μια χρονολογία που συνδέεται με την αξίωση της προστασίας των πνευματικών δικαιωμάτων ή με ένα παρόμοιο καθεστώς. @el
sub property of: has date of manifestation
has element type: 3
label: copyright időpontja a következő: @hu
definition: Hozzákapcsol egy megjelenési formát egy időtartamhoz, amely egy copyright vagy hasonló rendszer alatti védelmi igényhez kapcsolódik. @hu
scope note: copyright időpontja: @hu
toolkit label: Egy időtartam, amely egy copyright vagy hasonló rendszer alatti védelmi igényhez kapcsolódik. @hu
toolkit definition: A copyright- vagy szerzőijog-időpontok magukba foglalják a fonogram-időpontokat, azaz a hangfelvételekre vonatkozó védelmi követelésekhez kötődő időpontokat. @hu
scope note: Copyright-vuosi käsittää phonogram-vuoden, joka liittyy äänitallenteiden copyright-suojaukseen. @fi
label: copyright-vuosi @fi
label: har tidsrom for copyright @no
definition: Relaterer en manifestasjon til et tidsrom knyttet til krav om copyrightbeskyttelse eller lignende ordning. @no
scope note: Et tidsrom for copyright inkluderer tidsrom for fonogram som er knyttet til et krav om beskyttelse for et lydopptak. @no
label: heeft copyrightdatum @nl
definition: Relateert een manifestatie aan een tijdspanne geassocieerd met een claim van bescherming onder copyright of soortgelijk stelsel. @nl
label: له تاريخ حق النشر @ar
definition: يربط بين تجسيدة وفترة زمنية مرتبطة بفترة حماية حقوق النشر أو أي نظام حماية آخر. @ar
scope note: تاريخ حقوق النشر يشمل تاريخ التسجيل الصوتي المرتبط بإعلان الحماية الخاص بالتسجيل الصوتي. @ar
toolkit label: تاريخ حق النشر @ar
toolkit definition: فترة زمنية مرتبطة بفترة حماية حقوق النشر أو أي نظام حماية آخر. @ar
label: copyright'i aasta @et
definition: Seostab kehastuse ajavahemikuga, mis on seotud autoriõiguse vms õigusrežiimi kaitsega. @et
scope note: Copyright'i aasta hõlmab ka fonogrammi aastat, mis on seotud helisalvestise õiguskaitsega. @et
toolkit label: copyright'i aasta @et
toolkit definition: Ajavahemik, mis on seotud autoriõiguse vms õigusrežiimi kaitsega. @et
label: ha come data di copyright @it
definition: Correla una manifestazione a un arco di tempo associato a una dichiarazione di protezione sotto copyright o un regime simile. @it
scope note: La data di copyright comprende una data di phonogram, associata a dichiarazioni di protezione per registrazioni audio. @it
toolkit label: data di copyright @it

has creator agent of manifestation
status: Published
lexical alias: creatorAgentOfManifestation.en
definition: Relates a manifestation to an agent who is responsible for the embodiment of one or more expressions.
scope note: A creator of manifestation includes a manufacturer, producer, and publisher.
toolkit label: creator agent of manifestation
toolkit definition: An agent who is responsible for the embodiment of one or more expressions.
type: Property
domain: C10007
sub property of: has related agent of manifestation
has element type: 2
label: manifestaation tekijä (toimija) @fi
definition: Liittää manifestaatioon toimijaan, joka on vastuussa yhden tai useamman ekspression ilmiasusta. @fi
scope note: Manifestaation tekijä sisältää jakelijan, valmistajan, tuottajan ja kustantajan. @fi
toolkit label: manifestaation tekijä (toimija) @fi
toolkit definition: Toimija, joka on vastuussa yhden tai useamman ekspression ilmiasusta. @fi
label: har skaper av manifestasjon (agent) @no
definition: Relaterer en manifestasjon til en agent som er ansvarlig for realiseringen av ett eller flere uttrykk. @no
scope note: En skaper av en manifestasjon inkluderer distributør, tilvirker, produsent og utgiver. @no
toolkit label: skaper av manifestasjon (agent) @no
toolkit definition: En agent som er ansvarlig for realiseringen av ett eller flere uttrykk. @no
label: a pour agent créateur d’une manifestation @fr
definition: Met une manifestation en relation avec un agent qui est responsable de la matérialisation d’une ou plusieurs expressions. @fr
scope note: Un créateur d’une manifestation comprend un fabricant, un producteur et un éditeur. @fr
toolkit label: agent créateur d’une manifestation @fr
toolkit definition: Agent qui est responsable de la matérialisation d’une ou plusieurs expressions. @fr
label: heeft maker-actor van manifestatie @nl
definition: Relateert een manifestatie aan een actor die verantwoordelijk is voor de verwezenlijking van een of meer expressies. @nl
scope note: Een maker van manifestatie omvat een vervaardiger, producent en uitgever. @nl
toolkit label: maker-actor van manifestatie @nl
toolkit definition: Een actor die verantwoordelijk is voor de verwezenlijking van een of meer expressies. @nl
label: له وكيل منشئ لتجسيدة @ar
definition: يربط بين تجسيدة ووكيل مسئول عن عملية تجسيد تعبيرة أو أكثر. @ar
scope note: يشتمل منشئ التجسيدة على الموزع، والصانع، والمنتج، والناشر. @ar
toolkit label: وكيل منشئ لتجسيدة @ar
toolkit definition: وكيل مسئول عن عملية تجسيد تعبيرة أو أكثر. @ar
label: té com a agent creador d’una manifestació @ca
definition: Relaciona una manifestació amb un agent que és responsable de la materialització d’una o més expressions. @ca
scope note: Un creador d’una manifestació inclou un fabricant, un productor i un editor. @ca
toolkit label: agent creador d’una manifestació @ca
toolkit definition: Agent que és responsable de la materialització d’una o més expressions. @ca
label: har agent, som er ophav til manifestation @da
definition: Relaterer en manifestation til en agent, som er ansvarlig for realiseringen af et eller flere udtryk. @da
scope note: Ophav til manifestation omfatter distrubutør, producent, producer og udgiver ect. @da
toolkit label: agent, som er ophav til manifestation @da
toolkit definition: Agent, som er ansvarlig for realiseringen af et eller flere udtryk. @da
label: kehastuse teostaja (tegija) @et
definition: Seostab kehastuse tegijaga, kes vastutab ühe või mitme väljenduse teostamise eest kehastusena. @et
scope note: Kehastuse teostaja hõlmab levitajat, valmistajat, tootjat ja kirjastajat. @et
toolkit label: kehastuse teostaja (tegija) @et
toolkit definition: Tegija, kes vastutab ühe või mitme väljenduse teostamise eest kehastusena. @et
label: hat Mitwirkende/Mitwirkenden an einer Manifestation (Akteur) @de
definition: Setzt eine Manifestation in Beziehung zu einem Akteur, der für die Verkörperung einer Expression oder mehrerer Expressionen verantwortlich ist. @de
scope note: Darunter fallen Hersteller, Produzentinnen/Produzenten und Verlage. @de
toolkit label: Mitwirkende/Mitwirkender an einer Manifestation (Akteur) @de
toolkit definition: Ein Akteur, der für die Verkörperung einer Expression oder mehrerer Expressionen verantwortlich ist. @de
label: megjelenési forma létrehozó ágense a következő: @hu
definition: Hozzákapcsol egy megjelenési formát egy ágenshez, amely felelős egy vagy több kifejezési forma megtestesüléséért. @hu
scope note: megjelenési forma létrehozó ágense: @hu
toolkit label: Egy megjelenési forma létrehozója magában foglalja a gyártót, az előállítót és a kiadót. @hu
toolkit definition: Egy ágens, amely felelős egy vagy több kifejezési forma megtestesüléséért. @hu
label: manifestācijas radītājs (aģents) @lv
definition: Sasaista manifestāciju ar aģentu, kas ir atbildīgs par vienas vai vairāku izteiksmju ietveršanu. @lv
scope note: Manifestācijas radītāji ir arī izplatītāji, ražotāji, izgatavotāji un izdevēji. @lv
toolkit label: manifestācijas radītājs (aģents) @lv
toolkit definition: Aģents, kas ir atbildīgs par vienas vai vairāku izteiksmju ietveršanu. @lv
label: 有载体表现的创建者行为者 @zh-hans
definition: 将一种载体表现与负责一种或多种内容表达之具体化的一个行为者关联起来。 @zh-hans
scope note: 载体表现的创建者包括生产者、制作者和出版者 @zh-hans
toolkit label: 载体表现的创建者行为者 @zh-hans
toolkit definition: 负责一种或多种内容表达之具体化的一个行为者 @zh-hans
label: gösterimin yaratıcı temsilcisi ile ilişkilidir @tr
definition: Bir gösterimi, bir veya daha fazla gösterimin somutlaştırılmasından sorumlu olan bir temsilciyle ilişkilendirir. @tr
scope note: Gösterimin yaratıcısı, bir üretimci, yapımcı ve yayıncıyı içerir. @tr
toolkit label: gösterimin yaratıcı temsilcisi @tr
toolkit definition: Bir veya daha fazla öğenin somutlaştırılmasından sorumlu bir temsilci. @tr
label: tiene agente creador de manifestación @es
definition: Relaciona una manifestación con un agente que es responsable de la encarnación de una o más expresiones. @es
scope note: Un creador de manifestación incluye un fabricante, un productor y un editor. @es
toolkit label: agente creador de manifestación @es

has creator collective agent of manifestation
status: Published
lexical alias: creatorCollectiveAgentOfManifestation.en
definition: Relates a manifestation to a collective agent who is responsible for the embodiment of one or more expressions.
toolkit label: creator collective agent of manifestation
toolkit definition: A collective agent who is responsible for the embodiment of one or more expressions.
type: Property
domain: C10007
has element type: 2
sub property of: has related collective agent of manifestation
sub property of: has creator agent of manifestation
scope note: A creator of manifestation includes a manufacturer, producer, and publisher.
label: manifestaation tekijä (yhteistoimija) @fi
definition: Liittää manifestaatioon yhteistoimijaan, joka on vastuussa yhden tai useamman ekspression ilmiasusta. @fi
scope note: Manifestaation tekijä sisältää jakelijan, valmistajan, tuottajan ja kustantajan. @fi
toolkit label: manifestaation tekijä (yhteistoimija) @fi
toolkit definition: Yhteistoimija, joka on vastuussa yhden tai useamman ekspression ilmiasusta. @fi
label: har skaper av manifestasjon (kollektiv agent) @no
definition: Relaterer en manifestasjon til en kollektiv agent som er ansvarlig for realiseringen av ett eller flere uttrykk. @no
scope note: En skaper av en manifestasjon inkluderer distributør, tilvirker, produsent og utgiver. @no
toolkit label: skaper av manifestasjon (kollektiv agent) @no
toolkit definition: En kollektiv agent som er ansvarlig for realiseringen av ett eller flere uttrykk. @no
label: a pour agent collectif créateur d’une manifestation @fr
definition: Met une manifestation en relation avec un agent collectif qui est responsable de la matérialisation d’une ou plusieurs expressions. @fr
scope note: Un créateur d’une manifestation comprend un fabricant, un producteur et un éditeur. @fr
toolkit label: agent collectif créateur d’une manifestation @fr
toolkit definition: Agent collectif qui est responsable de la matérialisation d’une ou plusieurs expressions. @fr
label: heeft maker-collectieve actor van manifestatie @nl
definition: Relateert een manifestatie aan een collectieve actor die verantwoordelijk is voor de productie van het papier gebruikt voor de vervaardiging van een manifestatie. @nl
scope note: Een maker van manifestatie omvat een vervaardiger, producent en uitgever. @nl
toolkit label: maker-collectieve actor van manifestatie @nl
toolkit definition: Een collectieve actor die verantwoordelijk is voor de productie van het papier gebruikt voor de vervaardiging van een manifestatie. @nl
label: له وكيل جماعي منشئ لتجسيدة @ar
definition: يربط بين تجسيدة ووكيل جماعي مسئول عن عملية تجسيد تعبيرة أو أكثر. @ar
scope note: يشتمل منشئ التجسيدة على الموزع، والصانع، والمنتج، والناشر. @ar
toolkit label: وكيل جماعي منشئ لتجسيدة @ar
toolkit definition: وكيل جماعي مسئول عن عملية تجسيد تعبيرة أو أكثر. @ar
label: té com a agent col·lectiu creador d’una manifestació @ca
definition: Relaciona una manifestació amb un agent col·lectiu que és responsable de la materialització d’una o més expressions. @ca
scope note: Un creador d’una manifestació inclou un distribuïdor, un fabricant, un productor i un editor. @ca
toolkit label: agent col·lectiu creador d’una manifestació @ca
toolkit definition: Agent col·lectiu que és responsable de la materialització d’una o més expressions. @ca
label: har kollektiv agent, som er ophav til manifestation @da
definition: Relaterer en manifestation til en kollektiv agent, som er ansvarlig for realiseringen af et eller flere udtryk. @da
scope note: Ophav til manifestation omfatter distrubutør, producent, producer og udgiver ect. @da
toolkit label: kollektiv agent, som er ophav til manifestation @da
toolkit definition: Kollektiv agent, som er ansvarlig for realiseringen af et eller flere udtryk. @da
label: kehastuse teostaja (kollektiiv) @et
definition: Seostab kehastuse kollektiiviga, kes vastutab ühe või mitme väljenduse teostamise eest kehastusena. @et
scope note: Kehastuse teostaja hõlmab levitajat, valmistajat, tootjat ja kirjastajat. @et
toolkit label: kehastuse teostaja (kollektiiv) @et
toolkit definition: Kollektiiv, kes vastutab ühe või mitme väljenduse kehastuse teostamise eest. @et
label: hat Mitwirkende/Mitwirkenden an einer Manifestation (Gemeinschaftlicher Akteur) @de
definition: Setzt eine Manifestation in Beziehung zu einem gemeinschaftlichen Akteur, der für die Verkörperung einer Expression oder mehrerer Expressionen verantwortlich ist. @de
scope note: Darunter fallen Hersteller, Produzentinnen/Produzenten und Verlage. @de
toolkit label: Mitwirkende/Mitwirkender an einer Manifestation (Gemeinschaftlicher Akteur) @de
toolkit definition: Ein gemeinschaftlicher Akteur, der für die Verkörperung einer Expression oder mehrerer Expressionen verantwortlich ist. @de
label: megjelenési forma létrehozó kollektív ágense a következő: @hu
definition: Hozzákapcsol egy megjelenési formát egy kollektív ágenshez, amely felelős egy vagy több kifejezési forma megtestesüléséért. @hu
scope note: Egy megjelenési forma létrehozója magában foglalja a gyártót, az előállítót és a kiadót. @hu
toolkit label: megjelenési forma létrehozó kollektív ágense: @hu
toolkit definition: Egy kollektív ágens, amely felelős egy vagy több kifejezési forma megtestesüléséért. @hu
label: ha come creatore di manifestazione agente collettivo @it
definition: Correla una manifestazione all'agente collettivo responsabile della materializzazione di una o più espressioni. @it
scope note: Un creatore di manifestazione comprende un distributore, manifattura, produttore e editore. @it
toolkit label: creatore di manifestazione agente collettivo @it
toolkit definition: Agente collettivo responsabile della materializzazione di una o più espressioni. @it
label: manifestācijas radītājs (grupa) @lv
definition: Sasaista manifestāciju ar grupu, kas ir atbildīga par vienas vai vairāku izteiksmju ietveršanu. @lv
toolkit label: manifestācijas radītājs (grupa) @lv
toolkit definition: Grupa, kas ir atbildīga par vienas vai vairāku izteiksmju ietveršanu. @lv
scope note: Manifestācijas radītāji ir arī izplatītāji, ražotāji, izgatavotāji un izdevēji. @lv
label: 有载体表现的创建者集体行为者 @zh-hans
definition: 将一种载体表现与负责一种或多种内容表达之具体化的一个集体行为者关联起来。 @zh-hans
toolkit label: 载体表现的创建者集体行为者 @zh-hans
toolkit definition: 负责一种或多种内容表达之具体化的一个集体行为者 @zh-hans
scope note: 载体表现的创建者包括生产者、制作者和出版者 @zh-hans
label: gösterimin yaratıcı kolektif temsilcisi ile ilişkilidir @tr
definition: Bir gösterimi, bir veya daha fazla anlatımın somutlaştırılmasından sorumlu olan kolektif bir temsilciyle ilişkilendirir. @tr
toolkit label: gösterimin yaratıcı kolektif temsilcisi @tr

has creator corporate body of manifestation
status: Published
lexical alias: creatorCorporateBodyOfManifestation.en
definition: Relates a manifestation to a corporate body who is responsible for the embodiment of one or more expressions.
toolkit label: creator corporate body of manifestation
toolkit definition: A corporate body who is responsible for the embodiment of one or more expressions.
type: Property
domain: C10007
has element type: 2
sub property of: has related corporate body of manifestation
sub property of: has creator collective agent of manifestation
scope note: A creator of manifestation includes a manufacturer, producer, and publisher.
label: manifestaation tekijä (yhteisö) @fi
definition: Liittää manifestaatioon yhteisöön, joka on vastuussa yhden tai useamman ekspression ilmiasusta. @fi
scope note: Manifestaation tekijä sisältää jakelijan, valmistajan, tuottajan ja kustantajan. @fi
toolkit label: manifestaation tekijä (yhteisö) @fi
toolkit definition: Yhteisö, joka on vastuussa yhden tai useamman ekspression ilmiasusta. @fi
label: har skaper av manifestasjon (korporasjon) @no
definition: Relaterer en manifestasjon til en korporasjon som er ansvarlig for realiseringen av ett eller flere uttrykk. @no
scope note: En skaper av en manifestasjon inkluderer distributør, tilvirker, produsent og utgiver. @no
toolkit label: skaper av manifestasjon (korporasjon) @no
toolkit definition: En korporasjon som er ansvarlig for realiseringen av ett eller flere uttrykk. @no
label: a pour collectivité créatrice d’une manifestation @fr
definition: Met une manifestation en relation avec une collectivité qui est responsable de la matérialisation d’une ou plusieurs expressions. @fr
scope note: Un créateur d’une manifestation comprend un fabricant, un producteur et un éditeur. @fr
toolkit label: collectivité créatrice d’une manifestation @fr
toolkit definition: Collectivité qui est responsable de la matérialisation d’une ou plusieurs expressions. @fr
label: heeft maker-corporatie van manifestatie @nl
definition: Relateert een manifestatie aan een corporatie die verantwoordelijk is voor de productie van het papier gebruikt voor de vervaardiging van een manifestatie. @nl
scope note: Een maker van manifestatie omvat een vervaardiger, producent en uitgever. @nl
toolkit label: maker-corporatie van manifestatie @nl
toolkit definition: Een corporatie die verantwoordelijk is voor de productie van het papier gebruikt voor de vervaardiging van een manifestatie. @nl
label: له هيئة منشئ لتجسيدة @ar
definition: يربط بين تجسيدة وهيئة مسئولة عن عملية تجسيد تعبيرة أو أكثر. @ar
scope note: يشتمل منشئ التجسيدة على الموزع، والصانع، والمنتج، والناشر. @ar
toolkit label: هيئة منشئ لتجسيدة @ar
toolkit definition: هيئة مسئولة عن عملية تجسيد تعبيرة أو أكثر. @ar
label: té com a entitat corporativa creadora d’una manifestació @ca
definition: Relaciona una manifestació amb una entitat corporativa que és responsable de la materialització d’una o més expressions. @ca
scope note: Un creador d’una manifestació inclou un fabricant, un productor i un editor. @ca
toolkit label: entitat corporativa creadora d’una manifestació @ca
toolkit definition: Entitat corporativa que és responsable de la materialització d’una o més expressions. @ca
label: har korporation, som er ophav til manifestation @da
definition: Relaterer en manifestation til en korporation, som er ansvarlig for realiseringen af et eller flere udtryk. @da
scope note: Ophav til manifestation omfatter distrubutør, producent, producer og udgiver ect. @da
toolkit label: korporation, som er ophav til manifestation @da
toolkit definition: Korporation, som er ansvarlig for realiseringen af et eller flere udtryk. @da
label: kehastuse teostaja (asutus) @et
definition: Seostab kehastuse asutusega, kes vastutab ühe või mitme väljenduse teostamise eest kehastusena. @et
scope note: Kehastuse teostaja hõlmab levitajat, valmistajat, tootjat ja kirjastajat. @et
toolkit label: kehastuse teostaja (asutus) @et
toolkit definition: Asutus, kes vastutab ühe või mitme väljenduse kehastuse teostamise eest. @et
label: hat Mitwirkende/Mitwirkenden an einer Manifestation (Körperschaft) @de
definition: Setzt eine Manifestation in Beziehung zu einer Körperschaft, die für die Verkörperung einer Expression oder mehrerer Expressionen verantwortlich ist. @de
scope note: Darunter fallen Hersteller, Produzentinnen/Produzenten und Verlage. @de
toolkit label: Mitwirkende/Mitwirkender an einer Manifestation (Körperschaft) @de
toolkit definition: Eine Körperschaft, die für die Verkörperung einer Expression oder mehrerer Expressionen verantwortlich ist. @de
label: megjelenési forma létrehozó testülete a következő: @hu
definition: Hozzákapcsol egy megjelenési formát egy testülethez, amely felelős egy vagy több kifejezési forma megtestesüléséért. @hu
scope note: Egy megjelenési forma létrehozója magában foglalja a gyártót, az előállítót és a kiadót. @hu
toolkit label: megjelenési forma létrehozó testülete: @hu
toolkit definition: Egy testület, amely felelős egy vagy több kifejezési forma megtestesüléséért. @hu
label: ha come creatore di manifestazione ente @it
definition: Correla una manifestazione all'ente responsabile della materializzazione di una o più espressioni. @it
scope note: Un creatore di manifestazione comprende un distributore, manifattura, produttore e editore. @it
toolkit label: creatore di manifestazione ente @it
toolkit definition: Ente responsabile della materializzazione di una o più espressioni. @it
label: manifestācijas radītājs (institūcija) @lv
definition: Sasaista manifestāciju ar institūciju, kas ir atbildīga par vienas vai vairāku izteiksmju ietveršanu. @lv
toolkit label: manifestācijas radītājs (institūcija) @lv
toolkit definition: Institūcija, kas ir atbildīga par vienas vai vairāku izteiksmju ietveršanu. @lv
scope note: Manifestācijas radītāji ir arī izplatītāji, ražotāji, izgatavotāji un izdevēji. @lv
label: 有载体表现的创建者团体 @zh-hans
definition: 将一种载体表现与负责一种或多种内容表达之具体化的一个团体关联起来。 @zh-hans
toolkit label: 载体表现的创建者团体 @zh-hans
toolkit definition: 负责一种或多种内容表达之具体化的一个团体 @zh-hans
scope note: 载体表现的创建者包括生产者、制作者和出版者 @zh-hans
label: gösterimin yaratıcı tüzel kişisi ile ilişkilidir @tr
definition: Bir gösterimi, bir veya daha fazla ifadenin somutlaştırılmasından sorumlu tüzel kişiyle ilişkilendirir. @tr
toolkit label: gösterimin yaratıcı tüzel kişisi @tr

has creator family of manifestation
status: Published
lexical alias: creatorFamilyOfManifestation.en
definition: Relates a manifestation to a family who is responsible for the embodiment of one or more expressions.
toolkit label: creator family of manifestation
toolkit definition: A family who is responsible for the embodiment of one or more expressions.
type: Property
domain: C10007
has element type: 2
sub property of: has related family of manifestation
sub property of: has creator collective agent of manifestation
scope note: A creator of manifestation includes a manufacturer, producer, and publisher.
label: manifestaation tekijä (suku) @fi
definition: Liittää manifestaatioon sukuun, joka on vastuussa yhden tai useamman ekspression ilmiasusta. @fi
scope note: Manifestaation tekijä sisältää jakelijan, valmistajan, tuottajan ja kustantajan. @fi
toolkit label: manifestaation tekijä (suku) @fi
toolkit definition: Suku, joka on vastuussa yhden tai useamman ekspression ilmiasusta. @fi
label: har skaper av manifestasjon (familie) @no
definition: Relaterer en manifestasjon til en familie som er ansvarlig for realiseringen av ett eller flere uttrykk. @no
scope note: En skaper av en manifestasjon inkluderer distributør, tilvirker, produsent og utgiver. @no
toolkit label: skaper av manifestasjon (familie) @no
toolkit definition: En familie som er ansvarlig for realiseringen av ett eller flere uttrykk. @no
label: a pour famille créatrice d’une manifestation @fr
definition: Met une manifestation en relation avec une famille qui est responsable de la matérialisation d’une ou plusieurs expressions. @fr
scope note: Un créateur d’une manifestation comprend un fabricant, un producteur et un éditeur. @fr
toolkit label: famille créatrice d’une manifestation @fr
toolkit definition: Famille qui est responsable de la matérialisation d’une ou plusieurs expressions. @fr
label: heeft maker-familie van manifestatie @nl
definition: Relateert een manifestie aan een familie die verantwoordelijk is voor de verwezenlijking van één of meer expressies. @nl
scope note: Een maker van manifestatie omvat een vervaardiger, producent en uitgever. @nl
toolkit label: maker-familie van manifestatie @nl
toolkit definition: Een familie die verantwoordelijk is voor de verwezenlijking van één of meer expressies. @nl
label: له عائلة منشئ لتجسيدة @ar
definition: يربط بين تجسيدة وعائلة مسئولة عن عملية تجسيد تعبيرة أو أكثر. @ar
scope note: يشتمل منشئ التجسيدة على الموزع، والصانع، والمنتج، والناشر. @ar
toolkit label: عائلة منشئ لتجسيدة @ar
toolkit definition: عائلة مسئولة عن عملية تجسيد تعبيرة أو أكثر. @ar
label: té com a família creadora d’una manifestació @ca
definition: Relaciona una manifestació amb una família que és responsable de la materialització d’una o més expressions. @ca
scope note: Un creador d’una manifestació inclou un fabricant, un productor i un editor. @ca
toolkit label: família creadora d’una manifestació @ca
toolkit definition: Família que és responsable de la materialització d’una o més expressions. @ca
label: har familie, som er ophav til manifestation @da
definition: Relaterer en manifestation til en familie, som er ansvarlig for realiseringen af et eller flere udtryk. @da
scope note: Ophav til manifestation omfatter distrubutør, producent, producer og udgiver ect. @da
toolkit label: familie, som er ophav til manifestation @da
toolkit definition: Familie, som er ansvarlig for realiseringen af et eller flere udtryk. @da
label: kehastuse teostaja (perekond) @et
definition: Seostab kehastuse perekonnaga, kes vastutab ühe või mitme väljenduse teostamise eest kehastusena. @et
scope note: Kehastuse teostaja hõlmab levitajat, valmistajat, tootjat ja kirjastajat. @et
toolkit label: kehastuse teostaja (perekond) @et
toolkit definition: Perekond, kes vastutab ühe või mitme väljenduse teostamise eest kehastusena. @et
label: hat Mitwirkende/Mitwirkenden an einer Manifestation (Familie) @de
definition: Setzt eine Manifestation in Beziehung zu einer Familie, die für die Verkörperung einer Expression oder mehrerer Expressionen verantwortlich ist. @de
scope note: Darunter fallen Hersteller, Produzentinnen/Produzenten und Verlage. @de
toolkit label: Mitwirkende/Mitwirkenden an einer Manifestation (Familie) @de
toolkit definition: Eine Familie, die für die Verkörperung einer Expression oder mehrerer Expressionen verantwortlich ist. @de
label: megjelenési forma létrehozó családja a következő: @hu
definition: Hozzákapcsol egy megjelenési formát egy családhoz, amely felelős egy vagy több kifejezési forma megtestesüléséért. @hu
scope note: Egy megjelenési forma létrehozója magában foglalja a gyártót, az előállítót és a kiadót. @hu
toolkit label: megjelenési forma létrehozó családja: @hu
toolkit definition: Egy család, amely felelős egy vagy több kifejezési forma megtestesüléséért. @hu
label: ha come creatore di manifestazione famiglia @it
definition: Correla una manifestazione alla famiglia responsabile della materializzazione di una o più espressioni. @it
scope note: Un creatore di manifestazione comprende un distributore, manifattura, produttore e editore. @it
toolkit label: creatore di manifestazione famiglia @it
toolkit definition: Famiglia responsabile della materializzazione di una o più espressioni. @it
label: manifestācijas radītājs (dzimta/ģimene) @lv
definition: Sasaista manifestāciju ar dzimtu/ģimeni, kas ir atbildīga par vienas vai vairāku izteiksmju ietveršanu. @lv
toolkit label: manifestācijas radītājs (dzimta/ģimene) @lv
toolkit definition: Dzimta/ģimene, kas ir atbildīga par vienas vai vairāku izteiksmju ietveršanu. @lv
scope note: Manifestācijas radītāji ir arī izplatītāji, ražotāji, izgatavotāji un izdevēji. @lv
label: 有载体表现的创建者家族 @zh-hans
definition: 将一种载体表现与负责一种或多种内容表达之具体化的一个家族关联起来。 @zh-hans
toolkit label: 载体表现的创建者家族 @zh-hans
toolkit definition: 负责一种或多种内容表达之具体化的一个家族 @zh-hans
scope note: 载体表现的创建者包括生产者、制作者和出版者 @zh-hans
label: gösterimin yaratıcı ailesi ile ilişkilidir @tr
definition: Bir gösterimi, bir veya daha fazla ifadenin somutlaştırılmasından sorumlu aileyle ilişkilendirir. @tr
toolkit label: gösterimin yaratıcı ailesi @tr

has creator person of manifestation
status: Published
lexical alias: creatorPersonOfManifestation.en
definition: Relates a manifestation to a person who is responsible for the embodiment of one or more expressions.
toolkit label: creator person of manifestation
toolkit definition: A person who is responsible for the embodiment of one or more expressions.
type: Property
domain: C10007
has element type: 2
sub property of: has related person of manifestation
sub property of: has creator agent of manifestation
scope note: A creator of manifestation includes a manufacturer, producer, and publisher.
label: manifestaation tekijä (henkilö) @fi
definition: Liittää manifestaation henkilöön, joka on vastuussa yhden tai useamman ekspression ilmiasusta. @fi
scope note: Manifestaation tekijä sisältää jakelijan, valmistajan, tuottajan ja kustantajan. @fi
toolkit label: manifestaation tekijä (henkilö) @fi
toolkit definition: Henkilö, joka on vastuussa yhden tai useamman ekspression ilmiasusta. @fi
label: har skaper av manifestasjon (person) @no
definition: Relaterer en manifestasjon til en person som er ansvarlig for realiseringen av ett eller flere uttrykk. @no
scope note: En skaper av en manifestasjon inkluderer distributør, tilvirker, produsent og utgiver. @no
toolkit label: skaper av manifestasjon (person) @no
toolkit definition: En person som er ansvarlig for realiseringen av ett eller flere uttrykk. @no
label: a pour personne créatrice d’une manifestation @fr
definition: Met une manifestation en relation avec une personne qui est responsable de la matérialisation d’une ou plusieurs expressions. @fr
scope note: Un créateur d’une manifestation comprend un fabricant, un producteur et un éditeur. @fr
toolkit label: personne créatrice d’une manifestation @fr
toolkit definition: Personne qui est responsable de la matérialisation d’une ou plusieurs expressions. @fr
label: heeft maker-persoon van manifestatie @nl
definition: Relateert een manifestatie aan een persoon die verantwoordelijk is voor de verwezenlijking van één of meer expressies. @nl
scope note: Een maker van manifestatie omvat een vervaardiger, producent en uitgever. @nl
toolkit label: maker-persoon van manifestatie @nl
toolkit definition: Een persoon die verantwoordelijk is voor de verwezenlijking van één of meer expressies. @nl
label: له شخص منشيء لتجسيدة @ar
definition: يربط بين تجسيدة وشخص مسئول عن عملية تجسيد تعبيرة أو أكثر. @ar
scope note: يشتمل منشئ التجسيدة على الموزع، والصانع، والمنتج، والناشر. @ar
toolkit label: شخص منشيء لتجسيدة @ar
toolkit definition: شخص مسئول عن عملية تجسيد تعبيرة أو أكثر. @ar
label: té com a persona creadora d’una manifestació @ca
definition: Relaciona una manifestació amb una persona que és responsable de la materialització d’una o més expressions. @ca
scope note: Un creador d’una manifestació inclou un distribuïdor, un fabricant, un productor i un editor. @ca
toolkit label: persona creadora d’una manifestació @ca
toolkit definition: Persona que és responsable de la materialització d’una o més expressions. @ca
label: har person, som er ophav til manifestation @da
definition: Relaterer en manifestation til en person, som er ansvarlig for realiseringen af et eller flere udtryk. @da
scope note: Ophav til manifestation omfatter distrubutør, producent, producer og udgiver ect. @da
toolkit label: person, som er ophav til manifestation @da
toolkit definition: Person, som er ansvarlig for realiseringen af et eller flere udtryk. @da
label: kehastuse teostaja (isik) @et
definition: Seostab kehastuse isikuga, kes vastutab ühe või mitme väljenduse teostamise eest kehastusena. @et
scope note: Kehastuse teostaja hõlmab levitajat, valmistajat, tootjat ja kirjastajat. @et
toolkit label: kehastuse teostaja (isik) @et
toolkit definition: Isik, kes vastutab ühe või mitme väljenduse kehastuse teostamise eest. @et
label: hat Mitwirkende/Mitwirkenden an einer Manifestation (Person) @de
definition: Setzt eine Manifestation in Beziehung zu einer Person, die für die Verkörperung einer Expression oder mehrerer Expressionen verantwortlich ist. @de
scope note: Darunter fallen Hersteller, Produzentinnen/Produzenten und Verlage. @de
toolkit label: Mitwirkende/Mitwirkender an einer Manifestation (Person) @de
toolkit definition: Eine Person, die für die Verkörperung einer Expression oder mehrerer Expressionen verantwortlich ist. @de
label: megjelenési forma létrehozó személye a következő: @hu
definition: Hozzákapcsol egy megjelenési formát egy személyhez, aki felelős egy vagy több kifejezési forma megtestesüléséért. @hu
scope note: Egy megjelenési forma létrehozója magában foglalja a gyártót, az előállítót és a kiadót. @hu
toolkit label: megjelenési forma létrehozó személye: @hu
toolkit definition: Egy személy, aki felelős egy vagy több kifejezési forma megtestesüléséért. @hu
label: ha come creatore di manifestazione persona @it
definition: Correla una manifestazione alla persona responsabile della materializzazione di una o più espressioni. @it
scope note: Un creatore di manifestazione comprende un distributore, manifattura, produttore e editore. @it
toolkit label: creatore di manifestazione persona @it
toolkit definition: Persona responsabile della materializzazione di una o più espressioni. @it
label: manifestācijas radītājs (persona) @lv
definition: Sasaista manifestāciju ar personu, kura ir atbildīga par vienas vai vairāku izteiksmju ietveršanu. @lv
toolkit label: manifestācijas radītājs (persona) @lv
toolkit definition: Persona, kura ir atbildīga par vienas vai vairāku izteiksmju ietveršanu. @lv
scope note: Manifestācijas radītāji ir arī izplatītāji, ražotāji, izgatavotāji un izdevēji. @lv
label: 有载体表现的创建者个人 @zh-hans
definition: 将一种载体表现与负责一种或多种内容表达之具体化的一个个人关联起来。 @zh-hans
toolkit label: 载体表现的创建者个人 @zh-hans
toolkit definition: 负责一种或多种内容表达之具体化的一个个人 @zh-hans
scope note: 载体表现的创建者包括生产者、制作者和出版者 @zh-hans
label: gösterimin yaratıcısı ile ilişkilidir @tr
definition: Bir gösterimi, bir veya daha fazla anlatımın somutlaştırılmasından sorumlu olan bir kişiyle ilişkilendirir. @tr
toolkit label: gösterimin yaratıcısı @tr

is critique of (manifestation) (Deprecated)
status: Deprecated
type: Property
toolkit definition: A manifestation used as the basis for a critical evaluation. (Deprecated)
toolkit label: critique of (manifestation) (Deprecated)
definition: Relates a work to a manifestation used as the basis for a critical evaluation. (Deprecated)
sub property of: is description of (manifestation) (Deprecated)
lexical alias: critiqueOfManifestation.en
domain: C10001

has reduction ratio designation
status: Published
type: Property
lexical alias: reductionRatioDesignation.en
definition: Relates a manifestation to a general designation of the size of a micro-image in relation to the original from which it was produced.
domain: C10007
toolkit label: reduction ratio designation
toolkit definition: A general designation of the size of a micro-image in relation to the original from which it was produced.
instruction number: 3.15.1.5
toolkit label: aanduiding verkleiningfactor @nl
toolkit definition: Een algemene aanduiding van de grootte van een microbeeld in relatie tot het origineel waarvan het werd afgeleid. @nl
label: có định danh tỷ lệ thu nhỏ @vi
definition: Liên kết biểu thị với định danh chung của cỡ của hình ảnh thu nhỏ với nguyên gốc mà nó được tạo ra, @vi
toolkit label: định danh tỷ lệ thu nhỏ @vi
toolkit definition: Định danh chung của cỡ của hình ảnh thu nhỏ với nguyên gốc mà nó được tạo ra, @vi
label: har reduktionsforholdsbetegnelse @da
definition: Relaterer en manifestation til en almindelig betegnelse for størrelsen på et mikrobillede i forhold til den original, som det er fremstillet ud fra. @da
toolkit label: reduktionsforholdsbetegnelse @da
toolkit definition: Almindelig betegnelse for størrelsen på et mikrobillede i forhold til den original, som det er fremstillet ud fra. @da
label: hat Bezeichnung des Verkleinerungsfaktors @de
definition: Setzt eine Manifestation in Beziehung zu einer allgemeinen Bezeichnung für die Größe eines Mikro-Bilds im Verhältnis zum Original, von dem es hergestellt wird. @de
toolkit label: Bezeichnung des Verkleinerungsfaktors @de
toolkit definition: Eine allgemeine Bezeichnung für die Größe eines Mikro-Bilds im Verhältnis zum Original, von dem es hergestellt wird. @de
label: té com a designació d’escala de reducció @ca
definition: Relaciona una manifestació amb una designació general de la mida d’una microimatge en relació a l’original a partir del qual s’ha produït. @ca
toolkit label: designació d’escala de reducció @ca
toolkit definition: Designació general de la mida d’una microimatge en relació a l’original a partir del qual s’ha produït. @ca
definition: Liittää manifestaation yleiseen määritteeseen, joka ilmaisee mikrokokoiseksi pienennetyn kuvan suhteen alkuperäiseen kuvaan, josta pienennetty kuva on tuotettu. @fi
toolkit label: pienennyssuhteen määrite @fi
toolkit definition: Yleinen määrite, joka ilmaisee mikrokokoiseksi pienennetyn kuvan suhteen alkuperäiseen kuvaan, josta pienennetty kuva on tuotettu. @fi
toolkit label: betegnelse for reduksjonsrate @no
toolkit definition: En generell betegnelse for størrelsen på et mikrobilde i forhold til originalen som det ble produsert fra. @no
label: έχει προσδιορισμό του λόγου σμίκρυνσης @el
definition: Συνδέει μια εκδήλωση με έναν γενικό προσδιορισμό του μεγέθους μιας μικρο-εικόνας σε σχέση με το πρωτότυπο από το οποίο παρήχθη. @el
toolkit label: προσδιορισμός του λόγου σμίκρυνσης @el
toolkit definition: Ένας γενικός προσδιορισμός του μεγέθους μιας μικρο-εικόνας σε σχέση με το πρωτότυπο από το οποίο παρήχθη. @el
label: a pour désignation de facteur de réduction @fr
definition: Met une manifestation en relation avec une désignation générale de la taille d’une micro-image par rapport à celle de l’original à partir duquel elle a été produite. @fr
toolkit label: désignation de facteur de réduction @fr
toolkit definition: Désignation générale de la taille d’une micro-image par rapport à celle de l’original à partir duquel elle a été produite. @fr
has element type: 4
label: csökkenési arányjelölése a következő: @hu
definition: Hozzákapcsol egy megjelenési formát egy általános megjelöléshez, amely a mikrokép méretének az eredetiből viszonyított számarányára vonatkozik, amelyből azt előállították. @hu
toolkit label: csökkenési arányjelölése: @hu
toolkit definition: Egy általános megjelölés, amely a mikrokép méretének az eredetiből viszonyított számarányára vonatkozik, amelyből azt előállították. @hu
label: pienennyssuhteen määrite @fi
label: har betegnelse for reduksjonsrate @no
definition: Relaterer en manifestasjon til en generell betegnelse for størrelsen på et mikrobilde i forhold til originalen som det ble produsert fra. @no
label: heeft aanduiding verkleiningfactor @nl
definition: Relateert een manifestatie aan een algemene aanduiding van de grootte van een microbeeld in relatie tot het origineel waarvan het werd afgeleid. @nl
label: له تسمية نسبة تصغير الصور @ar
definition: يربط بين تجسيدة وتسمية عامة لحجم الصورة المصغرة وعلاقتها بالأصل الذي تم إنتاجها منه. @ar
toolkit label: تسمية نسبة تصغير الصور @ar
toolkit definition: تسمية عامة لحجم الصورة المصغرة وعلاقتها بالأصل الذي تم إنتاجها منه. @ar
label: vähendussuhte tähistus @et
definition: Seostab kehastuse mikrokujutise ja selle aluseks oleva originaali suuruse arvulise suhte üldise tähistusega. @et
toolkit label: vähendussuhte tähistus @et
toolkit definition: Mikrokujutise ja selle aluseks oleva originaali suuruse arvulise suhte üldine tähistus. @et
label: ha come designazione del rapporto di riduzione @it
definition: Correla una manifestazione a una designazione generale della dimensione di una microimmagine in relazione all'originale da cui è stata prodotta @it
toolkit label: designazione del rapporto di riduzione @it
toolkit definition: Designazione generale della dimensione di una microimmagine in relazione all'originale da cui è stata prodotta. @it
label: samazinājuma pakāpes apzīmējums @lv
definition: Sasaista manifestāciju ar vispārēju mikroattēla izmēru attiecību pret oriģināla izmēriem, no kura tas izgatavots. @lv
toolkit label: samazinājuma pakāpes apzīmējums @lv
toolkit definition: Vispārējs mikroattēla izmēru attiecība pret oriģināla izmēriem, no kura tas izgatavots. @lv
label: 有缩率标识 @zh-hans
definition: 将一种载体表现与缩微图像尺寸和其所复制的原件之间关系的一般标识关联起来。 @zh-hans
toolkit label: 缩率标识 @zh-hans
toolkit definition: 缩微图像尺寸和其所复制的原件之间关系的一般标识 @zh-hans
label: küçültme oranı tanımlaması ile ilişkilidir @tr
definition: Bir gösterimi, üretildiği orijinali ile ilişkili olarak bir mikro görüntünün boyutunun genel bir tanımıyla ilişkilendirir. @tr
toolkit label: indirgeme oranı tanımlaması @tr
toolkit definition: Üretildiği orijinale göre bir mikro görüntünün boyutunun genel bir tanımı. @tr
label: tiene designación de relación de reducción @es
definition: Relaciona una manifestación con una designación general del tamaño de una microimagen en relación con el original a partir del cual fue producida. @es
toolkit label: designación de relación de reducción @es
toolkit definition: Una designación general del tamaño de una microimagen en relación con el original a partir del cual fue producida. @es
has subproperty: P30263

has details of reduction ratio designation
status: Published
type: Property
lexical alias: detailsOfReductionRatioDesignation.en
definition: Relates a manifestation to details of a general designation of the size of a micro-image in relation to the original from which it was produced.
domain: C10007
instruction number: 3.15.1.5.1.4
toolkit label: details of reduction ratio designation
toolkit definition: Details of a general designation of the size of a micro-image in relation to the original from which it was produced.
toolkit label: detalles de la designación de la relación de reducción @es
toolkit definition: Detalles de una designación general del tamaño de una microimagen en relación con el original a partir del cual fue producida. @es
label: har detaljerad information om förminskningsgrad @sv
toolkit label: detaljerad information om förminskningsgrad @sv
toolkit label: details van benaming verkleiningsfactor @nl
toolkit definition: Details van de aanduiding van grootte van een microbeeld betreffende het origineel waarvan het werd afgeleid. @nl
label: có chi tiết của định danh tỷ lệ thu nhỏ @vi
definition: Liên kết biểu thị với chi tiết của tỷ số giữa độ lớn của hình ảnh thu nhỏ với nguyên gốc mà nó được tạo ra, @vi
toolkit label: chi tiết của định danh tỷ lệ thu nhỏ @vi
toolkit definition: Chi tiết của tỷ số giữa độ lớn của hình ảnh thu nhỏ với nguyên gốc mà nó được tạo ra, @vi
label: har detaljer om reduktionsforholdsbetegnelse @da
definition: Relaterer en manifestation til detaljer om en almindelig betegnelse for størrelsen på et mikrobillede i forhold til den original, som det er fremstillet ud fra. @da
toolkit label: detaljer om reduktionsforholdsbetegnelse @da
toolkit definition: Detaljer om en almindelig betegnelse for størrelsen på et mikrobillede i forhold til den original, som det er fremstillet ud fra. @da
label: hat Details zur Bezeichnung eines Verkleinerungsfaktors @de
definition: Setzt eine Manifestation in Beziehung zu den Details zu einer allgemeinen Bezeichnung für die Größe eines Mikro-Bilds im Verhältnis zum Original, von dem es hergestellt wird. @de
toolkit label: Details zur Bezeichnung eines Verkleinerungsfaktors @de
toolkit definition: Details zu einer allgemeinen Bezeichnung für die Größe eines Mikro-Bilds im Verhältnis zum Original, von dem es hergestellt wird. @de
label: té com a particularitats de designació d’escala de reducció @ca
definition: Relaciona una manifestació amb les particularitats d’una designació de la mida d’una microimatge en relació a l’original a partir del qual es va produir. @ca
toolkit label: particularitats de designació d’escala de reducció @ca
toolkit definition: Particularitats d’una designació de la mida d’una microimatge en relació a l’original a partir del qual es va produir. @ca
definition: Liittää manifestaation tarkempiin tietoihin yleisestä määritteestä, joka ilmaisee mikrokokoiseksi pienennetyn kuvan suhteen alkuperäiseen kuvaan, josta pienennetty kuva on tuotettu. @fi
toolkit label: pienennyssuhteen määritteen tarkemmat tiedot @fi
toolkit definition: Tarkemmat tiedot yleisestä määritteestä, joka ilmaisee mikrokokoiseksi pienennetyn kuvan suhteen alkuperäiseen kuvaan, josta pienennetty kuva on tuotettu. @fi
toolkit label: detaljer vedrørende betegnelse for reduksjonsrate @no
toolkit definition: Detaljer vedrørende en generell betegnelse for størrelsen på et mikrobilde i forhold til originalen som det ble produsert fra. @no
label: έχει λεπτομέρειες του προσδιορισμού του λόγου σμίκρυνσης @el
definition: Συνδέει μια εκδήλωση με τις λεπτομέρειες ενός γενικού προσδιορισμού του μεγέθους μιας μικρο-εικόνας με το πρωτότυπο από το οποίο παρήχθη. @el
toolkit label: λεπτομέρειες του προσδιορισμού του λόγου σμίκρυνσης @el
toolkit definition: Λεπτομέρειες ενός προσδιορισμού του μεγέθους μιας μικρο-εικόνας με το πρωτότυπο από το οποίο παρήχθη. @el
label: a pour particularités d’une désignation de facteur de réduction @fr
definition: Met une manifestation en relation avec des particularités d’une désignation générale de la taille d’une micro-image par rapport à celle de l’original à partir duquel elle a été produite. @fr
toolkit label: particularités d’une désignation de facteur de réduction @fr
toolkit definition: Particularités d’une désignation générale de la taille d’une micro-image par rapport à celle de l’original à partir duquel elle a été produite. @fr
has element type: 6
label: csökkenési arányjelölés részletei a következők: @hu
definition: Hozzákapcsol egy megjelenési formát azon általános megjelölés részleteihez, amely egy mikrokép nagyságát jelzi az eredetihez viszonyítva, amelyből azt előállították. @hu
toolkit label: csökkenési arányjelölés részletei: @hu
toolkit definition: Azon általános megjelölés részletei, amely egy mikrokép nagyságát jelzi az eredetihez viszonyítva, amelyből azt előállították. @hu
label: pienennyssuhteen määritteen tarkemmat tiedot @fi
label: har detaljer vedrørende betegnelse for reduksjonsrate @no
definition: Relaterer en manifestasjon til detaljer vedrørende en generell betegnelse for størrelsen på et mikrobilde i forhold til originalen som det ble produsert fra. @no
label: heeft details van benaming verkleiningsfactor @nl
definition: Relateert een manifestatie aan details van de aanduiding van grootte van een microbeeld betreffende het origineel waarvan het werd afgeleid. @nl
label: له تفاصيل عن تسمية نسبة تصغير الصور @ar
definition: يربط بين تجسيدة وتفاصيل تسمية عامة لحجم الصورة المصغرة وعلاقتها بالأصل الذي تم إنتاجها منه. @ar
toolkit label: تفاصيل عن تسمية نسبة تصغير الصور @ar
toolkit definition: تفاصيل تسمية عامة لحجم الصورة المصغرة وعلاقتها بالأصل الذي تم إنتاجها منه. @ar
label: vähendussuhte tähistuse täpsustus @et
definition: Seostab kehastuse täpsemate andmetega mikrokujutise ja selle aluseks oleva originaali suuruse arvulise suhte üldise tähistuse kohta. @et
toolkit label: vähendussuhte tähistuse täpsustus @et
toolkit definition: Täpsemad andmed mikrokujutise ja selle aluseks oleva originaali suuruse arvulise suhte üldise tähistuse kohta. @et
label: ha come particolari relativi alla designazione del rapporto di riduzione @it
definition: Correla una manifestazione ai particolari relativi a una designazione generale della dimensione di una microimmagine in relazione all'originale da cui è stata prodotta. @it
toolkit label: particolari relativi alla designazione del rapporto di riduzione @it
toolkit definition: Particolari relativi a una designazione generale della dimensione di una microimmagine in relazione all'originale da cui è stata prodotta. @it
label: detalizēti par reducēšanas noteikšanu @lv
definition: Sasaista manifestāciju ar sīkāku informāciju par mikroattēla oriģināla lieluma noteikšanu, no kura tas ticis ražots. @lv
toolkit label: detalizēti par reducēšanas noteikšanu @lv
toolkit definition: Sīkāka informācija par mikroattēla oriģināla lieluma noteikšanu, no kura tas ticis ražots. @lv
label: 有缩率标识细节 @zh-hans
definition: 将一种载体表现与缩微图像尺寸和其所复制的原件之间一般关系的标识的细节关联起来。 @zh-hans
toolkit label: 缩率标识细节 @zh-hans
toolkit definition: 缩微图像尺寸和其所复制的原件之间关系的标识的细节 @zh-hans
label: küçültme oranının ayrıntıları ile ilişkilidir @tr
definition: Bir gösterimi, üretildiği orijinal ile ilişkili olarak bir mikro görüntünün boyutunun genel bir tanımının ayrıntılarıyla ilişkilendirir. @tr
toolkit label: indirgeme oranı tanımının ayrıntıları @tr
toolkit definition: Üretildiği orijinale göre bir mikro görüntünün boyutunun genel tanımının ayrıntıları. @tr
label: tiene detalles de la designación de la relación de reducción @es
definition: Relaciona una manifestación con detalles de una designación general del tamaño de una microimagen en relación con el original a partir del cual fue producida. @es

has reduction ratio
status: Published
definition: Relates a manifestation to a numerical ratio of the size of a micro-image in relation to the original from which it was produced.
type: Property
domain: C10007
lexical alias: reductionRatio.en
instruction number: 3.15
toolkit label: reduction ratio
toolkit definition: A numerical ratio of the size of a micro-image in relation to the original from which it was produced.
label: a pour facteur de réduction @fr
definition: Met une manifestation en relation avec un rapport numérique entre la taille d’une micro-image et celle de l’original à partir duquel elle a été produite. @fr
toolkit label: facteur de réduction @fr
toolkit definition: Rapport numérique entre la taille d’une micro-image et celle de l’original à partir duquel elle a été produite. @fr
toolkit label: relación de reducción @es
toolkit definition: Una relación numérica del tamaño de una microimagen en relación con el original a partir del cual fue producida. @es
label: har förminskningsgrad @sv
toolkit label: förminskningsgrad @sv
toolkit label: verkleiningsfactor @nl
toolkit definition: Een numerieke verhouding van de grootte van een micro-beeld betreffende het origineel waarvan het werd afgeleid. @nl
label: có tỷ lệ thu nhỏ @vi
definition: Liên kết biểu thị với tỷ số giữa độ lớn của hình ảnh thu nhỏ với nguyên gốc mà nó được tạo ra, @vi
toolkit label: tỷ lệ thu nhỏ @vi
toolkit definition: Tỷ số giữa độ lớn của hình ảnh thu nhỏ với nguyên gốc mà nó được tạo ra, @vi
label: har reduktionsforhold @da
definition: Relaterer en manifestation til et numerisk forhold for størrelsen på et mikrobillede i forhold til den original, som det er fremstillet ud fra. @da
toolkit label: reduktionsforhold @da
toolkit definition: Numerisk forhold for størrelsen på et mikrobillede i forhold til den original, som det er fremstillet ud fra. @da
label: hat Verkleinerungsfaktor @de
definition: Setzt eine Manifestation in Beziehung zu einem Zahlenverhältnis zwischen der Größe eines Mikro-Bilds im Verhältnis zu dem Original, von dem es hergestellt wird. @de
toolkit label: Verkleinerungsfaktor @de
toolkit definition: Ein Zahlenverhältnis zwischen der Größe eines Mikro-Bilds im Verhältnis zu dem Original, von dem es hergestellt wird. @de
label: té com a escala de reducció @ca
definition: Relaciona una manifestació amb una escala numèrica de la mida d’una microimatge en relació a l’original a partir del qual s’ha produït. @ca
toolkit label: escala de reducció @ca
toolkit definition: Escala numèrica de la mida d’una microimatge en relació a l’original a partir del qual s’ha produït. @ca
definition: Liittää manifestaation numeeriseen suhdelukuun, joka ilmaisee mikrokokoiseksi pienennetyn kuvan suhteen alkuperäiseen kuvaan, josta pienennetty kuva on tuotettu. @fi
toolkit label: pienennyssuhde @fi
toolkit definition: Numeerinen suhdeluku, joka ilmaisee mikrokokoiseksi pienennetyn kuvan suhteen alkuperäiseen kuvaan, josta pienennetty kuva on tuotettu.. @fi
toolkit label: reduksjonsrate @no
toolkit definition: Et tallmessig forhold mellom størrelsen på et mikrobilde og originalen som det ble produsert fra. @no
label: έχει λόγο σμίκρυνσης @el
definition: Συνδέει μια εκδήλωση με μια αριθμητική αναλογία του μεγέθους μιας μικρο-εικόνας σε σχέση με την αρχική μορφή από την οποία παρήχθη. @el
toolkit label: λόγος σμίκρυνσης @el
toolkit definition: Μια αριθμητική αναλογία του μεγέθους μιας μικρο-εικόνας σε σχέση με την αρχική μορφή από την οποία παρήχθη. @el
has element type: 6
label: redukciós aránya a következő: @hu
definition: Hozzákapcsol egy megjelenési formát egy mikrokép méretének számarányához az eredetihez viszonyítva, amelyből azt előállították. @hu
toolkit label: redukciós aránya: @hu
toolkit definition: Egy mikrokép méretének számaránya az eredetihez viszonyítva, amelyből azt előállították. @hu
label: pienennyssuhde @fi
label: har reduksjonsrate @no
definition: Relaterer en manifestasjon til et tallmessig forhold mellom størrelsen på et mikrobilde og originalen som det ble produsert fra. @no
label: heeft verkleiningsfactor @nl
definition: Relateert een manifestatie aan een numerieke verhouding van de grootte van een micro-beeld betreffende het origineel waarvan het werd afgeleid. @nl
label: له معدل تصغير @ar
definition: يربط بين تجسيدة ونسبة في حجم صورمصغرة بالنسبة للأصل الذي انتجت منه. @ar
toolkit label: معدل تصغير @ar
toolkit definition: نسبة في حجم صورمصغرة بالنسبة للأصل الذي انتجت منه. @ar
label: vähendussuhe @et
definition: Seostab kehastuse mikrokujutise ja selle aluseks oleva originaali suuruse arvulise suhtega. @et
toolkit label: vähendussuhe @et
toolkit definition: Mikrokujutise ja selle aluseks oleva originaali suuruse arvuline suhe. @et
label: ha come rapporto di riduzione @it
definition: Correla una manifestazione a un rapporto numerico delle dimensioni di una microimmagine in relazione all'originale da cui è stata prodotta. @it
toolkit label: rapporto di riduzione @it
toolkit definition: Rapporto numerico delle dimensioni di una microimmagine in relazione all'originale da cui è stata prodotta. @it
label: samazinājuma pakāpe @lv
definition: Sasaista manifestāciju ar mikroattēla izmēru attiecību pret oriģināla izmēriem, no kura tas izgatavots. @lv
toolkit label: samazinājuma pakāpe @lv
toolkit definition: Mikroattēla izmēru attiecība pret oriģināla izmēriem, no kura tas izgatavots. @lv
label: 有缩率 @zh-hans
definition: 将一种载体表现与缩微图像尺寸和其所复制的原件之间的数值比关联起来。 @zh-hans
toolkit label: 缩率 @zh-hans
toolkit definition: 缩微图像尺寸和其所复制的原件之间的数值比 @zh-hans
label: küçültme oranı ile ilişkilidir @tr
definition: Bir gösterimi, mikro görüntünün boyutunun orijinal görüntüye göre sayısal bir oranıyla ilişkilendirir @tr
toolkit label: indirgeme oranı @tr
toolkit definition: Bir mikro görüntünün boyutunun, üretildiği orijinal görüntüye göre sayısal oranı. @tr
label: tiene relación de reducción @es
definition: Relaciona una manifestación con una relación numérica del tamaño de una microimagen en relación con el original a partir del cual fue producida. @es

has date of manifestation
status: Published
type: Property
lexical alias: dateOfManifestation.en
definition: Relates a manifestation to a timespan during which a published manifestation is published, released, issued, printed, duplicated, cast, or distributed, or an unpublished manifestation is inscribed, fabricated, constructed, or otherwise produced.
domain: C10007
toolkit label: date of manifestation
toolkit definition: A timespan during which a published manifestation is published, released, issued, printed, duplicated, cast, or distributed, or an unpublished manifestation is inscribed, fabricated, constructed, or otherwise produced.
sub property of: has related timespan of manifestation
has element type: 3
label: manifestaation ajankohta @fi
definition: Liittää manifestaation ajanjaksoon, jolloin julkaistu manifestaatio on kustannettu, julkaistu, ilmestynyt, painettu, monistettu, valettu kirjasinten osalta tai jaettu. Liittää manifestaation ajanjaksoon, jolloin julkaisematon manifestaatio on kaiverrettu, valmistettu, koottu tai muuten tuotettu. @fi
toolkit label: manifestaation ajankohta @fi
toolkit definition: Ajanjakso, jolloin julkaistu manifestaatio on kustannettu, julkaistu, ilmestynyt, painettu, monistettu, valettu kirjasinten osalta tai jaettu. Ajanjakso, jolloin julkaisematon manifestaatio on kaiverrettu, valmistettu, koottu tai muuten tuotettu. @fi
label: har tidspunkt for manifestasjon @no
definition: Relaterer en manifestasjon til et tidsrom hvor en publisert manifestasjon er utgitt, tilgjengeliggjort, utstedt, trykt, mangfoldiggjort, tildelt roller, distribuert etc., eller en upublisert manifestasjon er inskribert, fabrikkert, konstruert etc. @no
toolkit label: tidspunkt for manifestasjon @no
toolkit definition: Et tidsrom hvor en publisert manifestasjon er utgitt, tilgjengeliggjort, utstedt, trykt, mangfoldiggjort, tildelt roller, distribuert etc., eller en upublisert manifestasjon er inskribert, fabrikkert, konstruert etc. @no
label: a pour date d’une manifestation @fr
definition: Met une manifestation en relation avec un laps de temps pendant lequel une manifestation publiée est publiée, mise à disposition, éditée, imprimée, reproduite, moulée ou diffusée ou distribuée, ou une manifestation non publiée est écrite à la main, fabriquée, construite ou produite d’une autre manière. @fr
toolkit label: date d’une manifestation @fr
toolkit definition: Laps de temps pendant lequel une manifestation publiée est publiée, mise à disposition, éditée, imprimée, reproduite, moulée ou diffusée ou distribuée, ou une manifestation non publiée est écrite à la main, fabriquée, construite ou produite d’une autre manière. @fr
label: heeft datum van manifestatie @nl
definition: Relateert een manifestatie aan een tijdspanne gedurende welke een gepubliceerde manifestatie is uitgegeven, uitgebracht, uitgevaardigd, gedrukt, gedupliceerd, gegoten of gedistribueerd, of een ongepubliceerde manifestatie is afgeschreven, gefabriceerd, geconstrueerd of anderszins geproduceerd. @nl
toolkit label: datum van manifestatie @nl
toolkit definition: Een tijdspanne gedurende welke een gepubliceerde manifestatie is uitgegeven, uitgebracht, uitgevaardigd, gedrukt, gedupliceerd, gegoten of gedistribueerd, of een ongepubliceerde manifestatie is afgeschreven, gefabriceerd, geconstrueerd of anderszins geproduceerd. @nl
label: له تاريخ لتجسيدة @ar
definition: يربط بين تجسيدة وفترة زمنية تم خلالها نشر، أو إصدار، أو طباعة، أو إعادة طباعة، أو توزيع، إلخ. تجسيدة منشورة، أو تجسيدة غير منشورة تم تدوينها، أو تصنيعها، أو إنشائها، إلخ. @ar
toolkit label: تاريخ لتجسيدة @ar
toolkit definition: فترة زمنية تم خلالها نشر، أو إصدار، أو طباعة، أو إعادة طباعة، أو توزيع، إلخ. تجسيدة منشورة، أو تجسيدة غير منشورة تم تدوينها، أو تصنيعها، أو إنشائها، إلخ. @ar
label: té com a data de manifestació @ca
definition: Relaciona una manifestació amb un interval de temps durant el qual una manifestació publicada es publica, es posa en circulació, s’emet, s’imprimeix, es reprodueix, es modela o es distribueix o una manifestació no publicada s’inscriu, es fabrica, es construeix o es produeix d’una altra manera. @ca
toolkit label: data de manifestació @ca
toolkit definition: Interval de temps durant el qual una manifestació publicada es publica, es posa en circulació, s’emet, s’imprimeix, es reprodueix, es modela o es distribueix o una manifestació no publicada s’inscriu, es fabrica, es construeix o es produeix d’una altra manera. @ca
label: har dato for manifestation @da
definition: Relaterer en manifestation til en tidsperiode, hvorunder en publiceret manifestation er publiceret, frigivet, udgivet, trykt, duplikeret, støbt, distribueret ect., eller hvorunder en upubliceret manifestation er indskrevet, fremstillet, konstrueret ect. @da
toolkit label: dato for manifestation @da
toolkit definition: Tidsperiode, hvorunder en publiceret manifestation er publiceret, frigivet, udgivet, trykt, duplikeret, støbt, distribueret ect., eller hvorunder en upubliceret manifestation er indskrevet, fremstillet, konstrueret ect. @da
label: kehastuse daatum @et
definition: Seostab kehastuse ajavahemikuga, mille jooksul avaldatud kehastus on avaldatud, välja lastud, välja antud, trükitud, paljundatud, valatud, levitatud vms, või avaldamata kehastus on inskribeeritud, toodetud, ehitatud vms. @et
toolkit label: kehastuse daatum @et
toolkit definition: Ajavahemik, mille jooksul avaldatud kehastus on avaldatud, välja lastud, välja antud, trükitud, paljundatud, valatud, levitatud vms, või avaldamata kehastus on inskribeeritud, toodetud, ehitatud vms. @et
label: hat Datum einer Manifestation @de
definition: Setzt eine Manifestation in Beziehung zu einem Zeitraum, in dem eine veröffentlichte Manifestation veröffentlicht, freigegeben, herausgegeben, gedruckt, vervielfältigt, gegossen oder vertrieben wird oder in dem eine unveröffentlichte Manifestation beschriftet, hergestellt, konstruiert wird oder anderweitig entsteht. @de
toolkit label: Datum einer Manifestation @de
toolkit definition: Ein Zeitraum, in dem eine veröffentlichte Manifestation veröffentlicht, freigegeben, herausgegeben, gedruckt, vervielfältigt, gegossen oder vertrieben wird oder in dem eine unveröffentlichte Manifestation beschriftet, hergestellt, konstruiert wird oder anderweitig entsteht. @de
label: megjelenési forma dátuma a következő: @hu
definition: Egy megjelenési formát hozzákapcsol egy időtartamhoz, amely alatt egy közzétett megjelenési formát közzétesznek, kiadnak, kibocsátanak, kinyomtatnak, sokszorosítanak, öntenek, terjesztenek stb., vagy egy kiadatlan megjelenési formába bejegyzést tesznek, gyártanak,megépítenek stb. @hu
toolkit label: megjelenési forma dátuma @hu
toolkit definition: Egy időtartam, amely alatt egy közzétett megjelenési formát közzétesznek, kiadnak, kibocsátanak, kinyomtatnak, sokszorosítanak, megformáznak, terjesztenek stb., vagy egy kiadatlan megjelenési formába bejegyezést tesznek, gyártanak, megépítenek stb. @hu
label: ha come data di manifestazione @it
definition: Correla una manifestazione a un arco di tempo durante il quale una manifestazione pubblicata è pubblicata, diffusa, emessa, stampata, duplicata, fusa, distribuita, etc., o una manifestazione non pubblicata è iscritta, fabbricata, costruita, etc. @it
toolkit label: data di manifestazione @it
toolkit definition: Arco di tempo durante il quale una manifestazione pubblicata è pubblicata, diffusa, emessa, stampata, duplicata, fusa, distribuita, etc., o una manifestazione non pubblicata è iscritta, fabbricata, costruita, etc. @it
label: manifestācijas datējums @lv
definition: Sasaista manifestāciju ar laikposmu, kurā publicētā manifestācija publicēta, izdota, izdrukāta, dublēta, tiražēta, izplatīta u.tml., vai nepublicētā manifestācija tiek ierakstīta, izgatavota, radīta u.tml. @lv
toolkit label: manifestācijas datējums @lv
toolkit definition: Laikposms, kurā publicētā manifestācija publicēta, izdota, izdrukāta, dublēta, tiražēta, izplatīta u.tml., vai nepublicētā manifestācija tiek ierakstīta, izgatavota, radīta u.tml. @lv
label: 有载体表现的日期 @zh-hans
definition: 将一种载体表现与一种出版载体表现被出版、发布、发行、印刷、复制、铸造或经销的时间段、或者一种非出版载体表现被镌刻、制造、构造或其他方式制作的时间段关联起来。 @zh-hans
toolkit label: 载体表现的日期 @zh-hans
toolkit definition: 一种出版载体表现被出版、发布、发行、印刷、复制、铸造或经销的时间段、或者一种非出版载体表现被镌刻、制造、构造或其他方式制作的时间段。 @zh-hans
label: gösterim tarihi ile ilişkilidir @tr
definition: Bir gösterimi, yayınlanan bir gösterimin yayınlandığı, piyasaya sürüldüğü, ihraç edildiği, basıldığı, çoğaltıldığı, dağıtıldığı veya yayınlanmamış bir gösterimin yazıldığı, üretildiği, inşa edildiği veya başka bir şekilde üretildiği bir zaman aralığıyla ilişkilendirir. @tr
toolkit label: gösterim tarihi @tr
toolkit definition: Yayımlanmış bir gösterimin yayınlandığı, piyasaya sürüldüğü, çıkarıldığı, basıldığı, çoğaltıldığı, döküldüğü veya dağıtıldığı ya da yayınlanmamış bir gösterimin yazıldığı, üretildiği, yapıldığı veya başka bir şekilde oluşturulduğu bir zaman aralığı. @tr
label: tiene fecha de manifestación @es
definition: Relaciona una manifestación con un período de tiempo durante el cual una manifestación publicada se publica, libera, emite, imprime, duplica, emite o distribuye, o una manifestación no publicada se inscribe, fabrica, construye o de otra manera produce. @es
toolkit label: fecha de manifestación @es
toolkit definition: Un período de tiempo durante el cual una manifestación publicada se publica, libera, emite, imprime, duplica, emite o distribuye, o una manifestación no publicada se inscribe, fabrica, construye o de otra manera produce. @es
has subproperty: has copyright date
has subproperty: has date of manufacture
has subproperty: has date of production
has subproperty: has date of publication
has subproperty: has date of distribution
has subproperty: P30278

is description of (manifestation) (Deprecated)
status: Deprecated
type: Property
toolkit definition: A manifestation described by a describing work. (Deprecated)
toolkit label: description of (manifestation) (Deprecated)
definition: Relates a work to a manifestation described by a describing work. (Deprecated)
sub property of: has descriptive manifestation relationship with (Deprecated)
lexical alias: descriptionOfManifestation.en
domain: C10001
has subproperty: is analysis of (manifestation) (Deprecated)
has subproperty: is commentary on (manifestation) (Deprecated)
has subproperty: is critique of (manifestation) (Deprecated)
has subproperty: is evaluation of (manifestation) (Deprecated)
has subproperty: is review of (manifestation) (Deprecated)

has descriptive manifestation relationship with (Deprecated)
status: Deprecated
type: Property
toolkit definition: A work that is a description of the manifestation. (Deprecated)
toolkit label: descriptive manifestation relationship (Deprecated)
definition: Relates a manifestation to a work that is a description of the manifestation. (Deprecated)
sub property of: has related manifestation of manifestation
lexical alias: descriptiveManifestationRelationship.en
domain: C10007
has subproperty: is description of (manifestation) (Deprecated)

has details of generation of audio recording (Deprecated)
status: Deprecated
type: Property
lexical alias: detailsOfGenerationOfAudioRecording.en
domain: C10007
instruction number: 3.10.2.4
toolkit label: details of generation of audio recording (Deprecated)
toolkit label: detalles de la generación de la grabación sonora @es
toolkit definition: Detalles de la relación entre un soporte de audio original y el soporte de una reproducción hecha del original (por ej., cinta maestra de duplicación, una impresión de prueba). @es
definition: Relates a manifestation to details of the relationship between an original audio carrier and the carrier of a reproduction made from the original.
sub property of: has details of generation

has details of generation of digital resource (Deprecated)
status: Deprecated
type: Property
lexical alias: detailsOfGenerationOfDigitalResource.en
domain: C10007
instruction number: 3.10.3.4
toolkit label: details of generation of digital resource (Deprecated)
toolkit label: detalles de la generaión del recurso digital @es
toolkit definition: Detalles de la relación entre el soporte original de un recurso digital y el soporte de una reproducción del original (por ej., máster derivado). @es
definition: Relates a manifestation to details of the relationship between an original carrier of a digital resource and the carrier of a reproduction made from the original.
sub property of: has details of generation

has details of generation of microform (Deprecated)
status: Deprecated
type: Property
lexical alias: detailsOfGenerationOfMicroform.en
domain: C10007
instruction number: 3.10.4.4
toolkit label: details of generation of microform (Deprecated)
toolkit label: detalles de la generación de la microforma @es
toolkit definition: Detalles de la relación entre el soporte original de una microforma y el soporte de una reproducción hecha del original (por ej., un máster de impresión). @es
definition: Relates a manifestation to details of the relationship between an original microform carrier and the carrier of a reproduction made from the original.
sub property of: has details of generation

has details of generation of motion picture film (Deprecated)
status: Deprecated
type: Property
lexical alias: detailsOfGenerationOfMotionPictureFilm.en
domain: C10007
instruction number: 3.10.5.4
toolkit label: details of generation of motion picture film (Deprecated)
toolkit label: detalles de la generación de la película cinematográfica @es
toolkit definition: Detalles de la relación entre un soporte original de una película cinematográfica como recurso y el soporte de la reproducción hecha del original (por ej., impreso de referencia). @es
definition: Relates a manifestation to details of the relationship between an original carrier of a motion picture film resource and the carrier of a reproduction made from the original.
sub property of: has details of generation

has details of generation of videotape (Deprecated)
status: Deprecated
type: Property
lexical alias: detailsOfGenerationOfVideotape.en
domain: C10007
instruction number: 3.10.6.4
toolkit label: details of generation of videotape (Deprecated)
toolkit label: detalles de la generación de la videocinta @es
toolkit definition: Detalles de la relación entre un soporte original de un recurso en videocinta y el soporte de una reproducción hecha del original (por ej., copia de exhibición). @es
definition: Relates a manifestation to details of the relationship between an original carrier of a videotape resource and the carrier of a reproduction made from the original.
sub property of: has details of generation

has details of production method for manuscript (Deprecated)
status: Deprecated
type: Property
lexical alias: detailsOfProductionMethodForManuscript.en
domain: C10007
toolkit definition: Details of a process used to produce an original manuscript or a copy. (Deprecated)
toolkit label: details of production method for manuscript (Deprecated)
definition: Relates a manifestation to details of a process used to produce an original manuscript or a copy. (Deprecated)
sub property of: has details of production method

has details of production method for tactile resource (Deprecated)
status: Deprecated
type: Property
lexical alias: detailsOfProductionMethodForTactileResource.en
domain: C10007
instruction number: 3.9.3.4
toolkit label: detalles del método de producción de un recurso táctil @es
toolkit definition: Detalles del proceso utilizado para producir un recurso táctil (por ej., repujado, termoformado). @es
definition: Relates a manifestation to details of a process used to produce a tactile resource. (Deprecated)
sub property of: has details of production method

has digital file characteristic
status: Published
definition: Relates a manifestation to a technical specification relating to the digital encoding of text, image, audio, video, or other types of data in a manifestation.
type: Property
domain: C10007
lexical alias: digitalFileCharacteristic.en
instruction number: 3.19
toolkit label: digital file characteristic
toolkit definition: A technical specification relating to the digital encoding of text, image, audio, video, or other types of data in a manifestation.
label: a pour caractéristique de fichier numérique @fr
definition: Met une manifestation en relation avec une spécification technique relative à l’encodage numérique de données textuelles, image, audio, vidéo ou d’autres types dans une manifestation. @fr
toolkit label: caractéristique de fichier numérique @fr
toolkit definition: Spécification technique relative à l’encodage numérique de données textuelles, image, audio, vidéo ou d’autres types dans une manifestation. @fr
toolkit label: característica de archivo digital @es
toolkit definition: Una especificación técnica relativa a la codificación digital de texto, imagen, audio, video u otro tipo de datos en una manifestación. @es
label: har egenskaper för resursens digitala kodning @sv
toolkit label: egenskaper för resursens digitala kodning @sv
toolkit label: kenmerken digitale bestand @nl
toolkit definition: Een technische specificatie gerelateerd aan de digitale codering van tekst, beeld, geluid, video, of andere vormen van gegevens in een resource. @nl
label: có đặc trưng tệp số @vi
definition: Liên kết biểu thị với đặc tính kỹ thuật liên quan tới ghi mã kỹ thuật số cho văn bản, hình ảnh, audio, video, và các loại dữ liệu khác trong biểu thị. @vi
toolkit label: đặc trưng tệp số @vi
toolkit definition: Đặc tính kỹ thuật liên quan tới ghi mã kỹ thuật số cho văn bản, hình ảnh, audio, video, và các loại dữ liệu khác trong biểu thị. @vi
label: har digitale filkarakteristika @da
definition: Relaterer en manifestation til en teknisk specifikation, som relaterer til den digitale kodning af tekst, billede, audio-, video- og andre datatyper i en manifestation. @da
toolkit label: digitale filkarakteristika @da
toolkit definition: Teknisk specifikation, som relaterer til den digitale kodning af tekst, billede, audio-, video- og andre datatyper i en manifestation. @da
label: hat Eigenschaft einer digitalen Datei @de
definition: Setzt eine Manifestation in Beziehung zu einer technischen Spezifikation, die sich auf die digitale Kodierung von Text, Bild, Audio, Video oder anderen Datentypen in einer Manifestation bezieht. @de
toolkit label: Eigenschaft einer digitalen Datei @de
toolkit definition: Eine technische Spezifikation, die sich auf die digitale Kodierung von Text, Bild, Audio, Video oder anderen Datentypen in einer Manifestation bezieht. @de
label: té com a característica de fitxer digital @ca
definition: Relaciona una manifestació amb una especificació tècnica relativa a la codificació digital de text, d’imatge, d’àudio, de vídeo o d’altres tipus de dades d’una manifestació. @ca
toolkit label: característica de fitxer digital @ca
toolkit definition: Especificació tècnica relativa a la codificació digital de text, d’imatge, d’àudio, de vídeo o d’altres tipus de dades d’una manifestació. @ca
definition: Liittää manifestaation manifestaation sisältämän tekstin, kuvan, äänen, videon tai muun datan digitaaliseen koodauksen tekniseen määritykseen. @fi
toolkit label: digitaalisen tiedoston ominaisuus @fi
toolkit definition: Manifestaation sisältämän tekstin, kuvan, äänen, videon tai muun datan digitaaliseen koodauksen tekninen määritys. @fi
toolkit label: digtal filkarakteristikk @no
toolkit definition: En teknisk spesifikasjon knyttet til den digitale kodingen av tekst, bilder, lyd, video og andre typer data i en manifestasjon. @no
label: έχει χαρακτηριστικό του ψηφιακού αρχείου @el
definition: Συνδέει μια εκδήλωση με μια τεχνική προδιαγραφή που σχετίζεται με την ψηφιακή κωδικοποίηση του κειμένου, της εικόνας, του ήχου, του βίντεο και άλλων τύπων δεδομένων σε μια εκδήλωση. @el
toolkit label: χαρακτηριστικό ψηφιακού αρχείου @el
toolkit definition: Μια τεχνική προδιαγραφή που σχετίζεται με την ψηφιακή κωδικοποίηση του κειμένου, της εικόνας, του ήχου, του βίντεο και άλλων τύπων δεδομένων σε μια εκδήλωση. @el
has element type: 4
label: digitális fájl jellemzője a következő: @hu
definition: Hozzákapcsol egy megjelenési formát egy műszaki specifikációhoz, amely egy megjelenési formában a szöveg, kép, hang, videó és más adattípusok digitális kódolásához kapcsolódik. @hu
toolkit label: digitális fájl jellemzője: @hu
toolkit definition: Egy műszaki specifikáció, amely egy megjelenési formában a szöveg, kép, hang, videó és más adattípusok digitális kódolásához kapcsolódik. @hu
label: digitaalisen tiedoston ominaisuus @fi
label: har digtal filkarakteristikk @no
definition: Relaterer en manifestasjon til en teknisk spesifikasjon knyttet til den digitale kodingen av tekst, bilder, lyd, video og andre typer data i en manifestasjon. @no
label: heeft kenmerken digitale bestand @nl
definition: Relateert een manifestatie aan een technische specificatie gerelateerd aan de digitale codering van tekst, beeld geluid, video, of andere vormen van gegevens in een resource. @nl
label: له خاصية ملف رقمي @ar
definition: يربط بين تجسيدة وخصائص فنية متعلقة بالتكويد الرقمي لنص، وصورة، وصوت، وفيديو، وأي نوع بيانات آخر في تجسيدة. @ar
toolkit label: خاصية ملف رقمي @ar
toolkit definition: خصائص فنية متعلقة بالتكويد الرقمي لنص، وصورة، وصوت، وفيديو، وأي نوع بيانات آخر في تجسيدة. @ar
label: faili tunnus @et
definition: Seostab kehastuse tehnilise kirjeldusega, mis puudutab kehastuses sisalduva teksti, kujutise, heli, video jm tüüpi andmete digitaalset kodeeringut. @et
toolkit label: faili tunnus @et
toolkit definition: Tehniline kirjeldus, mis puudutab kehastuses sisalduva teksti, kujutise, heli, video jm tüüpi andmete digitaalset kodeeringut. @et
label: ha come caratteristica del file digitale @it
definition: Correla una manifestazione a una specifica tecnica relativa alla codifica digitale di testo, immagine, audio, video e altri tipi di dati in una manifestazione. @it
toolkit label: caratteristica del file digitale @it
toolkit definition: Specifica tecnica relativa alla codifica digitale di testo, immagine, audio, video e altri tipi di dati in una manifestazione. @it
label: datnes raksturojums @lv
definition: Sasaista manifestāciju ar manifestācijas tekstu, attēlu, audio, video un citu datu tipu digitālo kodējumu, piem., ieraksta blīvums, sektoru skaits. @lv
toolkit label: datnes raksturojums @lv
toolkit definition: Manifestācijas tekstu, attēlu, audio, video un citu datu tipu digitālais kodējums, piem., ieraksta blīvums, sektoru skaits. @lv
label: 有数字文件特征 @zh-hans
definition: 将一种载体表现与和一种载体表现中的文本、图像、音频、视频或其他类型数据的数字编码有关的一个技术规格关联起来。 @zh-hans
toolkit label: 数字文件特征 @zh-hans
toolkit definition: 和一种载体表现中的文本、图像、音频、视频或其他类型数据的数字编码有关的一个技术规格 @zh-hans
label: dijital dosya özelliği ile ilişkilidir @tr
definition: Bir gösterimi, bir gösterimdeki metin, görüntü, ses, video veya diğer veri türlerinin dijital olarak kodlanmasıyla ilgili teknik bir şartnameyle ilişkilendirir. @tr
toolkit label: dijital dosya özelliği @tr
toolkit definition: Bir gösterimde metin, görüntü, ses, video veya diğer veri türlerinin dijital olarak kodlanmasıyla ilgili teknik bir şartname. @tr
label: tiene característica de archivo digital @es
definition: Relaciona una manifestación con una especificación técnica relativa a la codificación digital de texto, imagen, audio, video u otro tipo de datos en una manifestación. @es

has details of digital file characteristic
status: Published
type: Property
lexical alias: detailsOfDigitalFileCharacteristic.en
definition: Relates a manifestation to details of a technical specification relating to the digital encoding of text, image, audio, video, or other types of data in a manifestation.
domain: C10007
instruction number: 3.19.1.4
toolkit label: details of digital file characteristic
toolkit definition: Details of a technical specification relating to the digital encoding of text, image, audio, video, or other types of data in a manifestation.
toolkit label: detalles de la característica del archivo digital @es
toolkit definition: Detalles de una especificación técnica relacionada con la codificación digital de texto, imagen, audio, video u otros tipos de datos en una manifestación. @es
label: har detaljerad information om egenskaper för resursens digitala kodning @sv
toolkit label: detaljerad information om egenskaper för resursens digitala kodning @sv
toolkit label: details van kenmerken digitaal bestand @nl
toolkit definition: Details van een technische specificatie gerelateerd aan de digitale codering van tekst, beeld, geluid, video, of andere soorten gegevens in een resource. @nl
label: có chi tiết của đặc trưng tệp số @vi
definition: Liên kết biểu thị với chi tiết của đặc tính kỹ thuật liên quan tới ghi mã văn bản, hình ảnh, audio, video, và các loại dữ liệu khác trong biểu hiện. @vi
toolkit label: chi tiết của đặc trưng tệp số @vi
toolkit definition: Chi tiết của đặc tính kỹ thuật liên quan tới ghi mã văn bản, hình ảnh, audio, video, và các loại dữ liệu khác trong biểu hiện. @vi
label: har detaljer om digitale filkarakteristika @da
definition: Relaterer en manifestation til detaljer om en teknisk specifikation, som relaterer til den digitale kodning af tekst, billede, audio-, video- og andre datatyper i en manifestation. @da
toolkit label: detaljer om digitale filkarakteristika @da
toolkit definition: Detaljer om en teknisk specifikation, som relaterer til den digitale kodning af tekst, billede, audio-, video- og andre datatyper i en manifestation. @da
label: hat Details zur Eigenschaft einer digitalen Datei @de
definition: Setzt eine Manifestation in Beziehung zu den Details zu einer technischen Spezifikation, die sich auf die digitale Kodierung von Text, Bild, Audio, Video oder anderen Datentypen in einer Manifestation bezieht. @de
toolkit label: Details zur Eigenschaft einer digitalen Datei @de
toolkit definition: Details zu einer technischen Spezifikation, die sich auf die digitale Kodierung von Text, Bild, Audio, Video oder anderen Datentypen in einer Manifestation bezieht. @de
label: té com a particularitats de característiques de fitxer digital @ca
definition: Relaciona una manifestació amb les particularitats d’una especificació tècnica relativa a la codificació digital de text, d’imatge, d’àudio, de vídeo o d’altres tipus de dades d’una manifestació. @ca
toolkit label: particularitats de característiques de fitxer digital @ca
toolkit definition: Particularitats d’una especificació tècnica relativa a la codificació digital de text, d’imatge, d’àudio, de vídeo o d’altres tipus de dades d’una manifestació. @ca
definition: Liittää manifestaation tarkempiin tietoihin manifestaation sisältämän tekstin, kuvan, äänen, videon tai muun datan digitaalisen koodauksen teknisestä määrityksestä. @fi
toolkit label: digitaalisen tiedoston ominaisuuksien tarkemmat tiedot @fi
toolkit definition: Tarkemmat tiedot manifestaation sisältämän tekstin, kuvan, äänen, videon tai muun datan digitaalisen koodauksen teknisestä määrityksestä. @fi
toolkit label: detaljer vedrørende egenskaper for digital fil @no
toolkit definition: Detaljer vedrørende en teknisk spesifikasjon angående den digitale kodingen av tekst, bilder, lyd, video og andre typer data i en manifestasjon. @no
label: έχει λεπτομέρειες του χαρακτηριστικού του ψηφιακού αρχείου @el
definition: Συνδέει μια εκδήλωση με τις λεπτομέρειες μιας τεχνικής προδιαγραφής που συνδέεται με την ψηφιακή κωδικοποίηση του κειμένου, της εικόνας, του ήχου, του βίντεο και άλλων τύπων δεδομένων σε μια εκδήλωση. @el
toolkit label: λεπτομέρειες του χαρακτηριστικού του ψηφιακού αρχείου @el
toolkit definition: Λεπτομέρειες μιας τεχνικής προδιαγραφής που συνδέεται με την ψηφιακή κωδικοποίηση του κειμένου, της εικόνας, του ήχου, του βίντεο και άλλων τύπων δεδομένων σε μια εκδήλωση. @el
label: a pour particularités d’une caractéristique de fichier numérique @fr
definition: Met une manifestation en relation avec des particularités d’une spécification technique relative à l’encodage numérique de données textuelles, image, audio, vidéo ou d’autres types dans une manifestation. @fr
toolkit label: particularités d’une caractéristique de fichier numérique @fr
toolkit definition: Particularités d’une spécification technique relative à l’encodage numérique de données textuelles, image, audio, vidéo ou d’autres types dans une manifestation. @fr
has element type: 6
label: digitális fájljellemzők részletei a következők: @hu
definition: Hozzákapcsol egy megjelenési formát egy megjelenési forma szövegének, képének, hangjának, videójának és más adattípusainak digitális kódolásához kapcsolódó műszaki specifikáció részleteihez. @hu
toolkit label: digitális fájljellemzők részletei: @hu
toolkit definition: Egy megjelenési forma szövegének, képének, hangjának, videójának és más adattípusainak digitális kódolásához kapcsolódó műszaki specifikáció részletei. @hu
label: digitaalisen tiedoston ominaisuuksien tarkemmat tiedot @fi
label: har detaljer vedrørende egenskaper for digital fil @no
definition: Relaterer en manifestasjon til detaljer vedrørende en teknisk spesifikasjon angående den digitale kodingen av tekst, bilder, lyd, video og andre typer data i en manifestasjon. @no
label: heeft details van kenmerken digitaal bestand @nl
definition: Relateert een manifestatie aan details van een technische specificatie gerelateerd aan de digitale codering van tekst, beeld, geluid, video, of andere soorten gegevens in een resource. @nl
label: له تفاصيل خاصية ملف رقمي @ar
definition: يربط بين تجسيدة وتفاصيل خصائص فنية متعلقة بالتكويد الرقمي لنص، وصورة، وصوت، وفيديو، وأي نوع بيانات آخر في تجسيدة. @ar
toolkit label: تفاصيل خاصية ملف رقمي @ar
toolkit definition: تفاصيل خصائص فنية متعلقة بالتكويد الرقمي لنص، وصورة، وصوت، وفيديو، وأي نوع بيانات آخر في تجسيدة. @ar
label: faili tunnuse täpsustus @et
definition: Seostab kehastuse täpsemate andmetega tehnilises kirjelduses, mis puudutab kehastuses sisalduva teksti, kujutise, heli, video jm tüüpi andmete digitaalset kodeeringut. @et
toolkit label: faili tunnuse täpsustus @et
toolkit definition: Täpsemad andmed tehnilises kirjelduses, mis puudutab kehastuses sisalduva teksti, kujutise, heli, video jm tüüpi andmete digitaalset kodeeringut. @et
label: ha come particolari relativi alle caratteristiche del file digitale @it
definition: Correla una manifestazione ai particolari relativi a una specifica tecnica relativa alla codifica digitale di testo, immagine, audio, video e altri tipi di dati in una manifestazione. @it
toolkit label: particolari relativi alle caratteristiche del file digitale @it
toolkit definition: Particolari relativi a una specifica tecnica relativa alla codifica digitale di testo, immagine, audio, video e altri tipi di dati in una manifestazione. @it
label: detalizēti par datnes raksturojumu @lv
definition: Sasaista manifestāciju ar sīkāku informāciju par resursa tekstu, attēlu, audio, video un citu datu tipu digitālo kodējumu manifestācijā. @lv
toolkit label: detalizēti par datnes raksturojumu @lv
toolkit definition: Sīkāka informācija par resursa tekstu, attēlu, audio, video un citu datu tipu digitālo kodējumu manifestācijā. @lv
label: 有数字文件特征的细节 @zh-hans
definition: 将一种载体表现与和一种载体表现中的文本、图像、音频、视频或其他类型数据的数字编码有关的一个技术规格的细节关联起来。 @zh-hans
toolkit label: 数字文件特征的细节 @zh-hans
toolkit definition: 和一种载体表现中的文本、图像、音频、视频或其他类型数据的数字编码有关的一个技术规格的细节 @zh-hans
label: dijital dosya özelliklerinin ayrıntıları ile ilişkilidir @tr
definition: Bir gösterimi, metin, görüntü, ses, video veya diğer veri türlerinin dijital olarak kodlanmasıyla ilgili bir teknik spesifikasyonun ayrıntılarıyla ilişkilidir. @tr
toolkit label: dijital dosya karakteristiğinin ayrıntıları @tr
toolkit definition: Bir gösterimdeki metin, görüntü, ses, video veya diğer veri türlerinin dijital kodlanmasıyla ilgili teknik bir özelliğin ayrıntıları. @tr
label: tiene detalles de la característica del archivo digital @es
definition: Relaciona una manifestación con detalles de una especificación técnica relacionada con la codificación digital de texto, imagen, audio, video u otros tipos de datos en una manifestación. @es

is digital transfer of item of
status: Published
type: Property
lexical alias: digitalTransferOfItemOf.en
definition: Relates a manifestation to an item in a digital format that is transferred to a manifestation in another digital format.
domain: C10007
sub property of: is reproduction of item of
toolkit label: digital transfer of item of
toolkit definition: An item in a digital format that is transferred to a manifestation in another digital format.
has element type: 2
alternative label: digital transfer of (item)
label: konvertoitu kappaleesta @fi
definition: Liittää manifestaation digitaalisessa muodossa olevaan kappaleeseen, joka muunnetaan toisessa digitaalisessa muodossa olevaksi manifestaatioksi. @fi
toolkit label: konvertoitu kappaleesta @fi
toolkit definition: Digitaalisessa muodossa oleva kappale, joka muunnetaan toisessa digitaalisessa muodossa olevaksi manifestaatioksi. @fi
label: er digital overføring av eksemplar av @no
definition: Relaterer en manifestasjon til et eksemplar i et digitalt format som overføres til en manifestasjon i et annet digitalt format. @no
toolkit label: digital overføring av eksemplar av @no
toolkit definition: Et eksemplar i et digitalt format som overføres til en manifestasjon i et annet digitalt format. @no
label: est un transfert numérique d’un item de @fr
definition: Met une manifestation en relation avec un item en format numérique qui est transféré vers une manifestation dans un format numérique différent. @fr
toolkit label: transfert numérique d’un item de @fr
toolkit definition: Item en format numérique qui est transféré vers une manifestation dans un format numérique différent. @fr
label: is digitale kopie van item van @nl
definition: Relateert een manifestatie aan een item in een digitaal formaat dat overgezet is naar een manifestatie in een ander digitaal formaat. @nl
toolkit label: digitale kopie van item van @nl
toolkit definition: Een item in een digitaal formaat dat overgezet is naar een manifestatie in een ander digitaal formaat. @nl
label: هو تحويل رقمي لمفردة لـ @ar
definition: يربط بين تجسيدة ومفردة في شكل رقمي تم تحويله إلى تجسيدة في شكل رقمي مختلف. @ar
toolkit label: تحويل رقمي لمفردة لـ @ar
toolkit definition: مفردة في شكل رقمي تم تحويله إلى تجسيدة في شكل رقمي مختلف. @ar
label: és transferència digital d’un ítem de @ca
definition: Relaciona una manifestació amb un ítem en un format digital que es transfereix a una manifestació en un altre format digital. @ca
toolkit label: transferència digital d’un ítem de @ca
toolkit definition: Ítem en un format digital que es transfereix a una manifestació en un altre format digital. @ca
label: er digital overførsel af eksemplar af @da
definition: Relaterer en manifestation til et eksemplar i et digitalt format, som overføres til en manifestation i et andet digitalt format. @da
toolkit label: digital overførsel af eksemplar af @da
toolkit definition: Eksemplar i et digitalt format, som overføres til en manifestation i et andet digitalt format. @da
label: konverteeritud digitaalsest eksemplarist @et
definition: Seostab kehastuse digitaalse eksemplariga, mis on konverteeritud teises digitaalvormingus kehastuseks. @et
toolkit label: konverteeritud digitaalsest eksemplarist @et
toolkit definition: Digitaalne eksemplar, mis on konverteeritud teises digitaalvormingus kehastuseks. @et
label: ist digitale Übertragung eines Exemplars von @de
definition: Setzt eine Manifestation in Beziehung zu einem Exemplar in einem digitalen Format, das in eine Manifestation in einem anderen digitalen Format übertragen wird. @de
toolkit label: Digitale Übertragung eines Exemplars von @de
toolkit definition: Ein Exemplar in einem digitalen Format, das in eine Manifestation in einem anderen digitalen Format übertragen wird. @de
label: digitális átvitele a következő példánynak: @hu
definition: Hozzákapcsol egy megjelenési formát egy digitális formátumú példányhoz, amelyet egy másik digitális formátumú megjelenési formára vittek át. @hu
toolkit label: digitális átvitele a következő példánynak: @hu
toolkit definition: Egy digitális formátumú példány, amelyet egy másik digitális formátumú megjelenési formára vittek át. @hu
label: è trasferimento digitale di item di @it
definition: Correla una manifestazione a un item in un formato digitale trasferito a una manifestazione in un formato digitale differente. @it
toolkit label: trasferimento digitale di item di @it
toolkit definition: Item in un formato digitale trasferito a una manifestazione in un formato digitale differente. @it
label: ir digitāls pārveidojums vienībai @lv
definition: Sasaista manifestāciju ar vienību digitālā formātā, kas transformēta par manifestāciju citā digitālā formātā. @lv
toolkit label: ir digitāls pārveidojums vienībai @lv
toolkit definition: Vienība digitālā formātā, kas transformēta par manifestāciju citā digitālā formātā. @lv
alternative label: konvertoitu kappale @fi
alternative label: نقل رقمي لــ (مفردة) @ar
alternative label: digital transfer af (eksemplar) @da
alternative label: Digitale Übertragung von (Exemplar) @de
alternative label: transferència digital de (ítem) @ca
alternative label: ……的数字转储（单件） @zh-hans
label: 是……的单件的数字转储 @zh-hans
definition: 将一种载体表现与被转储为另一种格式的一种载体表现的一种数字格式的一个单件关联起来。 @zh-hans
toolkit label: ……的单件的数字转储 @zh-hans
toolkit definition: 被转储为另一种格式的一种载体表现的一种数字格式的一个单件 @zh-hans
alternative label: transfert numérique de (item) @fr
alternative label: digitális átvitele a következőnek (példány): @hu
alternative label: (kopyanın) dijital aktarımı @tr
label: kopyasının dijital aktarımıdır @tr
definition: Bir gösterimi, başka bir dijital formattaki bir örneğe aktarılan dijital formattaki bir öğeyle ilişkilendirir. @tr
toolkit label: kopyanın dijital aktarımı @tr
toolkit definition: Dijital formatta olan ve başka bir dijital formattaki gösterime aktarılan bir kopya. @tr
alternative label: transferencia digital de (item) @es
label: es la transferencia digital del artículo de @es
toolkit label: transferencia digital del artículo de @es
toolkit definition: Un item en formato digital que se transfiere a una manifestación en otro formato digital. @es
has subproperty: P30298

has digital transfer of manifestation
status: Published
definition: Relates a manifestation to a manifestation in a digital format that results from the transfer of a manifestation in another digital format.
type: Property
domain: C10007
sub property of: is reproduced as manifestation
lexical alias: digitalTransferOfManifestation.en
toolkit label: digital transfer of manifestation
toolkit definition: A manifestation in a digital format that results from the transfer of a manifestation in another digital format.
label: a pour transfert numérique d’une manifestation @fr
definition: Met une manifestation en relation avec une manifestation en format numérique qui résulte du transfert d’une manifestation dans un format numérique différent. @fr
toolkit label: transfert numérique d’une manifestation @fr
toolkit definition: Manifestation en format numérique qui résulte du transfert d’une manifestation dans un format numérique différent. @fr
toolkit label: transferencia digital de manifestación @es
toolkit definition: Una manifestación en formato digital que resulta de la transferencia de una manifestación en otro formato digital. @es
instruction number: 24.5
toolkit label: digitale kopie van manifestatie @nl
toolkit definition: Een manifestatie in een digitaal formaat die het resultaat is van het overzetten van een manifestatie in een ander digitaal formaat. @nl
label: có chuyển dạng điện tử (biểu thị) @vi
definition: Liên kết biểu thị với biểu thị dưới định dạng số là kết quả chuyển đổi của biểu thị dưới định dạng số khác. @vi
toolkit label: chuyển dạng điện tử (biểu thị) @vi
toolkit definition: Biểu thị dưới định dạng số là kết quả chuyển đổi của biểu thị dưới định dạng số khác. @vi
label: har digital overførsel af manifestation @da
definition: Relaterer en manifestation til en manifestation i et digitalt format, som er resultatet af en overførsel af en manifestation i et andet digitalt format. @da
toolkit label: digital overførsel af manifestation @da
toolkit definition: Manifestation i et digitalt format, som er resultatet af en overførsel af en manifestation i et andet digitalt format. @da
label: hat digitale Übertragung einer Manifestation @de
definition: Setzt eine Manifestation in Beziehung zu einer Manifestation in einem digitalen Format, die durch die Übertragung einer Manifestation in ein anderes digitales Format entsteht. @de
toolkit label: Digitale Übertragung einer Manifestation @de
toolkit definition: Eine Manifestation in einem digitalen Format, die durch die Übertragung einer Manifestation in ein anderes digitales Format entsteht. @de
label: té com a transferència digital d’una manifestació @ca
definition: Relaciona una manifestació amb una manifestació en un format digital que és el resultat de la transferència d’una manifestació en un altre format digital. @ca
toolkit label: transferència digital d’una manifestació @ca
toolkit definition: Manifestació en un format digital que és el resultat de la transferència d’una manifestació en un altre format digital. @ca
definition: Liittää manifestaation digitaalisessa muodossa olevaan manifestaatioon, joka on tulosta toisessa digitaalisessa muodossa olevan manifestaation muunnoksesta. @fi
toolkit label: konvertoinnin tulos (manifestaatio) @fi
toolkit definition: Digitaalisessa muodossa oleva manifestaatio, joka on tulosta toisessa digitaalisessa muodossa olevan manifestaation muunnoksesta. @fi
toolkit label: digital overføring av manifestasjon @no
toolkit definition: En manifestasjon i digitalt format som er resultatet av overføring av en manifestasjon fra et annet digitalt format. @no
label: έχει ψηφιακή μεταφορά (εκδήλωση) @el
definition: Συνδέει μια εκδήλωση με μια εκδήλωση σε ένα ψηφιακό μορφότυπο το οποίο προκύπτει από τη μεταφορά μιας εκδήλωσης σε ένα άλλο ψηφιακό μορφότυπο. @el
toolkit label: ψηφιακή μεταφορά (εκδήλωση) @el
toolkit definition: Μια εκδήλωση σε ένα ψηφιακό μορφότυπο το οποίο προκύπτει από τη μεταφορά μιας εκδήλωσης σε ένα άλλο ψηφιακό μορφότυπο. @el
has element type: 2
label: megjelenési forma digitális átvitele a következő: @hu
definition: Hozzákapcsol egy megjelenési formát egy digitális formátumú megjelenési formához, amely egy másik digitális formátumú megjelenési forma átviteléből származik. @hu
toolkit label: digitális átvitele a következő megjelenési formának: @hu
toolkit definition: Egy digitális formátumú megjelenési forma, amely egy másik digitális formátumú megjelenési forma átviteléből származik. @hu
alternative label: digital transfer (manifestation)
label: konvertoinnin tulos (manifestaatio) @fi
label: har digital overføring av manifestasjon @no
definition: Relaterer en manifestasjon til en manifestasjon i digitalt format som er resultatet av overføring av en manifestasjon fra et annet digitalt format. @no
label: heeft digitale kopie van manifestatie @nl
definition: Relateert een manifestatie aan een manifestatie in een digitaal formaat die het resultaat is van het overzetten van een manifestatie in een ander digitaal formaat. @nl
label: له تحويل رقمي لتجسيدة @ar
definition: يربط بين تجسيدة وتجسيدة في شكل رقمي نتجت من تحويل تجسيدة لشكل رقمي أخر. @ar
toolkit label: تحويل رقمي لتجسيدة @ar
toolkit definition: تجسيدة في شكل رقمي نتجت من تحويل تجسيدة لشكل رقمي أخر. @ar
label: kehastuse digitaalne konversioon @et
definition: Seostab kehastuse digitaalse kehastusega, mis on muus digitaalvormingus oleva kehastuse konversiooni tulemus. @et
toolkit label: kehastuse digitaalne konversioon @et
toolkit definition: Digitaalne kehastus, mis on muus digitaalvormingus oleva kehastuse konversiooni tulemus. @et
label: ha come trasferimento digitale di manifestazione @it
definition: Correla una manifestazione a una manifestazione in formato digitale, risultato del trasferimento di una manifestazione in un altro formato digitale. @it
toolkit label: trasferimento digitale di manifestazione @it
toolkit definition: Manifestazione in formato digitale, risultato del trasferimento di una manifestazione in un altro formato digitale. @it
label: manifestācijas digitāls pārveidojums @lv
definition: Sasaista manifestāciju ar manifestāciju digitālā formātā, kas ir cita digitāla formāta manifestācijas transformācijas rezultāts. @lv
toolkit label: manifestācijas digitāls pārveidojums @lv
toolkit definition: Manifestācija digitālā formātā, kas ir cita digitāla formāta manifestācijas transformācijas rezultāts. @lv
alternative label: تحويل رقمي (تجسيدة) @ar
alternative label: digital overførsel (manifestation) @da
alternative label: Digitale Übertragung (Manifestation) @de
alternative label: transferència digital (manifestació) @ca
alternative label: 数字转储（载体表现） @zh-hans
label: 有载体表现的数字转储 @zh-hans
definition: 将一种载体表现与从另一种数字格式的载体表现转储为一种数字格式而形成的载体表现关联起来。 @zh-hans
toolkit label: 单件的数字转储 @zh-hans
toolkit definition: 从另一种数字格式的载体表现转储为一种数字格式而形成的载体表现 @zh-hans
alternative label: transferencia digital (manifestación) @es

is digital transfer of manifestation of
status: Published
definition: Relates a manifestation to a manifestation in a digital format that is transferred to another digital format.
type: Property
domain: C10007
sub property of: is reproduction of manifestation of
lexical alias: digitalTransferOfManifestationOf.en
toolkit label: digital transfer of manifestation of
toolkit definition: A manifestation in a digital format that is transferred to another digital format.
label: est un transfert numérique d’une manifestation de @fr
definition: Met une manifestation en relation avec une manifestation en format numérique qui est transférée dans un format numérique différent. @fr
toolkit label: transfert numérique d’une manifestation de @fr
toolkit definition: Manifestation en format numérique qui est transférée dans un format numérique différent. @fr
toolkit label: transferencia digital de la manifestación de @es
toolkit definition: Una manifestación en formato digital que se transfiere a otro formato digital. @es
instruction number: 24.5
toolkit label: digitale kopie van manifestatie van @nl
toolkit definition: Een manifestatie in een digitaal formaat die is overgezet naar een ander digitaal formaat. @nl
label: là chuyển dạng số của (biểu thị) @vi
definition: Liên kết biểu thị với biểu thị dưới định dạng số được chuyển sạng định dạng số khác. @vi
toolkit label: chuyển dạng số của (biểu thị) @vi
toolkit definition: Biểu thị dưới định dạng số được chuyển sạng định dạng số khác. @vi
label: er digital overførsel af manifestation af @da
definition: Relaterer en manifestation til en manifestation i et digitalt format, som er overført til et andet digitalt format. @da
toolkit label: digital overførsel af manifestation af @da
toolkit definition: Manifestation i et digitalt format, som er overført til et andet digitalt format. @da
label: ist digitale Übertragung einer Manifestation von @de
definition: Setzt eine Manifestation in Beziehung zu einer Manifestation in einem digitalen Format, die in ein anderes digitales Format übertragen wird. @de
toolkit label: Digitale Übertragung einer Manifestation von @de
toolkit definition: Eine Manifestation in einem digitalen Format, die in ein anderes digitales Format übertragen wird. @de
label: és transferència digital d’una manifestació de @ca
definition: Relaciona una manifestació amb una manifestació en un format digital que es transfereix a un altre format digital. @ca
toolkit label: transferència digital d’una manifestació de @ca
toolkit definition: Manifestació en un format digital que es transfereix a un altre format digital. @ca
definition: Liittää manifestaation digitaalisessa muodossa olevaan manifestaatioon, joka muunnetaan toiseen digitaaliseen muotoon. @fi
toolkit label: konvertoitu manifestaatiosta @fi
toolkit definition: Digitaalisessa muodossa olevaan manifestaatio, joka muunnetaan toiseen digitaaliseen muotoon. @fi
toolkit label: digital overføring av manifestasjon av @no
toolkit definition: En manifestasjon i et digitalt format som overføres til et annet digitalt format. @no
label: είναι ψηφιακή μεταφορά της (εκδήλωση) @el
definition: Συνδέει μια εκδήλωση με μια εκδήλωση σε ένα ψηφιακό μορφότυπο που μεταφέρεται σε ένα άλλο ψηφιακό μορφότυπο. @el
toolkit label: ψηφιακή μεταφορά της (εκδήλωση) @el
toolkit definition: Μια εκδήλωση σε ένα ψηφιακό μορφότυπο το οποίο μεταφέρεται σε ένα άλλο ψηφιακό μορφότυπο. @el
has element type: 2
label: digitális átvitele a következő megjelenési formának: @hu
definition: Hozzákapcsol egy megjelenési formát egy digitális formátumú megjelenési formához, amelyet egy másik digitális formátumra vittek át. @hu
toolkit label: digitális átvitele a következő megjelenési formának: @hu
toolkit definition: Egy digitális formátumú megjelenési forma, amelyet egy másik digitális formátumra vittek át. @hu
alternative label: digital transfer of (manifestation)
label: konvertoitu manifestaatiosta @fi
label: er digital overføring av manifestasjon av @no
definition: Relaterer en manifestasjon til en manifestasjon i et digitalt format som overføres til et annet digitalt format. @no
label: is digitale kopie van manifestatie van @nl
definition: Relateert een manifestatie aan een manifestatie in een digitaal formaat die is overgezet naar een ander digitaal formaat. @nl
label: هو نقل رقمي لتجسيدة لـ @ar
definition: يربط بين تجسيدة وتجسيدة في شكل رقمي تم تحويلها لشكل رقمي آخر. @ar
toolkit label: نقل رقمي لتجسيدة لـ @ar
toolkit definition: تجسيدة في شكل رقمي تم تحويلها لشكل رقمي آخر. @ar
label: konverteeritud digitaalsest kehastusest @et
definition: Seostab kehastuse digitaalse kehastusega, mis on konverteeritud teise digitaalvormingusse. @et
toolkit label: konverteeritud digitaalsest kehastusest @et
toolkit definition: Digitaalne kehastus, mis on konverteeritud teise digitaalvormingusse. @et
label: è trasferimento digitale di una manifestazione di @it
definition: Correla una manifestazione a una manifestazione in un formato digitale, trasferita in un formato digitale differente. @it
toolkit label: trasferimento digitale di una manifestazione di @it
toolkit definition: Manifestazione in un formato digitale, trasferita in un formato digitale differente. @it
label: ir digitāls pārveidojums manifestācijai @lv
definition: Sasaista manifestāciju ar manifestāciju digitālā formātā, kas transformēta citā digitālā formātā. @lv
toolkit label: ir digitāls pārveidojums manifestācijai @lv
toolkit definition: Manifestācija digitālā formātā, kas transformēta citā digitālā formātā. @lv
alternative label: konvertoitu manifestaatio @fi
alternative label: تحويل رقمي لـ (تجسيدة) @ar
alternative label: digital overførsel af (manifestation) @da
alternative label: Digitale Übertragung von (Manifestation) @de
alternative label: transferència digital de (manifestació) @ca
alternative label: ……的数字转储（载体表现） @zh-hans
label: 是……的载体表现的数字转储 @zh-hans
definition: 将一种载体表现与被转储为另一种数字格式的一种数字格式的一种载体表现关联起来。 @zh-hans
toolkit label: ……的载体表现的数字转储 @zh-hans
toolkit definition: 被转储为另一种数字格式的一种数字格式的一种载体表现 @zh-hans

has dimensions of cartographic image
status: Published
definition: Relates a manifestation to a measurement of a face of a map or cartographic diagram, view, profile, or section.
type: Property
domain: C10007
sub property of: has dimensions of still image
lexical alias: dimensionsOfCartographicImage.en
instruction number: 3.5.2
toolkit label: dimensions of cartographic image
toolkit definition: A measurement of a face of a map or cartographic diagram, view, profile, or section.
label: a pour dimensions d’une image cartographique @fr
definition: Met une manifestation en relation avec une mesure d’une surface d’une carte ou d’un diagramme cartographique, d’une vue, d’un profil du relief ou d’une coupe de terrain. @fr
toolkit label: dimensions d’une image cartographique @fr
toolkit definition: Mesure d’une surface d’une carte ou d’un diagramme cartographique, d’une vue, d’un profil du relief ou d’une coupe de terrain. @fr
toolkit label: dimensiones de imagen cartográfica @es
toolkit definition: Una medición de una cara de un mapa o diagrama cartográfico, vista, perfil o sección. @es
label: har mått på kartor etc. @sv
toolkit label: mått på kartor etc. @sv
toolkit label: afmetingen van cartografisch beeld @nl
toolkit definition: Een afmeting van een beeldzijde van een kaart, etc. @nl
label: có kích thước của bản đồ vv @vi
definition: Liên kết biểu thị với độ đo của bề mặt của bản đồ, v.v... @vi
toolkit label: kích thước của bản đồ vv @vi
toolkit definition: Độ đo của bề mặt của bản đồ, v.v... @vi
label: har størrelse på kartografisk billede @da
definition: Relaterer en manifestation til et mål af en billedside af et kort eller et kartografisk diagram, oversigt, profil eller udsnit. @da
toolkit label: størrelse på kartografisk billede @da
toolkit definition: Mål for en billedside af et kort eller et kartografisk diagram, oversigt, profil eller udsnit. @da
label: hat Maße eines kartografischen Bilds @de
definition: Setzt eine Manifestation in Beziehung zu einer Abmessung eines Kartenfelds, eines kartografischen Diagramms, einer kartografischen Ansicht, eines kartografischen Profils oder eines kartografischen Schnitts. @de
toolkit label: Maße eines kartografischen Bilds @de
toolkit definition: Eine Abmessung eines Kartenfelds, eines kartografischen Diagramms, einer kartografischen Ansicht, eines kartografischen Profils oder eines kartografischen Schnitts. @de
label: té com a dimensions d’una imatge cartogràfica @ca
definition: Relaciona una manifestació amb una mida d’una superfície d’un mapa o un diagrama cartogràfic, una vista, un perfil o una secció. @ca
toolkit label: dimensions d’una imatge cartogràfica @ca
toolkit definition: Mida d’una superfície d’un mapa o un diagrama cartogràfic, una vista, un perfil o una secció. @ca
definition: Liittää manifestaation kartan tai kartografisen lohkokaavion, näkymän, profiilin tai poikkileikkauksen kuvapuolen mittoihin. @fi
toolkit label: kartografisen kuvan koko @fi
toolkit definition: Kartan tai kartografisen lohkokaavion, näkymän, profiilin tai poikkileikkauksen kuvapuolen mitat. @fi
toolkit label: størrelse for kartografisk bilde @no
toolkit definition: Målene til overflaten på et kart eller kartografisk diagram, visning, profil eller seksjon. @no
label: έχει διαστάσεις του χάρτη κ.λπ. @el
definition: Συνδέει μια εκδήλωση με μια μέτρηση μιας όψης ενός χάρτη κ.λπ. @el
toolkit label: διαστάσεις του χάρτη κ.λπ. @el
toolkit definition: Μια μέτρηση μιας όψης ενός χάρτη κ.λπ. @el
has element type: 6
label: kartográfiai kép mérete a következő: @hu
definition: Egy megjelenési formát hozzákapcsol egy térképábrázolás stb. méretéhez. @hu
toolkit label: kartográfiai kép mérete: @hu
toolkit definition: Egy térkép ábrázolásának méretarányai. @hu
alternative label: dimensions of map, etc.
alternative label: kartan tms. koko @fi
label: kartografisen kuvan koko @fi
label: har størrelse for kartografisk bilde @no
definition: Relaterer en manifestasjon til målene til overflaten på et kart eller kartografisk diagram, visning, profil eller seksjon. @no
alternative label: kartstørrelse etc. @no
alternative label: dimensions d’une carte, etc. @fr
label: heeft afmetingen van cartografisch beeld @nl
definition: Relateert een manifestatie aan een afmeting van een beeldzijde van een kaart, etc. @nl
label: له أبعاد الصورة الخرائطية @ar
definition: يربط بين تجسيدة ومقاييس الوجه الخاص بخريطة أو شكل خرائطي أو عرض أو سمة أو قسم. @ar
alternative label: أبعاد الخريطة، إلخ @ar
toolkit label: أبعاد الصورة الخرائطية @ar
toolkit definition: مقاييس الوجه الخاص بخريطة أو شكل خرائطي أو عرض أو سمة أو قسم. @ar
alternative label: dimensions d’un mapa, etc. @ca
alternative label: størrelse på kort etc. @da
label: kartograafilise kujutise mõõtmed @et
definition: Seostab kehastuse kaardi, diagrammkaardi, vaate, profiili või sektsiooni esikülje mõõtudega. @et
alternative label: kaardi vms mõõtmed @et
toolkit label: kartograafilise kujutise mõõtmed @et
toolkit definition: Kaardi, diagrammkaardi, vaate, profiili või sektsiooni esikülje mõõdud. @et
alternative label: Maße einer Karte usw. @de
alternative label: térkép mérete, stb. @hu
label: ha come dimensioni dell'immagine cartografica @it
definition: Correla una manifestazione a una misura di una superficie di una carta geografica o un diagramma cartografico, veduta, profilo o sezione. @it
toolkit label: ha come dimensioni dell'immagine cartografica @it
toolkit definition: Misura di una superficie di una carta geografica o un diagramma cartografico, veduta, profilo o sezione. @it
label: kartogrāfiskā attēla izmēri @lv
definition: Sasaista manifestāciju ar kartes vai kartogrāfiskās diagrammas, skata, profila vai daļas plaknes mērīšanu. @lv
toolkit label: kartogrāfiskā attēla izmēri @lv
toolkit definition: Kartes vai kartogrāfiskās diagrammas, skata, profila vai daļas plaknes mērīšana. @lv

has distributor agent
status: Published
definition: Relates a manifestation to an agent who is responsible for distributing a published manifestation.
type: Property
domain: C10007
lexical alias: distributorAgent.en
instruction number: 21.4
toolkit label: distributor agent
toolkit definition: An agent who is responsible for distributing a published manifestation.
label: a pour agent diffuseur ou distributeur @fr
definition: Met une manifestation en relation avec un agent qui est responsable de la diffusion ou de la distribution d’une manifestation publiée. @fr
toolkit label: agent diffuseur ou distributeur @fr
toolkit definition: Agent qui est responsable de la diffusion ou de la distribution d’une manifestation publiée. @fr
toolkit label: agente distribuidor @es
toolkit definition: Un agente que es responsable de distribuir una manifestación publicada. @es
label: har distributör @sv
toolkit label: distributör @sv
sub property of: has related agent of manifestation
toolkit label: distributeur-actor @nl
toolkit definition: Een actor die verantwoordelijk is voor het distribueren van een gepubliceerde manifestatie. @nl
label: có nhà phân phối @vi
definition: Liên kết biểu thị với tác nhân có trách nhiệm phân phối biểu thị. @vi
toolkit label: nhà phân phối @vi
toolkit definition: Tác nhân có trách nhiệm phân phối biểu thị. @vi
label: har agent, som er distributør @da
definition: Relaterer en manifestation til en agent, som er ansvarlig for at distribuere en manifestation. @da
toolkit label: agent, som er distributør @da
toolkit definition: Agent, som er ansvarlig for at distribuere en manifestation. @da
label: hat Vertrieb (Akteur) @de
definition: Setzt eine Manifestation in Beziehung zu einem Akteur, der für den Vertrieb einer veröffentlichten Manifestation verantwortlich ist. @de
toolkit label: Vertrieb (Akteur) @de
toolkit definition: Ein Akteur, der für den Vertrieb einer veröffentlichten Manifestation verantwortlich ist. @de
label: té com a agent distribuïdor @ca
definition: Relaciona una manifestació amb un agent que és responsable de la distribució d’una manifestació publicada. @ca
toolkit label: agent distribuïdor @ca
toolkit definition: Agent que és responsable de la distribució d’una manifestació publicada. @ca
definition: Liittää manifestaation toimijaan, joka on vastuussa julkaistun manifestaation jakelusta. @fi
toolkit label: jakelija (toimija) @fi
toolkit definition: Toimija, joka on vastuussa julkaistun manifestaation jakelusta. @fi
toolkit label: distributør (agent) @no
toolkit definition: En agent som er ansvarlig for å distribuere en manifestasjon. @no
label: έχει διαθέτη @el
definition: Συνδέει μια εκδήλωση με έναν φορέα υπεύθυνο για τη διάθεση μιας εκδήλωσης. @el
toolkit label: διαθέτης @el
toolkit definition: Ένας φορέας υπεύθυνος για τη διάθεση μιας εκδήλωσης. @el
has element type: 2
label: terjesztő ágense a következő: @hu
definition: Hozzákapcsol egy megjelenési formát egy ágenshez, amely egy kiadott megjelenési forma terjesztéséért felelős. @hu
toolkit label: terjesztő ágens: @hu
toolkit definition: Egy ágens, amely egy kiadott megjelenési forma terjesztéséért felelős. @hu
alternative label: distributor
alternative label: jakelija @fi
label: jakelija (toimija) @fi
label: har distributør (agent) @no
definition: Relaterer en manifestasjon til en agent som er ansvarlig for å distribuere en manifestasjon. @no
alternative label: distributør @no
alternative label: diffuseur ou distributeur @fr
label: heeft distributeur-actor @nl
definition: Relateert een manifestatie aan een actor die verantwoordelijk is voor het distribueren van een gepubliceerde manifestatie. @nl
label: له وكيل موزع @ar
definition: يربط بين تجسيدة ووكيل مسئول عن توزيع تجسيدة. @ar
alternative label: موزع @ar
toolkit label: وكيل موزع @ar
toolkit definition: وكيل مسئول عن توزيع تجسيدة. @ar
alternative label: distribuïdor @ca
label: levitaja (tegija) @et
definition: Seostab kehastuse tegijaga, kes vastutab kehastuse levitamise eest. @et
alternative label: levitaja @et
toolkit label: levitaja (tegija) @et
toolkit definition: Tegija, kes vastutab kehastuse levitamise eest. @et
alternative label: terjesztő: @hu
label: ha come distributore agente @it
definition: Correla una manifestazione all'agente responsabile della distribuzione di una manifestazione. @it
alternative label: distributore @it
toolkit label: distributore agente @it
toolkit definition: Agente responsabile della distribuzione di una manifestazione. @it
label: izplatītājs (aģents) @lv
definition: Sasaista manifestāciju ar aģentu, kas ir atbildīgs par manifestācijas izplatīšanu. @lv
toolkit label: izplatītājs (aģents) @lv
toolkit definition: Aģents, kas ir atbildīgs par manifestācijas izplatīšanu. @lv

has distributor collective agent
status: Published
lexical alias: distributorCollectiveAgent.en
definition: Relates a manifestation to a collective agent who is responsible for distributing a published manifestation.
toolkit label: distributor collective agent
toolkit definition: A collective agent who is responsible for distributing a published manifestation.
type: Property
domain: C10007
has element type: 2
sub property of: has related collective agent of manifestation
sub property of: has distributor agent
label: jakelija (yhteistoimija) @fi
definition: Liittää manifestaation yhteistoimijaan, joka on vastuussa julkaistun manifestaation jakelusta. @fi
toolkit label: jakelija (yhteistoimija) @fi
toolkit definition: Yhteistoimija, joka on vastuussa julkaistun manifestaation jakelusta. @fi
label: har distributør (kollektiv agent) @no
definition: Relaterer en manifestasjon til en kollektiv agent som er ansvarlig for å distribuere en manifestasjon. @no
toolkit label: distributør (kollektiv agent) @no
toolkit definition: En kollektiv agent som er ansvarlig for å distribuere en manifestasjon. @no
label: a pour agent collectif diffuseur ou distributeur @fr
definition: Met une manifestation en relation avec un agent collectif qui est responsable de la diffusion ou de la distribution d’une manifestation publiée. @fr
toolkit label: agent collectif diffuseur ou distributeur @fr
toolkit definition: Agent collectif qui est responsable de la diffusion ou de la distribution d’une manifestation publiée. @fr
label: heeft distributeur-collectieve actor @nl
definition: Relateert een manifestatie aan een collectieve actor die verantwoordelijk is voor het distribueren van een gepubliceerde manifestatie. @nl
toolkit label: distributeur-collectieve actor @nl
toolkit definition: Een collectieve actor die verantwoordelijk is voor het distribueren van een gepubliceerde manifestatie. @nl
label: له وكيل جماعي موزع @ar
definition: يربط بين تجسيدة ووكيل جماعي مسئول عن توزيع تجسيدة. @ar
toolkit label: وكيل جماعي موزع @ar
toolkit definition: وكيل جماعي مسئول عن توزيع تجسيدة. @ar
label: té com a agent col·lectiu distribuïdor @ca
definition: Relaciona una manifestació amb un agent col·lectiu que és responsable de la distribució d’una manifestació publicada. @ca
toolkit label: agent col·lectiu distribuïdor @ca
toolkit definition: Agent col·lectiu que és responsable de la distribució d’una manifestació publicada. @ca
label: har kollektiv agent, som er distributør @da
definition: Relaterer en manifestation til en kollektiv agent, som er ansvarlig for at distribuere en manifestation. @da
toolkit label: kollektiv agent, som er distributør @da
toolkit definition: Kollektiv agent, som er ansvarlig for at distribuere en manifestation. @da
label: levitaja (kollektiiv) @et
definition: Seostab kehastuse kollektiiviga, kes vastutab kehastuse levitamise eest. @et
toolkit label: levitaja (kollektiiv) @et
toolkit definition: Kollektiiv, kes vastutab kehastuse levitamise eest. @et
label: hat Vertrieb (Gemeinschaftlicher Akteur) @de
definition: Setzt eine Manifestation in Beziehung zu einem gemeinschaftlichen Akteur, der für den Vertrieb einer veröffentlichten Manifestation verantwortlich ist. @de
toolkit label: Vertrieb (Gemeinschaftlicher Akteur) @de
toolkit definition: Ein gemeinschaftlicher Akteur, der für den Vertrieb einer veröffentlichten Manifestation verantwortlich ist. @de
label: terjesztő kollektív ágense a következő: @hu
definition: Hozzákapcsol egy megjelenési formát egy kollektív ágenshez, amely egy kiadott megjelenési forma terjesztéséért felelős. @hu
toolkit label: terjesztő kollektív ágens: @hu
toolkit definition: Egy kollektív ágens, amely egy kiadott megjelenési forma terjesztéséért felelős. @hu
label: ha come distributore agente collettivo @it
definition: Correla una manifestazione all'agente collettivo responsabile della distribuzione di una manifestazione. @it
toolkit label: distributore agente collettivo @it
toolkit definition: Agente collettivo responsabile della distribuzione di una manifestazione. @it
label: izplatītājs (grupa) @lv
definition: Sasaista manifestāciju ar grupu, kas ir atbildīga par manifestācijas izplatīšanu. @lv
toolkit label: izplatītājs (grupa) @lv
toolkit definition: Grupa, kas ir atbildīga par manifestācijas izplatīšanu. @lv
label: 有发行者集体行为者 @zh-hans
definition: 将一种载体表现与负责发行一种出版载体表现的一个集体行为者关联起来。 @zh-hans
toolkit label: 发行者集体行为者 @zh-hans
toolkit definition: 负责发行一种出版载体表现的一个集体行为者 @zh-hans
label: dağıtımcı kolektif temsilcisi ile ilişkilidir @tr
definition: Bir gösterimi, yayımlanmış bir bildiriyi dağıtmaktan sorumlu olan kolektif bir temsilciyle ilişkilendirir. @tr
toolkit label: dağıtıcı kolektif temsilci @tr
toolkit definition: Yayınlanmış bir gösterimi dağıtmaktan sorumlu kolektif bir temsilci. @tr
label: tiene agente colectivo distribuidor @es
definition: Relaciona una manifestación con un agente colectivo que es responsable de distribuir una manifestación publicada. @es
toolkit label: agente colectivo distribuidor @es
toolkit definition: Un agente colectivo que es responsable de distribuir una manifestación publicada. @es
has subproperty: has distributor corporate body
has subproperty: has distributor family
has subproperty: has film distributor collective agent
has subproperty: P30388

has distributor corporate body
status: Published
lexical alias: distributorCorporateBody.en
definition: Relates a manifestation to a corporate body who is responsible for distributing a published manifestation.
toolkit label: distributor corporate body
toolkit definition: A corporate body who is responsible for distributing a published manifestation.
type: Property
domain: C10007
has element type: 2
sub property of: has related corporate body of manifestation
sub property of: has distributor collective agent
label: jakelija (yhteisö) @fi
definition: Liittää manifestaation yhteisöön, joka on vastuussa julkaistun manifestaation jakelusta. @fi
toolkit label: jakelija (yhteisö) @fi
toolkit definition: Yhteisö, joka on vastuussa julkaistun manifestaation jakelusta. @fi
label: har distributør (korporasjon) @no
definition: Relaterer en manifestasjon til en korporasjon som er ansvarlig for å distribuere en manifestasjon. @no
toolkit label: distributør (korporasjon) @no
toolkit definition: En korporasjon som er ansvarlig for å distribuere en manifestasjon. @no
label: a pour collectivité diffuseuse ou distributrice @fr
definition: Met une manifestation en relation avec une collectivité qui est responsable de la diffusion ou de la distribution d’une manifestation publiée. @fr
toolkit label: collectivité diffuseuse ou distributrice @fr
toolkit definition: Collectivité qui est responsable de la diffusion ou de la distribution d’une manifestation publiée. @fr
label: heeft distributeur-corporatie @nl
definition: Relateert een manifestatie aan een corporatie die verantwoordelijk is voor het distribueren van een gepubliceerde manifestatie. @nl
toolkit label: distributeur-corporatie @nl
toolkit definition: Een corporatie die verantwoordelijk is voor het distribueren van een gepubliceerde manifestatie. @nl
label: له هيئة موزع @ar
definition: يربط بين تجسيدة وهيئة مسئولة عن توزيع تجسيدة. @ar
toolkit label: هيئة موزع @ar
toolkit definition: هيئة مسئولة عن توزيع تجسيدة. @ar
label: té com a entitat corporativa distribuïdora @ca
definition: Relaciona una manifestació amb una entitat corporativa que és responsable de la distribució d’una manifestació publicada. @ca
toolkit label: entitat corporativa distribuïdora @ca
toolkit definition: Entitat corporativa que és responsable de la distribució d’una manifestació publicada. @ca
label: har korporation, som er distributør @da
definition: Relaterer en manifestation til en korporation, som er ansvarlig for at distribuere en manifestation. @da
toolkit label: korporation, som er distributør @da
toolkit definition: Korporation, som er ansvarlig for at distribuere en manifestation. @da
label: levitaja (asutus) @et
definition: Seostab kehastuse asutusega, kes vastutab kehastuse levitamise eest. @et
toolkit label: levitaja (asutus) @et
toolkit definition: Asutus, kes vastutab kehastuse levitamise eest. @et
label: hat Vertrieb (Körperschaft) @de
definition: Setzt eine Manifestation in Beziehung zu einer Körperschaft, die für den Vertrieb einer veröffentlichten Manifestation verantwortlich ist. @de
toolkit label: Körperschaft als Vertrieb von @de
toolkit definition: Eine Körperschaft, die für den Vertrieb einer veröffentlichten Manifestation verantwortlich ist. @de
label: terjesztő testülete a következő: @hu
definition: Hozzákapcsol egy megjelenési formát egy testülethez, amely egy kiadott megjelenési forma terjesztéséért felelős. @hu
toolkit label: terjesztő testület: @hu
toolkit definition: Egy testület, amely egy kiadott megjelenési forma terjesztéséért felelős. @hu
label: ha come distributore ente @it
definition: Correla una manifestazione all'ente responsabile della distribuzione di una manifestazione. @it
toolkit label: distributore ente @it
toolkit definition: Ente responsabile della distribuzione di una manifestazione. @it
label: izplatītājs (institūcija) @lv
definition: Sasaista manifestāciju ar institūciju, kas ir atbildīga par manifestācijas izplatīšanu. @lv
toolkit label: izplatītājs (institūcija) @lv
toolkit definition: Institūcija, kas ir atbildīga par manifestācijas izplatīšanu. @lv
label: 有发行者团体 @zh-hans
definition: 将一种载体表现与负责发行一种出版载体表现的一个团体关联起来。 @zh-hans
toolkit label: 发行者团体 @zh-hans
toolkit definition: 负责发行一种出版载体表现的一个团体 @zh-hans
label: dağıtımcı tüzel kişisi ile ilişkilidir @tr
definition: Bir gösterimi, yayınlanan bir gösterimi dağıtmaktan sorumlu olan bir tüzel kişiyle ilişkilendirir. @tr
toolkit label: dağıtıcı tüzel kişi @tr
toolkit definition: Yayınlanmış bir gösterimi dağıtmaktan sorumlu bir tüzel kişi. @tr
label: tiene cuerpo corporativo distribuidor @es
definition: Relaciona una manifestación con un cuerpo corporativo que es responsable de distribuir una manifestación publicada. @es
toolkit label: cuerpo corporativo distribuidor @es
toolkit definition: Un cuerpo corporativo que es responsable de distribuir una manifestación publicada. @es
has subproperty: has film distributor corporate body
has subproperty: P30417

has distributor family
status: Published
lexical alias: distributorFamily.en
definition: Relates a manifestation to a family who is responsible for distributing a published manifestation.
toolkit label: distributor family
toolkit definition: A family who is responsible for distributing a published manifestation.
type: Property
domain: C10007
has element type: 2
sub property of: has related family of manifestation
sub property of: has distributor collective agent
label: jakelija (suku) @fi
definition: Liittää manifestaation sukuun, joka on vastuussa julkaistun manifestaation jakelusta. @fi
toolkit label: jakelija (suku) @fi
toolkit definition: Suku, joka on vastuussa julkaistun manifestaation jakelusta. @fi
label: har distributør (familie) @no
definition: Relaterer en manifestasjon til en familie som er ansvarlig for å distribuere en manifestasjon. @no
toolkit label: distributør (familie) @no
toolkit definition: En familie som er ansvarlig for å distribuere en manifestasjon. @no
label: a pour famille diffuseuse ou distributrice @fr
definition: Met une manifestation en relation avec une famille qui est responsable de la diffusion ou de la distribution d’une manifestation publiée. @fr
toolkit label: famille diffuseuse ou distributrice @fr
toolkit definition: Famille qui est responsable de la diffusion ou de la distribution d’une manifestation publiée. @fr
label: heeft distributeur-familie @nl
definition: Relateert een manifestatie aan een familie die verantwoordelijk is voor het distribueren van een gepubliceerde manifestatie. @nl
toolkit label: distributeur-familie @nl
toolkit definition: Een familie die verantwoordelijk is voor het distribueren van een gepubliceerde manifestatie. @nl
label: له عائلة موزع @ar
definition: يربط بين تجسيدة وعائلة مسئولة عن توزيع تجسيدة. @ar
toolkit label: عائلة موزع @ar
toolkit definition: عائلة مسئولة عن توزيع تجسيدة. @ar
label: té com a família distribuïdora @ca
definition: Relaciona una manifestació amb una família que és responsable de la distribució d’una manifestació publicada. @ca
toolkit label: família distribuïdora @ca
toolkit definition: Família que és responsable de la distribució d’una manifestació publicada. @ca
label: har familie, som er distributør @da
definition: Relaterer en manifestation til en familie, som er ansvarlig for at distribuere en manifestation. @da
toolkit label: familie, som er distributør @da
toolkit definition: Familie, som er ansvarlig for at distribuere en manifestation. @da
label: levitaja (perekond) @et
definition: Seostab kehastuse perekonnaga, kes vastutab kehastuse levitamise eest. @et
toolkit label: levitaja (perekond) @et
toolkit definition: Perekond, kes vastutab kehastuse levitamise eest. @et
label: hat Vertrieb (Familie) @de
definition: Setzt eine Manifestation in Beziehung zu einer Familie, die für den Vertrieb einer veröffentlichten Manifestation verantwortlich ist. @de
toolkit label: Vertrieb (Familie) @de
toolkit definition: Eine Familie, die für den Vertrieb einer veröffentlichten Manifestation verantwortlich ist. @de
label: terjesztő családja a következő: @hu
definition: Hozzákapcsol egy megjelenési formát egy családhoz, amely egy kiadott megjelenési forma terjesztéséért felelős. @hu
toolkit label: terjesztő család: @hu
toolkit definition: Egy család, amely egy kiadott megjelenési forma terjesztéséért felelős. @hu
label: ha come distributore famiglia @it
definition: Correla una manifestazione alla famiglia responsabile della distribuzione di una manifestazione. @it
toolkit label: distributore famiglia @it
toolkit definition: Famiglia responsabile della distribuzione di una manifestazione. @it
label: izplatītājs (dzimta/ģimene) @lv
definition: Sasaista manifestāciju ar dzimtu/ģimeni, kas ir atbildīga par manifestācijas izplatīšanu. @lv
toolkit label: izplatītājs (dzimta/ģimene) @lv
toolkit definition: Dzimta/ģimene, kas ir atbildīga par manifestācijas izplatīšanu. @lv
label: 有发行者家族 @zh-hans
definition: 将一种载体表现与负责发行一种出版载体表现的一个家族关联起来。 @zh-hans
toolkit label: 发行者家族 @zh-hans
toolkit definition: 负责发行一种出版载体表现的一个家族 @zh-hans
label: dağıtımcı ailesi ile ilişkilidir @tr
definition: Bir gösterimi, yayımlanmış gösterimin dağıtımından sorumlu aileyle ilişkilendirir. @tr
toolkit label: dağıtıcı aile @tr
toolkit definition: Yayımlanmış gösterimin dağıtımından sorumlu aile. @tr
label: tiene familia distribuidora @es
definition: Relaciona una manifestación con una familia que es responsable de distribuir una manifestación publicada. @es
toolkit label: familia distribuidora @es
toolkit definition: Una familia que es responsable de distribuir una manifestación publicada. @es
has subproperty: has film distributor family
has subproperty: P30446

has distributor person
status: Published
lexical alias: distributorPerson.en
definition: Relates a manifestation to a person who is responsible for distributing a published manifestation.
toolkit label: distributor person
toolkit definition: A person who is responsible for distributing a published manifestation.
type: Property
domain: C10007
has element type: 2
sub property of: has related person of manifestation
sub property of: has distributor agent
label: jakelija (henkilö) @fi
definition: Liittää manifestaation henkilöön, joka on vastuussa julkaistun manifestaation jakelusta. @fi
toolkit label: jakelija (henkilö) @fi
toolkit definition: Henkilö, joka on vastuussa julkaistun manifestaation jakelusta. @fi
label: har distributør (person) @no
definition: Relaterer en manifestasjon til en person som er ansvarlig for å distribuere en manifestasjon. @no
toolkit label: distributør (person) @no
toolkit definition: En person som er ansvarlig for å distribuere en manifestasjon. @no
label: a pour personne diffuseuse ou distributrice @fr
definition: Met une manifestation en relation avec une personne qui est responsable de la diffusion ou de la distribution d’une manifestation publiée. @fr
toolkit label: personne diffuseuse ou distributrice @fr
toolkit definition: Personne qui est responsable de la diffusion ou de la distribution d’une manifestation publiée. @fr
label: heeft distributeur-persoon @nl
definition: Relateert een manifestatie aan een persoon die verantwoordelijk is voor het distribueren van een gepubliceerde manifestatie. @nl
toolkit label: distributeur-persoon @nl
toolkit definition: Een persoon die verantwoordelijk is voor het distribueren van een gepubliceerde manifestatie. @nl
label: له شخص موزع @ar
definition: يربط بين تجسيدة وشخص مسئول عن توزيع تجسيدة. @ar
toolkit label: شخص موزع @ar
toolkit definition: شخص مسئول عن توزيع تجسيدة. @ar
label: té com a persona distribuïdora @ca
definition: Relaciona una manifestació amb una persona que és responsable de la distribució d’una manifestació publicada. @ca
toolkit label: persona distribuïdora @ca
toolkit definition: Persona que és responsable de la distribució d’una manifestació publicada. @ca
label: har person, som er distributør @da
definition: Relaterer en manifestation til en person, som er ansvarlig for at distribuere en manifestation. @da
toolkit label: person, som er distributør @da
toolkit definition: Person, som er ansvarlig for at distribuere en manifestation. @da
label: levitaja (isik) @et
definition: Seostab kehastuse isikuga, kes vastutab kehastuse levitamise eest. @et
toolkit label: levitaja (isik) @et
toolkit definition: Isik, kes vastutab kehastuse levitamise eest. @et
label: hat Vertrieb (Person) @de
definition: Setzt eine Manifestation in Beziehung zu einer Person, die für den Vertrieb einer veröffentlichten Manifestation verantwortlich ist. @de
toolkit label: Vertrieb (Person) @de
toolkit definition: Eine Person, die für den Vertrieb einer veröffentlichten Manifestation verantwortlich ist. @de
label: terjesztő személye a következő: @hu
definition: Hozzákapcsol egy megjelenési formát egy személyhez, aki egy kiadott megjelenési forma megalkotásáért felelős. @hu
toolkit label: terjesztő személy: @hu
toolkit definition: Egy személy, aki egy kiadott megjelenési forma megalkotásáért felelős. @hu
label: ha come distributore persona @it
definition: Correla una manifestazione alla persona responsabile della distribuzione di una manifestazione. @it
toolkit label: distributore persona @it
toolkit definition: Persona responsabile della distribuzione di una manifestazione. @it
label: izplatītājs (persona) @lv
definition: Sasaista manifestāciju ar personu, kura ir atbildīga par manifestācijas izplatīšanu. @lv
toolkit label: izplatītājs (persona) @lv
toolkit definition: Persona, kura ir atbildīga par manifestācijas izplatīšanu. @lv
label: 有发行者个人 @zh-hans
definition: 将一种载体表现与负责发行一种出版载体表现的一个个人关联起来。 @zh-hans
toolkit label: 发行者个人 @zh-hans
toolkit definition: 负责发行一种出版载体表现的一个个人 @zh-hans
label: dağıtımcı kişisi ile ilişkilidir @tr
definition: Bir gösterimi, yayınlanmış bir gösterimi dağıtmaktan sorumlu olan kişiylr ilişkilendirir. @tr
toolkit label: dağıtıcı @tr
toolkit definition: Yayınlanmış bir gösterimi dağıtmaktan sorumlu olan bir kişi. @tr
label: tiene persona distribuidora @es
definition: Relaciona una manifestación con una persona que es responsable de distribuir una manifestación publicada. @es
toolkit label: persona distribuidora @es
toolkit definition: Una persona que es responsable de distribuir una manifestación publicada. @es
has subproperty: has film distributor person
has subproperty: P30359

has equivalent manifestation
status: Published
definition: Relates a manifestation to a manifestation that embodies the same expression of a work.
type: Property
domain: C10007
sub property of: has related manifestation of manifestation
lexical alias: equivalentManifestation.en
toolkit label: equivalent manifestation
toolkit definition: A manifestation that embodies the same expression of a work.
label: a pour manifestation équivalente @fr
definition: Met une manifestation en relation avec une manifestation qui matérialise la même expression d’une œuvre. @fr
toolkit label: manifestation équivalente @fr
toolkit definition: Manifestation qui matérialise la même expression d’une œuvre. @fr
toolkit label: manifestación equivalente @es
toolkit definition: Una manifestación que materializa la misma expresión de una obra. @es
instruction number: 24.5
toolkit label: equivalent-manifestatie @nl
toolkit definition: Een manifestatie die dezelfde expressie van een werk verwezenlijkt. @nl
label: có tương đương (biểu thị) @vi
definition: Liên kết biểu thị với biểu thị thể hiện cùng biểu thị của tác phẩm. @vi
toolkit label: tương đương (biểu thị) @vi
toolkit definition: Biểu thị thể hiện cùng biểu thị của tác phẩm. @vi
label: har tilsvarende manifestation @da
definition: Relaterer en manifestation til en manifestation, som indeholder det samme udtryk af et værk. @da
toolkit label: tilsvarende manifestation @da
toolkit definition: Manifestation, som indeholder det samme udtryk af et værk. @da
label: hat Äquivalent (Manifestation) @de
definition: Setzt eine Manifestation in Beziehung zu einer Manifestation, die dieselbe Expression eines Werks verkörpert. @de
toolkit label: Äquivalent (Manifestation) @de
toolkit definition: Eine Manifestation, die dieselbe Expression eines Werks verkörpert. @de
label: té com a manifestació equivalent @ca
definition: Relaciona una manifestació amb una manifestació que materialitza la mateixa expressió d’una obra. @ca
toolkit label: manifestació equivalent @ca
toolkit definition: Manifestació que materialitza la mateixa expressió d’una obra. @ca
definition: Liittää manifestaation manifestaatioon, joka sisältää saman teoksen ekspression kuin toinen manifestaatio. @fi
toolkit label: vastaava manifestaatio @fi
toolkit definition: Manifestaatio, joka sisältää saman teoksen ekspressiono kuin toinen manifestaatio. @fi
toolkit label: ekvivalent manifestasjon @no
toolkit definition: En manifestasjon som legemliggjør det samme uttrykket av et verk. @no
label: έχει ισοδύναμη (εκδήλωση) @el
definition: Συνδέει μια εκδήλωση με μια εκδήλωση που ενσωματώνει την ίδια έκφραση ενός έργου. @el
toolkit label: ισοδύναμη (εκδήλωση) @el
toolkit definition: Μια εκδήλωση που ενσωματώνει την ίδια έκφραση ενός έργου. @el
has element type: 2
label: egyenértékű megjelenési formája a következő: @hu
definition: Egy megjelenési formát hozzákapcsol egy megjelenési formához, amely egy mű ugyanazon kifejezési formáját testesíti meg. @hu
toolkit label: egyenértékű megjelenési forma: @hu
toolkit definition: Egy megjelenési forma, amely egy mű ugyanazon kifejezési formáját testesíti meg. @hu
alternative label: equivalent manifestation relationship
label: vastaava manifestaatio @fi
label: har ekvivalent manifestasjon @no
definition: Relaterer en manifestasjon til en manifestasjon som legemliggjør det samme uttrykket av et verk. @no
label: heeft equivalent-manifestatie @nl
definition: Relateert een manifestatie aan een manifestatie die dezelfde expressie van een werk verwezenlijkt. @nl
label: له تجسيدة مكافئة @ar
definition: يربط بين تجسيدة وتجسيدة تجسد نفس التعبيرة لعمل. @ar
toolkit label: تجسيدة مكافئة @ar
toolkit definition: تجسيدة تجسد نفس التعبيرة لعمل. @ar
label: ekvivalentne kehastus @et
definition: Seostab kehastuse kehastusega, milles on teostatud teose sama väljendus. @et
toolkit label: ekvivalentne kehastus @et
toolkit definition: Kehastus, milles on teostatud teose sama väljendus. @et
label: ha come manifestazione equivalente @it
definition: Correla una manifestazione a una manifestazione che materializza la stessa espressione di un'opera. @it
toolkit label: manifestazione equivalente @it
toolkit definition: Manifestazione che materializza la stessa espressione di un'opera. @it
label: ekvivalenta manifestācija @lv
definition: Sasaista manifestāciju ar manifestāciju, kura ietver to pašu darba izteiksmi. @lv
toolkit label: ekvivalenta manifestācija @lv
toolkit definition: Manifestācija, kura ietver to pašu darba izteiksmi. @lv
alternative label: vastaavan manifestaation suhde @fi
alternative label: علاقة تجسيدة مكافئة @ar
alternative label: tilsvarende manifestation-relation @da
alternative label: Äquivalenzbeziehungen auf Manifestationsebene @de
alternative label: relació de manifestació equivalent @ca
alternative label: 等同载体表现关系 @zh-hans
label: 有等同载体表现 @zh-hans
definition: 将一种载体表现与具体化一种作品同一种内容表达的一种载体表现关联起来。 @zh-hans
toolkit label: 等同载体表现 @zh-hans
toolkit definition: 具体化一种作品同一种内容表达的一种载体表现 @zh-hans

has uniform resource locator
status: Published
definition: Relates a manifestation to an address of an online resource.
type: Property
domain: C10007
lexical alias: uniformResourceLocator.en
instruction number: 4.6
toolkit label: Uniform Resource Locator
toolkit definition: An address of an online resource.
label: a pour adresse URL @fr
definition: Met une manifestation en relation avec une adresse d’une ressource en ligne. @fr
toolkit label: adresse URL @fr
toolkit definition: Adresse d’une ressource en ligne. @fr
toolkit label: Localizador Uniforme de Recursos @es
toolkit definition: Una dirección de un recurso en línea. @es
scope note: A Uniform Resource Locator includes all manifestation identifiers intended to provide online access to a manifestation using a standard Internet browser.
alternative label: URL
label: har URL @sv
toolkit label: URL @sv
toolkit definition: Een adres van een online resource. @nl
label: có định vị tài nguyên thống nhất @vi
definition: Liên kết biểu thị với địa chỉ của tài nguyên trực tuyến @vi
scope note: Định vị tài nguyên thống nhất bao gồm tất vả các chỉ số nhận dạng biểu thị dự kiến cung cấp truy cập trực tuyến tới biểu thị sử dụng lướt Internet chuẩn. @vi
toolkit label: định vị tài nguyên thống nhất @vi
toolkit definition: Địa chỉ của tài nguyên trực tuyến @vi
scope note: Een Uniform Resource Locator omvat elke identificatie voor manifestaties bedoeld om online toegang te geven tot een manifestatie met behulp van een standaard internetbrowser. @nl
label: har uniform resource locator @da
definition: Relaterer en manifestation til en adresse på en manifestation, hvortil der er fjernadgang. @da
scope note: Uniform Ressource Locator omfatter alle manifestationsidentifikatorer, som har for hensigt at give online adgang til en manifestation ved brug af en standard internetbrowser. @da
toolkit definition: Adresse på en manifestation, hvortil der er fjernadgang. @da
label: hat Uniform Resource Locator @de
definition: Setzt eine Manifestation in Beziehung zu einer Adresse einer Online-Ressource. @de
scope note: Darunter fallen alle Manifestations-Identifikatoren, die konzipiert sind, um unter Verwendung eines Standard-Internet-Browsers Online-Zugang auf eine Manifestation anzubieten. @de
toolkit definition: Eine Adresse einer Online-Ressource. @de
label: té com a URL @ca
definition: Relaciona una manifestació amb una adreça d’un recurs en línia. @ca
scope note: Una adreça URL inclou tots els identificadors de manifestació concebuts per proporcionar accés en línia a una manifestació mitjançant un navegador Internet estàndard. @ca
toolkit definition: Adreça d’un recurs en línia. @ca
definition: Liittää manifestaation verkkoaineiston osoitteeseen. @fi
toolkit label: URL-osoite @fi
toolkit definition: Verkkoaineiston osoite. @fi
toolkit label: URL-adresse (Uniform Resource Locator) @no
toolkit definition: En adresse til en nettbasert ressurs. @no
label: έχει ενιαίο εντοπιστή πόρου @el
definition: Συνδέει μια εκδήλωση με μια διεύθυνση ενός online πόρου. @el
scope note: Ένας Ενιαίος Εντοπιστής Πόρου περιλαμβάνει όλα τα αναγνωριστικά της εκδήλωσης με σκοπό την παροχή online πρόσβασης σε μια εκδήλωση με τη χρήση ενός πρότυπου διαδικτυακού φυλλομετρητή. @el
toolkit label: Ενιαίος Εντοπιστής Πόρου @el
toolkit definition: Μια διεύθυνση ενός online πόρου. @el
scope note: Les adresses URL comprennent tous les identifiants des ressources dont le but est de fournir un accès en ligne à une manifestation à l’aide d’un navigateur Internet standard. @fr
has element type: 6
label: egységes forrás-helymeghatározója a következő: @hu
definition: Hozzákapcsol egy megjelenési formát egy online forrás webcíméhez. @hu
scope note: Egy egységes forrás-helymeghatározó (Uniform Resource Locator – URL) magában foglal minden megjelenésiforma-azonosítót, amelynek célja, hogy egy megjelenési formához szabványos webböngésző használatával online hozzáférést biztosítson. @hu
toolkit label: egységes forrás-helymeghatározója: @hu
toolkit definition: Egy online forrás webcíme. @hu
scope note: URL-osoite käsittää kaikki manifestaation tunnisteet, joiden tarkoituksena on antaa pääsy verkossa olevaan manifestaatioon standardia verkkoselainta käyttäen. @fi
label: URL-osoite @fi
label: har URL-adresse (Uniform Resource Locator) @no
definition: Relaterer en manifestasjon til en adresse til en nettbasert ressurs. @no
scope note: En Uniform Resource Locator inkluderer alle manifestasjonsidentifikatorer som er ment å gi online tilgang til en manifestasjon ved bruk av en standard internettleser. @no
label: heeft Uniform Resource Locator @nl
definition: Relateert een manifestatie aan een adres van een online resource. @nl
label: له معرف موحد لمصدر @ar
definition: يربط بين تجسيدة وعنوان مصدر متاح على الخط المباشر. @ar
scope note: يشمل معرف المواقع الموحد كل معرفات التجسيدة التي تهدف للإتاحة على الخط المباشر لتجسيدة باستخدام متصفح إنترنت معياري. @ar
alternative label: معرف محدد لمصدر @ar
toolkit label: معرف محدد لمصدر @ar
toolkit definition: عنوان مصدر متاح على الخط المباشر. @ar
alternative label: Uniform Resource Locator @ca
label: universaalne ressursilokaator @et
definition: Seostab kehastuse võrguressursi aadressiga @et
scope note: Universaalne ressursilokaator hõlmab kõiki kehastuse identifikaatoreid, mis on mõeldud kehastusele juurdepääsu andmiseks tavalise veebilehitseja abil. @et
toolkit label: universaalne ressursilokaator @et
toolkit definition: Võrguressursi aadress. @et
alternative label: URL: @hu
label: ha come Uniform Resource Locator @it
definition: Correla una manifestazione a un indirizzo di una risorsa online. @it
scope note: Un Uniform Resource Locator comprende tutti gli identificatori di manifestazione destinati a fornire accesso online a una manifestazione che utilizza un browser internet standard. @it
toolkit definition: Indirizzo di una risorsa ad accesso remoto. @it
label: vienotais resursu vietrādis (URL) @lv

is electronic reproduction of item of
status: Published
type: Property
lexical alias: electronicReproductionOfItemOf.en
definition: Relates a manifestation to an item in an analog format that is transferred to a manifestation in a digital format.
domain: C10007
sub property of: is reproduction of item of
toolkit label: electronic reproduction of item of
toolkit definition: An item in an analog format that is transferred to manifestation in a digital format.
has element type: 2
alternative label: electronic reproduction of (item)
label: digitoitu kappaleesta @fi
definition: Liittää manifestaation analogisessa muodossa olevaan kappaleeseen, joka muunnetaan digitaaliseksi manifestaatioksi. @fi
toolkit label: digitoitu kappaleesta @fi
toolkit definition: Analogisessa muodossa oleva kappale, joka muunnetaan digitaaliseksi manifestaatioksi. @fi
label: er elektronisk reproduksjon av eksemplar av @no
definition: Relaterer en manifestasjon til et eksemplar i et analogt format som overføres til en manifestasjon i et digitalt format. @no
toolkit label: elektronisk reproduksjon av eksemplar av @no
toolkit definition: Et eksemplar i et analogt format som overføres til en manifestasjon i et digitalt format. @no
label: est une reproduction électronique d’un item de @fr
definition: Met une manifestation en relation avec un item sur support analogique qui est transféré vers une manifestation dans un format numérique. @fr
toolkit label: reproduction électronique d’un item de @fr
toolkit definition: Item sur support analogique qui est transféré vers une manifestation dans un format numérique. @fr
label: is elektronische reproductie van item van @nl
definition: Relateert een manifestatie aan een item in een analoog formaat dat overgezet is naar een manifestatie in een digitaal formaat. @nl
toolkit label: elektronische reproductie van item van @nl
toolkit definition: Een item in een analoog formaat dat overgezet is naar een manifestatie in een digitaal formaat. @nl
label: هو استنساخ إلكتروني لمفردة لـ @ar
definition: يربط بين تجسيدة ومفردة في شكل تناظري يتم تحويله إلى تجسيدة في شكل رقمي مختلف. @ar
toolkit label: استنساخ إلكتروني لمفردة لـ @ar
toolkit definition: مفردة في شكل تناظري يتم تحويلها إلى تجسيدة في شكل رقمي. @ar
label: és reproducció electrònica d’un ítem de @ca
definition: Relaciona una manifestació amb un ítem en un format analògic que es transfereix a una manifestació en un format digital. @ca
toolkit label: reproducció electrònica d’un ítem de @ca
toolkit definition: Ítem en un format analògic que es transfereix a una manifestació en un format digital. @ca
label: er elektronisk reproduktion af eksemplar af @da
definition: Relaterer en manifestation til et eksemplar i et analogt format, som overføres til en manifestation i et digitalt format. @da
toolkit label: elektronisk reproduktion af eksemplar af @da
toolkit definition: Eksemplar i et analogt format, som overføres til en manifestation i et digitalt format. @da
label: elektrooniline reproduktsioon eksemplarist @et
definition: Seostab kehastuse analoogvormis eksemplariga, mis on digiteeritud digitaalvormis kehastuseks. @et
toolkit label: elektrooniline reproduktsioon eksemplarist @et
toolkit definition: Analoogvormis eksemplar, mis on digiteeritud digitaalvormis kehastuseks. @et
label: ist elektronische Reproduktion eines Exemplars von @de
definition: Setzt eine Manifestation in Beziehung zu einem Exemplar in einem analogen Format, das in eine Manifestation in einem digitalen Format übertragen wird. @de
toolkit label: Elektronische Reproduktion eines Exemplars von @de
toolkit definition: Ein Exemplar in einem analogen Format, das in eine Manifestation in einem digitalen Format übertragen wird. @de
label: elektronikus másolata a következő példánynak: @hu
definition: Hozzákapcsol egy megjelenési formát egy analóg formátumú példányhoz, amelyet egy digitális formátumú megjelenési formára visznek át. @hu
toolkit label: elektronikus másolata a következő példánynak: @hu
toolkit definition: Egy analóg formátumú példány, amelyet egy digitális formátumú megjelenési formára visznek át. @hu
label: è riproduzione elettronica di item di @it
definition: Correla una manifestazione a un item in un formato analogico trasferito a una manifestazione in un formato digitale. @it
toolkit label: riproduzione elettronica di item di @it
toolkit definition: Item in un formato analogico trasferito a una manifestazione in un formato digitale. @it
label: ir digitāla reprodukcija vienībai @lv
definition: Sasaista manifestāciju ar vienību analogā formātā, kas transformēta par manifestāciju digitālā formātā. @lv
toolkit label: ir digitāla reprodukcija vienībai @lv
toolkit definition: Vienība analogā formātā, kas transformēta par manifestāciju digitālā formātā. @lv
alternative label: استنساخ إلكتروني لـ (مفردة) @ar
alternative label: elektronisk reproduktion af (eksemplar) @da
alternative label: Elektronische Reproduktion von (Exemplar) @de
alternative label: reproducció electrònica de (ítem) @ca
alternative label: ……的电子复制品（单件） @zh-hans
label: 是……的单件的电子复制品 @zh-hans
definition: 将一种载体表现与被转储为一种数字格式的载体表现的一种模拟格式的一个单件关联起来。 @zh-hans
toolkit label: ……的单件的电子复制品 @zh-hans
toolkit definition: 被转储为一种数字格式的载体表现的一种模拟格式的一个单件 @zh-hans
alternative label: reproduction électronique de (item) @fr
alternative label: elektronikus másolata a következőnek (példány): @hu
alternative label: (kopyanın) elektronik olarak yeniden üretimi @tr
label: kopyasının elektronik yeniden üretimidir @tr
definition: Bir gösterimi, dijital formatta bir kopyayla aktarılan analog formattaki bir kopyayla ilişkilendirir. @tr
toolkit label: kopyanın elektronik olarak yeniden üretimi @tr
toolkit definition: Analog formatta olan ve bir dijital formattaki gösterime aktarılan bir kopya. @tr
alternative label: reproducción electrónica de (item) @es
label: es una reproducción electrónica del item de @es
definition: Relaciona una manifestación con un item en formato analógico que se transfiere a una manifestación en formato digital. @es
toolkit label: reproducción electrónica del item de @es
toolkit definition: Un item en formato analógico que se transfiere a una manifestación en formato digital. @es
has subproperty: P30299

is electronic reproduction of manifestation of
status: Published
definition: Relates a manifestation to a manifestation in an analog format that is transferred to a digital format.
type: Property
domain: C10007
sub property of: is reproduction of manifestation of
lexical alias: electronicReproductionOfManifestationOf.en
toolkit label: electronic reproduction of manifestation of
toolkit definition: A manifestation in an analog format that is transferred to a digital format.
label: est une reproduction électronique d’une manifestation de @fr
definition: Met une manifestation en relation avec une manifestation sur un support analogique qui est transférée dans un format numérique. @fr
toolkit label: reproduction électronique d’une manifestation de @fr
toolkit definition: Manifestation sur un support analogique qui est transférée dans un format numérique. @fr
toolkit label: reproducción electrónica de la manifestación de @es
toolkit definition: Una manifestación en formato analógico que se transfiere a un formato digital. @es
instruction number: 24.5
toolkit label: elektronische reproductie van manifestatie van @nl
toolkit definition: Een manifestatie in een analoog formaat die is overgezet naar een digitaal formaat. @nl
label: là phiên bản điện tử của biểu thị @vi
definition: Liên kết biểu thị với biểu thị dưới định dạng tương tự được chuyển sang định dạng số. @vi
toolkit label: phiên bản điện tử của (biểu thị) @vi
toolkit definition: Biểu thị dưới định dạng tương tự được chuyển sang định dạng số. @vi
label: har elektronisk reproduktion af manifestation af @da
definition: Relaterer en manifestation til en manifestation i et analogt format, som er overført til et digitalt format. @da
toolkit label: elektronisk reproduktion af manifestation af @da
toolkit definition: Manifestation i et analogt format, som er overført til et digitalt format. @da
label: ist elektronische Reproduktion einer Manifestation von @de
definition: Setzt eine Manifestation in Beziehung zu einer Manifestation in einem analogen Format, die in ein digitales Format übertragen wird. @de
toolkit label: Elektronische Reproduktion einer Manifestation von @de
toolkit definition: Eine Manifestation in einem analogen Format, die in ein digitales Format übertragen wird. @de
label: és reproducció electrònica d’una manifestació de @ca
definition: Relaciona una manifestació amb una manifestació en un format analògic que es transfereix a un format digital. @ca
toolkit label: reproducció electrònica d’una manifestació de @ca
toolkit definition: Manifestació en un format analògic que es transfereix a un format digital. @ca
definition: Liittää manifestaation analogisessa muodossa olevaan manifestaatioon, joka on muunnettu digitaaliseen muotoon. @fi
toolkit label: digitoitu manifestaatiosta @fi
toolkit definition: Analogisessa muodossa oleva manifestaatio, joka on muunnettu digitaaliseen muotoon. @fi
toolkit label: elektronisk reproduksjon av manifestasjon av @no
toolkit definition: En manifestasjon i et analogt format som er overført til et digitalt format. @no
label: είναι ηλεκτρονική αναπαραγωγή της (εκδήλωση) @el
definition: Συνδέει μια εκδήλωση με μια εκδήλωση σε ένα αναλογικό μορφότυπο που μεταφέρεται σε ένα ψηφιακό μορφότυπο. @el
toolkit label: ηλεκτρονική αναπαραγωγή της (εκδήλωση) @el
toolkit definition: Μια εκδήλωση σε ένα αναλογικό μορφότυπο που μεταφέρεται σε ένα ψηφιακό μορφότυπο. @el
has element type: 2
label: elektronikus másolata a következő megjelenési formának: @hu
definition: Hozzákapcsol egy megjelenési formát egy analóg formátumú megjelenési formához, amelyet digitális formátumra visznek át. @hu
toolkit label: elektronikus másolata a következő megjelenési formának: @hu
toolkit definition: Egy analóg formátumú megjelenési forma, amelyet digitális formátumra visznek át. @hu
alternative label: electronic reproduction of (manifestation)
label: digitoitu manifestaatiosta @fi
label: har elektronisk reproduksjon av manifestasjon av @no
definition: Relaterer en manifestasjon til en manifestasjon i et analogt format som er overført til et digitalt format. @no
label: is elektronische reproductie van manifestatie van @nl
definition: Relateert een manifestatie aan een manifestatie in een analoog formaat die is overgezet naar een digitaal formaat. @nl
label: هو إنتاج الكتروني لتجسيدة @ar
definition: يربط بين تجسيدة وتجسيدة في شكل تناظري تم تحويلها لشكل رقمي. @ar
toolkit label: إنتاج الكتروني لتجسيدة @ar
toolkit definition: تجسيدة في شكل تناظري تم تحويلها لشكل رقمي. @ar
label: elektrooniline reproduktsioon kehastusest @et
definition: Seostab kehastuse analoogvormis kehastusega, mis on digiteeritud. @et
toolkit label: elektrooniline reproduktsioon kehastusest @et
toolkit definition: Analoogvormis kehastus, mis on digiteeritud. @et
label: è riproduzione elettronica della manifestazione di @it
definition: Correla una manifestazione a una manifestazione in formato analogico, trasferito a un formato digitale. @it
toolkit label: riproduzione elettronica di manifestazione di @it
toolkit definition: Manifestazione in formato analogico, trasferito a un formato digitale. @it
label: ir digitāla reprodukcija manifestācijai @lv
definition: Sasaista manifestāciju ar manifestāciju analogā formātā, kas transformēta digitālā formātā. @lv
toolkit label: ir digitāla reprodukcija manifestācijai @lv
toolkit definition: Manifestācija analogā formātā, kas transformēta digitālā formātā. @lv
alternative label: digitoitu manifestaatio @fi
alternative label: استنساخ إلكتروني لـ (تجسيدة) @ar
alternative label: elektronisk reproduktion af (manifestation) @da
alternative label: Elektronische Reproduktion von (Manifestation) @de
alternative label: reproducció electrònica de (manifestació) @ca
alternative label: ……的电子复制（载体表现） @zh-hans
label: 是载体表现的电子复制 @zh-hans
definition: 将一种载体表现与被转换成数字格式的一种模拟格式载体表现关联起来。 @zh-hans
toolkit label: 载体表现的电子复制 @zh-hans
toolkit definition: 被转换成数字格式的一种模拟格式载体表现 @zh-hans

has electronic reproduction of manifestation
status: Published
definition: Relates a manifestation to a manifestation in a digital format that is the result of the transfer of a manifestation in an analog format.
type: Property
domain: C10007
sub property of: is reproduced as manifestation
lexical alias: electronicReproductionOfManifestation.en
toolkit label: electronic reproduction of manifestation
toolkit definition: A manifestation in a digital format that is the result of the transfer of a manifestation in an analog format.
label: a pour reproduction électronique d’une manifestation @fr
definition: Met une manifestation en relation avec une manifestation en format numérique qui est le résultat du transfert d’une manifestation sur support analogique. @fr
toolkit label: reproduction électronique d’une manifestation @fr
toolkit definition: Manifestation en format numérique qui est le résultat du transfert d’une manifestation sur support analogique. @fr
toolkit label: reproducción electrónica de manifestación @es
toolkit definition: Una manifestación en un formato digital que es el resultado de la transferencia de una manifestación en un formato analógico. @es
instruction number: 24.5
toolkit label: elektronische reproductie van manifestatie @nl
toolkit definition: Een manifestatie in een digitaal formaat die het resultaat is van een kopie van een manifestatie in een analoog formaat. @nl
label: có phiên bản điện tử (biểu thị) @vi
definition: Liên kết biểu thị với biểu thị dưới định dạng số là kết quả của việc chuyển dạng biểu thị dưới định dạng tương tự. @vi
toolkit label: phiên bản điện tử (biểu thị) @vi
toolkit definition: Biểu thị dưới định dạng số là kết quả của việc chuyển dạng biểu thị dưới định dạng tương tự. @vi
label: har elektronisk reproduktion af manifestation @da
definition: Relaterer en manifestation til en manifestation i et digitalt format, som er resultatet af en overførsel af en manifestation i et analogt format. @da
toolkit label: elektronisk reproduktion af manifestation @da
toolkit definition: Manifestation i et digitalt format, som er resultatet af en overførsel af en manifestation i et analogt format. @da
label: hat elektronische Reproduktion einer Manifestation @de
definition: Setzt eine Manifestation in Beziehung zu einer Manifestation in einem digitalen Format, die das Ergebnis der Übertragung einer Manifestation in einem analogen Format ist. @de
toolkit label: Elektronische Reproduktion einer Manifestation @de
toolkit definition: Eine Manifestation in einem digitalen Format, die das Ergebnis der Übertragung einer Manifestation in einem analogen Format ist. @de
label: té com a reproducció electrònica d’una manifestació @ca
definition: Relaciona una manifestació amb una manifestació en un format digital que és el resultat de la transferència d’una manifestació en un format analògic. @ca
toolkit label: reproducció electrònica d’una manifestació @ca
toolkit definition: Manifestació en un format digital que és el resultat de la transferència d’una manifestació en un format analògic. @ca
definition: Liittää manifestaation digitaalisessa muodossa olevaan manifestaatioon, joka analogisen manifestaatio muunnoksen tulos. @fi
toolkit label: manifestaation digitoitu jäljenne @fi
toolkit definition: Digitaalisessa muodossa oleva manifestaatio, joka analogisen manifestaatio muunnoksen tulos. @fi
toolkit label: elektronisk reproduksjon av manifestasjon @no
toolkit definition: En manifestasjon i digitalt format som er resultatet av overføring av en manifestasjon fra analogt format. @no
label: έχει ηλεκτρονική αναπαραγωγή (εκδήλωση) @el
definition: Συνδέει μια εκδήλωση με μια εκδήλωση σε ψηφιακό μορφότυπο που είναι το αποτέλεσμα της μεταφοράς μιας εκδήλωσης σε ένα αναλογικό μορφότυπο. @el
toolkit label: ηλεκτρονική αναπαραγωγή (εκδήλωση) @el
toolkit definition: Μια εκδήλωση σε ψηφιακό μορφότυπο που είναι το αποτέλεσμα της μεταφοράς μιας εκδήλωσης σε ένα αναλογικό μορφότυπο. @el
has element type: 2
label: elektronikus másolata a következő (megjelenési forma): @hu
definition: Hozzákapcsol egy megjelenési formát egy digitális formátumban lévő megjelenési formához, amely egy megjelenési forma analóg formátumból történő átviteléből ered. @hu
toolkit label: megjelenési forma elektronikus másolata: @hu
toolkit definition: Egy digitális formátumban lévő megjelenési forma, amely egy megjelenési forma analóg formátumból történő átviteléből ered. @hu
alternative label: electronic reproduction (manifestation)
label: manifestaation digitoitu jäljenne @fi
label: har elektronisk reproduksjon av manifestasjon @no
definition: Relaterer en manifestasjon til en manifestasjon i digitalt format som er resultatet av overføring av en manifestasjon fra analogt format. @no
label: heeft elektronische reproductie van manifestatie @nl
definition: Relateert een manifestatie aan een manifestatie in een digitaal formaat die het resultaat is van een kopie van een manifestatie in een analoog formaat. @nl
alternative label: digitoitu jäljenne (manifestaatio) @fi
label: له استنساخ إلكتروني لتجسيدة @ar
definition: يربط بين تجسيدة وتجسيدة في شكل رقمي ناتجة عن تحويلها في شكل تناظري. @ar
toolkit label: استنساخ إلكتروني لتجسيدة @ar
toolkit definition: تجسيدة في شكل رقمي ناتجة عن تحويلها في شكل تناظري. @ar
label: kehastuse elektrooniline reproduktsioon @et
definition: Seostab kehastuse digitaalvormis kehastusega, mis on saadud analoogvormis kehastuse digiteerimise teel. @et
toolkit label: kehastuse elektrooniline reproduktsioon @et
toolkit definition: Digitaalvormis kehastus, mis on saadud analoogvormis kehastuse digiteerimise teel. @et
label: ha come riproduzione elettronica di una manifestazione @it
definition: Correla una manifestazione a una manifestazione in un formato digitale, risultato del trasferimento di una manifestazione in formato analogico. @it
toolkit label: riproduzione elettronica di una manifestazione @it
toolkit definition: Manifestazione in un formato digitale, risultato del trasferimento di una manifestazione in formato analogico. @it
label: manifestācijas digitāla reprodukcija @lv
definition: Sasaista manifestāciju ar manifestāciju digitālā formātā, kas ir analoga formāta manifestācijas transformācijas rezultāts. @lv
toolkit label: manifestācijas digitāla reprodukcija @lv
toolkit definition: Manifestācija digitālā formātā, kas ir analoga formāta manifestācijas transformācijas rezultāts. @lv
alternative label: استنساخ إلكتروني (تجسيدة) @ar
alternative label: elektronisk reproduktion (manifestation) @da
alternative label: Elektronische Reproduktion (Manifestation) @de
alternative label: reproducció electrònica (manifestació) @ca
alternative label: 电子复制品（载体表现） @zh-hans
label: 有载体表现的电子复制品 @zh-hans
definition: 将一种载体表现与从模拟格式的载体表现转储为一种数字格式而形成的载体表现关联起来。 @zh-hans
toolkit label: 载体表现的电子复制品 @zh-hans
toolkit definition: 从模拟格式的载体表现转储为一种数字格式而形成的载体表现 @zh-hans

has production statement
status: Published
definition: Relates a manifestation to a statement that identifies a place of production, a producer, or a date of production of an unpublished manifestation.
type: Property
domain: C10007
lexical alias: productionStatement.en
scope note: A production statement includes a statement about the inscription, fabrication, construction, etc., of an unpublished manifestation.
instruction number: 2.7
toolkit label: production statement
toolkit definition: A statement that identifies a place of production, a producer, or a date of production of an unpublished manifestation.
label: a pour mention de production @fr
definition: Met une manifestation en relation avec une mention qui identifie un lieu de production, un producteur ou une date de production d’une manifestation non publiée. @fr
scope note: Une mention de production comprend une mention relative à la scription, à la fabrication, à la construction, etc. d’une manifestation non publiée. @fr
toolkit label: mention de production @fr
toolkit definition: Mention qui identifie un lieu de production, un producteur ou une date de production d’une manifestation non publiée. @fr
toolkit label: declaración de producción @es
toolkit definition: Una declaración que identifica un lugar de producción, un productor o una fecha de producción de una manifestación inédita. @es
label: har produktionsuppgift @sv
toolkit label: produktionsuppgift @sv
toolkit label: productievermelding @nl
toolkit definition: Een vermelding die een plaats van productie, een producent of een datum van productie identificeert van een ongepubliceerde manifestatie. @nl
label: có thông tin sản xuất @vi
definition: Liên kết biểu thị với thông tin nhận dạng địa điểm hoặc các địa điểm sản xuất, nhà sản xuất hoặc các nhà sản xuất , và ngày hoặc các ngày sản xuất của biểu thị dưới hình thái không xuất bản. @vi
scope note: Thông tin sản xuất bao gồm thông tin liên quan tới khắc, kết cấu, cấu tạo, v.v..., của biểu thị dưới hình thái không xuất bản. @vi
toolkit label: thông tin sản xuất @vi
toolkit definition: Thông tin nhận dạng địa điểm hoặc các địa điểm sản xuất, nhà sản xuất hoặc các nhà sản xuất , và ngày hoặc các ngày sản xuất của biểu thị dưới hình thái không xuất bản. @vi
scope note: Een vermelding van productie omvat een vermelding met betrekking tot de afschrijving, vervaardiging, constructie etc. van een ongepubliceerde manifestatie. @nl
label: har produktionsoplysning @da
definition: Relaterer en manifestation til en oplysning, som identificerer produktionssted- eller steder, producer eller producere og produktionsdato- eller datoer for en upubliceret manifestation. @da
scope note: Produktionsoplysning omfatter en oplysning, som relaterer til indskrift, fremstilling, konstruktion etc. af en upubliceret manifestation. @da
toolkit label: produktionsoplysning @da
toolkit definition: Oplysning, som identificerer produktionssted- eller steder, producer eller producere og produktionsdato- eller datoer for en upubliceret manifestation. @da
label: hat Entstehungsangabe @de
definition: Setzt eine Manifestation in Beziehung zu einer Angabe, die einen Entstehungsort, eine Produzentin/einen Produzenten oder ein Entstehungsdatum einer unveröffentlichten Manifestation identifiziert. @de
scope note: Darunter fallen Angaben zur Beschriftung, zur Fabrikation und zur Konstruktion und so weiter einer unveröffentlichten Manifestation. @de
toolkit label: Entstehungsangabe @de
toolkit definition: Eine Angabe, die einen Entstehungsort, eine Produzentin/einen Produzenten oder ein Entstehungsdatum einer unveröffentlichten Manifestation identifiziert. @de
label: té com a menció de producció @ca
definition: Relaciona una manifestació amb una menció que identifica un lloc de producció, un productor o una data de producció d’una manifestació no publicada. @ca
scope note: Una menció de producció inclou una menció sobre la inscripció, la fabricació, la construcció, etc., d’una manifestació no publicada. @ca
toolkit label: menció de producció @ca
toolkit definition: Menció que identifica un lloc de producció, un productor o una data de producció d’una manifestació no publicada. @ca
definition: Liittää manifestaation merkintöön, joka identifioi julkaisemattoman manifestaation tuotantopaikan, tuottajan tai tuotantoajan. @fi
toolkit label: tuotantomerkintö @fi
toolkit definition: Merkintö, joka identifioi julkaisemattoman manifestaation tuotantopaikan, tuottajan tai tuotantoajan. @fi
toolkit label: produksjonsangivelse @no
toolkit definition: En angivelse som identifiserer et sted eller steder for produksjon, produsent eller produsenter og dato eller datoer for produksjon av en upublisert manifestasjon. @no
label: έχει μνεία παραγωγής @el
definition: Συνδέει μια εκδήλωση με μια μνεία που ταυτίζει έναν τόπο ή τόπους παραγωγής, έναν παραγωγό ή παραγωγούς και μια χρονολογία ή χρονολογίες παραγωγής μιας εκδήλωσης σε μια μη δημοσιευμένη μορφή. @el
scope note: Οι μνείες παραγωγής περιλαμβάνουν μνείες που σχετίζονται με την εγγραφή, την κατασκευή, τη δόμηση κ.λπ. μιας εκδήλωσης σε μια μη δημοσιευμένη μορφή. @el
toolkit label: μνεία παραγωγής @el
toolkit definition: Μια μνεία που ταυτίζει έναν τόπο ή τόπους παραγωγής, έναν παραγωγό ή παραγωγούς και μια χρονολογία ή χρονολογίες παραγωγής μιας εκδήλωσης σε μια μη δημοσιευμένη μορφή. @el
has element type: 6
label: előállítási közlése a következő: @hu
definition: Hozzákapcsol egy megjelenési formát egy közléshez, amely azonosítja egy kiadatlan megjelenési forma előállítási helyét, előállítóját és az előállítás időpontját. @hu
scope note: előállítási közlése: @hu
toolkit label: Egy közlés, amely azonosítja egy kiadatlan megjelenési forma előállítási helyét, előállítóját és az előállítás időpontját. @hu
toolkit definition: Az előállítási közlések olyan közléseket tartalmaznak, amelyek egy kiadatlan megjelenési forma írására, összeállítására, készítésére stb. vonatkoznak. @hu
scope note: Tuotantomerkintö sisältää julkaisemattoman manifestaation kaivertamiseen, valmistamiseen, kokoamiseen tms. liittyvän merkinnön. @fi
label: tuotantomerkintö @fi
label: har produksjonsangivelse @no
definition: Relaterer en manifestasjon til en angivelse som identifiserer et sted eller steder for produksjon, produsent eller produsenter og dato eller datoer for produksjon av en upublisert manifestasjon. @no
scope note: En produksjonsangivelse inkluderer angivelse knyttet til inskripsjon, fabrikasjon, konstruksjon etc. av en upublisert manifestasjon. @no
label: heeft productievermelding @nl
definition: Relateert een manifestatie aan een vermelding die een plaats van productie, een producent of een datum van productie identificeert van een ongepubliceerde manifestatie. @nl
label: له بيان إنتاج @ar
definition: يربط بين تجسيدة وبيان يحدد مكان أو أماكن إنتاج، ومنتج أو منتجون، وتاريخ أو تواريخ إنتاج خاص بتجسيدة غير منشورة. @ar
scope note: يشمل بيان الإنتاج البيان المرتبط بالتسجيل، أو الصناعة، أو الإنشاء، إلخ. لتجسيدة غير منشورة. @ar
toolkit label: بيان إنتاج @ar
toolkit definition: بيان يحدد مكان أو أماكن إنتاج، ومنتج أو منتجون، وتاريخ أو تواريخ إنتاج خاص بتجسيدة غير منشورة. @ar
label: tootmisandmed @et
definition: Seostab kehastuse andmetega, mis identifitseerivad avaldamata kehastuse tootmiskoha(d), tootja(d) ja tootmisaja(d). @et
scope note: Tootmisandmed hõlmavad andmeid, mis on seotud avaldamata kehastuse inskribeerimisega, tootmisega, ehitamisega vms. @et
toolkit label: tootmisandmed @et
toolkit definition: Andmed, mis identifitseerivad avaldamata kehastuse tootmiskoha(d), tootja(d) ja tootmisaja(d). @et
label: ha come formulazione di produzione @it
definition: Correla una manifestazione a una formulazione che identifica il luogo o i luoghi di produzione, il produttore o i produttori e la data o le date di produzione di una manifestazione non pubblicata. @it
scope note: Una formulazione di produzione comprende formulazioni relative all'iscrizione, fabbricazione, costruzione, etc., di una manifestazione non pubblicata. @it
toolkit label: formulazione di produzione @it
toolkit definition: Formulazione che identifica il luogo o i luoghi di produzione, il produttore o i produttori e la data o le date di produzione di una manifestazione non pubblicata. @it

has details of production method
status: Published
type: Property
lexical alias: detailsOfProductionMethod.en
definition: Relates a manifestation to details of a process that is used to produce a manifestation.
domain: C10007
instruction number: 3.9.1.4
toolkit label: details of production method
toolkit definition: Details of a process that is used to produce a manifestation.
toolkit label: detalles del método de producción @es
toolkit definition: Detalles de un proceso que se utiliza para producir una manifestación. @es
label: har detaljerad information om produktionsmetod @sv
toolkit label: detaljerad information om produktionsmetod @sv
toolkit label: details van productiemethode @nl
toolkit definition: Details van een procedé dat gebruikt wordt om een resource te produceren. @nl
label: có chi tiết của phương pháp sản xuất @vi
definition: Liên kết biểu thị với chi tiết của quy trình được sử dụng để sản xuất biểu thị. @vi
toolkit label: chi tiết của phương pháp sản xuất @vi
toolkit definition: Chi tiết của quy trình được sử dụng để sản xuất biểu thị. @vi
label: har detaljer om produktionsmetode @da
definition: Relaterer en manifestation til detaljer om den proces, som anvendes til at fremstille en manifestation. @da
toolkit label: detaljer om produktionsmetode @da
toolkit definition: Detaljer om den proces, som anvendes til at fremstille en manifestation. @da
label: hat Details zur Entstehungsmethode @de
definition: Setzt eine Manifestation in Beziehung zu den Details zu dem Verfahren, das angewendet wird, um eine Manifestation zu erzeugen. @de
toolkit label: Details zur Entstehungsmethode @de
toolkit definition: Details zu dem Verfahren, das angewendet wird, um eine Manifestation zu erzeugen. @de
label: té com a particularitats de mètode de producció @ca
definition: Relaciona una manifestació amb les particularitats d’un procés que s’usa per produir una manifestació. @ca
toolkit label: particularitats de mètode de producció @ca
toolkit definition: Particularitats d’un procés que s’usa per produir una manifestació. @ca
definition: Liittää manifestaation tarkempiin tietoihin aineiston tuottamisessa käytettävästä menetelmästä. @fi
toolkit label: valmistusmenetelmän tarkemmat tiedot @fi
toolkit definition: Tarkemmat tiedot aineiston tuottamisessa käytettävästä menetelmästä. @fi
toolkit label: detaljer vedrørende produksjonsmetode @no
toolkit definition: Detaljer vedrørende en prosess som er brukt for å produsere en manifestasjon. @no
label: έχει λεπτομέρειες της μεθόδου παραγωγής @el
definition: Συνδέει μια εκδήλωση με τις λεπτομέρειες μιας διαδικασίας που χρησιμοποιείται για την παραγωγή μιας εκδήλωσης. @el
toolkit label: λεπτομέρειες της μεθόδου παραγωγής @el
toolkit definition: Λεπτομέρειες μιας διαδικασίας που χρησιμοποιείται για την παραγωγή μιας εκδήλωσης. @el
label: a pour particularités d’une méthode de production @fr
definition: Met une manifestation en relation avec des particularités d’un procédé qui est utilisé pour produire une manifestation. @fr
toolkit label: particularités d’une méthode de production @fr
toolkit definition: Particularités d’un procédé qui est utilisé pour produire une manifestation. @fr
has element type: 6
label: előállítási módszer részletei a következők: @hu
definition: Hozzákapcsol egy megjelenési formát egy megjelenési forma előállítására használt eljárás részleteihez. @hu
toolkit label: előállítási módszer részletei @hu
toolkit definition: Részletek egy eljárásról, amelyet egy megjelenési forma előállítására használnak. @hu
label: valmistusmenetelmän tarkemmat tiedot @fi
label: har detaljer vedrørende produksjonsmetode @no
definition: Relaterer en manifestasjon til detaljer vedrørende en prosess som er brukt for å produsere en manifestasjon. @no
label: heeft details van productiemethode @nl
definition: Relateert een manifestatie aan details van een procedé dat gebruikt wordt om een resource te produceren. @nl
label: له تفاصيل طريقة إنتاج @ar
definition: يربط بين تجسيدة وتفاصيل عملية مستخدمة لإنتاج تجسيدة. @ar
toolkit label: تفاصيل طريقة إنتاج @ar
toolkit definition: تفاصيل عملية مستخدمة لإنتاج تجسيدة. @ar
label: valmistamisviisi täpsustus @et
definition: Seostab kehastuse täpsemate andmetega kehastuse valmistamiseks kasutatud protsessi kohta. @et
toolkit label: valmistamisviisi täpsustus @et
toolkit definition: Täpsemad andmed kehastuse valmistamiseks kasutatud protsessi kohta. @et
label: ha come particolari relativi al metodo di produzione @it
definition: Correla una manifestazione ai particolari relativi a un processo utilizzato nella produzione di una risorsa. @it
toolkit label: particolari relativi al metodo di produzione @it
toolkit definition: Particolari relativi a un processo utilizzato nella produzione di una risorsa. @it
label: detalizēti par izgatavošanas metodi @lv
definition: Sasaista manifestāciju ar sīkāku informāciju par manifestācijas izgatavošanas procesu. @lv
toolkit label: detalizēti par izgatavošanas metodi @lv
toolkit definition: Sīkāka informācija par manifestācijas izgatavošanas procesu. @lv
label: 有制作方法细节 @zh-hans
definition: 将一种载体表现与用于制作一种载体表现的一个过程的细节关联起来。 @zh-hans
toolkit label: 制作方法细节 @zh-hans
toolkit definition: 用于制作一种载体表现的一个过程的细节 @zh-hans
label: üretim yöntemi ayrıntıları ile ilişkilidir @tr
definition: Bir gösterimi, bir gösterim üretmek için kullanılan bir sürecin ayrıntılarıyla ilişkilendirir. @tr
toolkit label: üretim yönteminin ayrıntıları @tr
toolkit definition: Bir gösterimi üretmek için kullanılan bir sürecin ayrıntıları. @tr
label: tiene detalles del método de producción @es
definition: Relaciona una manifestación con detalles de un proceso que se utiliza para producir una manifestación. @es

has parallel place of production
status: Published
definition: Relates a manifestation to a place of production in another language or script.
type: Property
domain: C10007
lexical alias: parallelPlaceOfProduction.en
instruction number: 2.7.3
toolkit label: parallel place of production
toolkit definition: A place of production in another language or script.
label: a pour forme parallèle d’un lieu de production @fr
definition: Met une manifestation en relation avec un lieu de production dans une autre langue ou écriture. @fr
toolkit label: forme parallèle d’un lieu de production @fr
toolkit definition: Lieu de production dans une autre langue ou écriture. @fr
toolkit label: lugar de producción paralelo @es
toolkit definition: Un lugar de producción en otra lengua o escritura. @es
label: har parallell produktionsort @sv
toolkit label: parallell produktionsort @sv
toolkit label: parallelle plaats van productie @nl
toolkit definition: Een plaats van productie in een andere taal of schrift. @nl
label: có địa điểm sản xuất song song @vi
definition: Liên kết biểu thị với địa điểm sản xuất trong ngôn ngữ hoặc hệ thống viết khác với được ghi trong yếu tố địa điểm sản xuất. @vi
toolkit label: địa điểm sản xuất song song @vi
toolkit definition: Địa điểm sản xuất trong ngôn ngữ hoặc hệ thống viết khác với được ghi trong yếu tố địa điểm sản xuất. @vi
label: har parallelt produktionssted @da
definition: Relaterer en manifestation til et produktionssted på et andet sprog eller skriftsystem. @da
toolkit label: parallelt produktionssted @da
toolkit definition: Produktionssted på et andet sprog eller skriftsystem. @da
label: hat parallelen Entstehungsort @de
definition: Setzt eine Manifestation in Beziehung zu einem Entstehungsort in einer anderen Sprache oder einer anderen Schrift. @de
toolkit label: Paralleler Entstehungsort @de
toolkit definition: Ein Entstehungsort in einer anderen Sprache oder einer anderen Schrift. @de
label: té com a lloc paral·lel de producció @ca
definition: Relaciona una manifestació amb un lloc de producció en una altra llengua o escriptura. @ca
toolkit label: lloc paral·lel de producció @ca
toolkit definition: Lloc de producció en una altra llengua o escriptura. @ca
definition: Liittää manifestaation tuotantopaikkaan toisella kielellä ja/tai kirjoitusjärjestelmällä. @fi
toolkit label: rinnakkainen tuotantopaikka @fi
toolkit definition: Tuotantopaikka toisella kielellä ja/tai kirjoitusjärjestelmällä. @fi
toolkit label: parallelt produksjonssted @no
toolkit definition: Et produksjonssted på et annet språk eller i et annet skriftsystem. @no
label: έχει παράλληλο τόπο παραγωγής @el
definition: Συνδέει μια εκδήλωση με έναν τόπο παραγωγής σε μια γλώσσα ή γραφή που διαφέρει από εκείνη με την οποία καταχωρίστηκε στο στοιχείο του τόπου παραγωγής. @el
toolkit label: παράλληλος τόπος παραγωγής @el
toolkit definition: Ένας τόπος παραγωγής σε μια γλώσσα ή γραφή που διαφέρει από εκείνη με την οποία καταχωρίστηκε στο στοιχείο του τόπου παραγωγής. @el
sub property of: has place of production
has element type: 3
label: párhuzamos előállítási helye a következő: @hu
definition: Hozzákapcsol egy megjelenési formát egy előállítási helyhez másik nyelven vagy írásrendszerben. @hu
toolkit label: párhuzamos előállítási helye: @hu
toolkit definition: Előállítás helye más nyelven vagy írásrendszerben. @hu
label: rinnakkainen tuotantopaikka @fi
label: har parallelt produksjonssted @no
definition: Relaterer en manifestasjon til et produksjonssted på et annet språk eller i et annet skriftsystem. @no
label: heeft parallelle plaats van productie @nl
definition: Relateert een manifestatie aan een plaats van productie in een andere taal of schrift. @nl
label: له مكان إنتاج موازي @ar
definition: يربط بين تجسيدة ومكان إنتاج في لغة أخرى أو نظام آخر للحروف. @ar
toolkit label: مكان إنتاج موازي @ar
toolkit definition: مكان إنتاج في لغة أخرى أو نظام آخر للحروف. @ar
label: tootmiskoha rööpandmed @et
definition: Seostab kehastuse tootmiskohaga teises keeles või kirjasüsteemis. @et
toolkit label: tootmiskoha rööpandmed @et
toolkit definition: Tootmiskoht teises keeles või kirjasüsteemis. @et
label: ha come luogo di produzione parallelo @it
definition: Correla una manifestazione a un luogo di produzione, in una lingua o scrittura diversa. @it
toolkit label: luogo di produzione parallelo @it
toolkit definition: Luogo di produzione in una lingua o scrittura diversa. @it
label: paralēlā izgatavošanas vieta @lv
definition: Sasaista manifestāciju ar izgatavošanas vietu citā valodā vai rakstībā. @lv
toolkit label: paralēlā izgatavošanas vieta @lv
toolkit definition: Izgatavošanas vieta citā valodā vai rakstībā. @lv
label: 有并列制作地 @zh-hans
definition: 将一种载体表现与用另一种语言或文字的制作地关联起来。 @zh-hans
toolkit label: 并列制作地 @zh-hans
toolkit definition: 用另一种语言或文字的制作地 @zh-hans
label: paralel yapım yeri ile ilişkilidir @tr
definition: Bir gösterimi, başka bir dil veya alfabedeki bir üretim yeri ile ilişkilendirir. @tr
toolkit label: paralel yapım yeri @tr
toolkit definition: Başka bir dilde veya alfabede üretim yeri. @tr
label: tiene un lugar de producción paralelo @es

has name of producer
status: Published
definition: Relates a manifestation to a nomen that is a name of an agent who is responsible for inscribing, fabricating, constructing, or other method of producing an unpublished manifestation.
type: Property
domain: C10007
lexical alias: nameOfProducer.en
instruction number: 2.7.4
toolkit label: name of producer
toolkit definition: A nomen that is a name of an agent who is responsible for inscribing, fabricating, constructing, or other method of producing an unpublished manifestation.
label: a pour nom de producteur @fr
definition: Met une manifestation en relation avec un nomen qui est un nom d’un agent responsable de la scription, de la fabrication, de la construction ou de toute autre méthode de production d’une manifestation non publiée. @fr
toolkit label: nom de producteur @fr
toolkit definition: Nomen qui est un nom d’un agent responsable de la scription, de la fabrication, de la construction ou de toute autre méthode de production d’une manifestation non publiée. @fr
toolkit label: nombre del productor @es
toolkit definition: Un nomen que es el nombre de un agente responsable de inscribir, fabricar, construir u otro método de producir una manifestación inédita. @es
label: har producentnamn @sv
toolkit label: producentnamn @sv
toolkit label: naam van producent @nl
toolkit definition: Een nomen dat is een naam van een actor die verantwoordelijk is voor het afschrijven, fabriceren, construeren of andere methode van het produceren van een ongepubliceerde manifestatie. @nl
label: có tên nhà sản xuất @vi
definition: Liên kết biểu thị với tên của tác nhân có trách nhiệm về khắc, kết cấu, cấu trúc, v.v..., biểu thị dưới hình thái không xuất bản. @vi
toolkit label: tên nhà sản xuất @vi
toolkit definition: Tên của tác nhân có trách nhiệm về khắc, kết cấu, cấu trúc, v.v..., biểu thị dưới hình thái không xuất bản. @vi
label: har navn på producer @da
definition: Relaterer en manifestation til et navn på en agent, som er ansvarlig for indskrift, fremstilling, konstruering etc. af en upubliceret manifestation. @da
toolkit label: navn på producer @da
toolkit definition: Navn på en agent, som er ansvarlig for indskrift, fremstilling, konstruering etc. af en upubliceret manifestation. @da
label: hat Erzeugername @de
definition: Setzt eine Manifestation in Beziehung zum Namen eines Akteurs, der für das Gravieren, Fabrizieren, Konstruieren oder eine andere Entstehungsmethode einer unveröffentlichten Manifestation verantwortlich ist. @de
toolkit label: Erzeugername @de
toolkit definition: Ein Name eines Akteurs, der für das Gravieren, Fabrizieren, Konstruieren oder eine andere Entstehungsmethode einer unveröffentlichten Manifestation verantwortlich ist. @de
label: té com a nom de productor @ca
definition: Relaciona una manifestació amb un nomen que és un nom d’un agent que és responsable de la inscripció, la fabricació, la construcció o un altre mètode de producció d’una manifestació no publicada. @ca
toolkit label: nom de productor @ca
toolkit definition: Nomen que és un nom d’un agent que és responsable de la inscripció, la fabricació, la construcció o un altre mètode de producció d’una manifestació no publicada. @ca
definition: Liittää manifestaation nomeniin, joka on julkaisemattoman manifestaation kaiverruksesta, valmistuksesta, kokoonpanosta tai muusta tuotantotavasta vastuussa olevan toimijan nimi. @fi
toolkit label: tuottajan nimi @fi
toolkit definition: Nomen, joka on julkaisemattoman manifestaation kaiverruksesta, valmistuksesta, kokoonpanosta tai muusta tuotantotavasta vastuussa olevan toimijan nimi. @fi
toolkit label: navn på produsent @no
toolkit definition: Et navn på en agent som er ansvarlig for å inskribere, fabrikere, konstruere etc. en upublisert manifestasjon. @no
label: έχει όνομα παραγωγού @el
definition: Συνδέει μια εκδήλωση σε ένα όνομα ενός φορέα υπεύθυνου για την εγγραφή, την κατασκευή, τη δόμηση κ.λπ. μιας εκδήλωσης σε μια μη δημοσιευμένη μορφή. @el
toolkit label: όνομα παραγωγού @el
toolkit definition: Ένα όνομα ενός φορέα υπεύθυνου για την εγγραφή, την κατασκευή, τη δόμηση κ.λπ. μιας εκδήλωσης σε μια μη δημοσιευμένη μορφή. @el
sub property of: has name of agent of manifestation
alternative label: producer's name
has element type: 3
label: előállító neve a következő: @hu
definition: Hozzákapcsol egy megjelenési formát egy nomenhez, amely egy kiadatlan megjelenési forma írásáért, összeállításáért, készítéséért vagy egyéb módú előállításáért felelős ágens neve. @hu
toolkit label: előállító neve: @hu
toolkit definition: Egy nomen, amely egy kiadatlan megjelenési forma írásáért, összeállításáért, készítéséért vagy egyéb módú előállításáért felelős ágens neve. @hu
label: tuottajan nimi @fi
label: har navn på produsent @no
definition: Relaterer en manifestasjon til et navn på en agent som er ansvarlig for å inskribere, fabrikere, konstruere etc. en upublisert manifestasjon. @no
alternative label: produsentens navn @no
label: heeft naam van producent @nl
definition: Relateert een manifestatie aan een nomen dat is een naam van een actor die verantwoordelijk is voor het afschrijven, fabriceren, construeren of andere methode van het produceren van een ongepubliceerde manifestatie. @nl
label: له اسم منتج @ar
definition: يربط بين تجسيدة واسم وكيل مسئول عن تسجيل، أو تصنيع، أو إنشاء، إلخ. تجسيدة غير منشورة. @ar
alternative label: اسم منتج @ar
toolkit label: اسم منتج @ar
toolkit definition: اسم وكيل مسئول عن تسجيل، أو تصنيع، أو إنشاء، إلخ. تجسيدة غير منشورة. @ar
alternative label: producers navn @da
label: tootja nimi @et
definition: Seostab kehastuse avaldamata kehastuse inskribeerimise, tootmise, ehitamise vms eest vastutava tegija nimega. @et
toolkit label: tootja nimi @et
toolkit definition: Avaldamata kehastuse inskribeerimise, tootmise, ehitamise vms eest vastutava tegija nimi. @et
alternative label: előállítója neve: @hu
label: ha come nome del produttore @it
definition: Correla una manifestazione a un nome di un agente responsabile dell’iscrizione, fabbricazione, costruzione, etc. di una manifestazione non pubblicata. @it
toolkit label: nome del produttore @it
toolkit definition: Nome di un agente responsabile dell’iscrizione, fabbricazione, costruzione, etc. di una manifestazione non pubblicata. @it
label: izgatavotāja vārds/nosaukums @lv
definition: Sasaista manifestāciju ar nomenu, kas ir vārds/nosaukums aģentam, kurš ir atbildīgs par nepublicētas manifestācijas pierakstīšanu, izgatavošanu, izveidošanu u.tml. @lv
toolkit label: izgatavotāja vārds/nosaukums @lv
toolkit definition: Vārds/nosaukums aģentam, kurš ir atbildīgs par nepublicētas manifestācijas pierakstīšanu, izgatavošanu, izveidošanu u.tml. @lv
alternative label: 制作者名称 @zh-hans
label: 有制作者名称 @zh-hans
definition: 将一种载体表现与作为负责镌刻、制造、构建或其他方法制作一种非出版载体表现的一个行为者之名称的一个命名关联起来。 @zh-hans
toolkit label: 制作者名称 @zh-hans

has preferred citation
status: Published
definition: Relates a manifestation to a citation for a manifestation in the form preferred by a creator, publisher, custodian, indexing or abstracting service, or other agent.
type: Property
domain: C10007
lexical alias: preferredCitation.en
instruction number: 2.16
toolkit label: preferred citation
toolkit definition: A citation for a manifestation in the form preferred by a creator, publisher, custodian, indexing or abstracting service, or other agent.
label: a pour citation privilégiée @fr
definition: Met une manifestation en relation avec une citation d’une manifestation sous la forme privilégiée par un créateur, un éditeur, un dépositaire, un service d’indexation ou d’analyse ou un autre agent. @fr
toolkit label: citation privilégiée @fr
toolkit definition: Citation d’une manifestation sous la forme privilégiée par un créateur, un éditeur, un dépositaire, un service d’indexation ou d’analyse ou un autre agent. @fr
toolkit label: cita preferida @es
toolkit definition: Una cita de una manifestación en la forma preferida por un creador, editorial, custodio, servicio de indexación o abstracción, u otro agente. @es
label: har föredragen referensform @sv
toolkit label: föredragen referensform @sv
toolkit label: voorkeurscitatie @nl
toolkit definition: Een citatie voor een manifestatie in de vorm geprefereerd door een maker, uitgever, bewaarder, dienst voor indexeren of samenvatten, of andere actor. @nl
label: có trích dẫn ưu tiên @vi
definition: Liên kết biểu thị với trích dẫn cho biểu thị dưới hình thái ưu tiên của người sáng tạo, nhà xuất bản, người giám hộ, dịch vụ định chỉ mục hoặc tóm tắt, v.v... @vi
toolkit label: trích dẫn ưu tiên @vi
toolkit definition: Trích dẫn cho biểu thị dưới hình thái ưu tiên của người sáng tạo, nhà xuất bản, người giám hộ, dịch vụ định chỉ mục hoặc tóm tắt, v.v... @vi
label: har foretrukken henvisningsstil @da
definition: Relaterer en manifestation til en henvisning til en manifestation i den stil foretrukken af et ophav, en udgiver, en forvalter eller virksomheder, der udarbejder referater og abstracts etc. @da
toolkit label: foretrukken henvisningsstil @da
toolkit definition: Henvisning til en manifestation i den stil foretrukken af et ophav, en udgiver, en forvalter eller virksomheder, der udarbejder referater og abstracts etc. @da
label: hat bevorzugte Zitierweise @de
definition: Setzt eine Manifestation in Beziehung zu einer Zitierweise für eine Manifestation, die von einer geistigen Schöpferin/einem geistigen Schöpfer, einem Verlag, einer Verwahrerin/einem Verwahrer, einem Indexierungs- oder Abstract-Service oder einem anderen Akteur bevorzugt wird. @de
toolkit label: bevorzugte Zitierweise @de
toolkit definition: Eine Zitierweise für eine Manifestation, die von einer geistigen Schöpferin/einem geistigen Schöpfer, einem Verlag, einer Verwahrerin/einem Verwahrer, einem Indexierungs- oder Abstract-Service oder einem anderen Akteur bevorzugt wird. @de
label: té com a citació preferida @ca
definition: Relaciona una manifestació amb una citació d’una manifestació en la forma preferida per un creador, un editor, un dipositari, un servei d’indexació i resums o un altre agent. @ca
toolkit label: citació preferida @ca
toolkit definition: Citació d’una manifestació en la forma preferida per un creador, un editor, un dipositari, un servei d’indexació i resums o un altre agent. @ca
definition: Liittää manifestaation viittausmuotoon, jonka teoksen tekijä, kustantaja, aineiston säilyttäjä, tiivistelmä- ja indeksointipalvelu tai muu toimija on valinnut ensisijaiseksi. @fi
toolkit label: ensisijainen viittausmuoto @fi
toolkit definition: Manifestaation viittausmuoto, jonka teoksen tekijä, kustantaja, aineiston säilyttäjä, tiivistelmä- ja indeksointipalvelu tai muu toimija on valinnut ensisijaiseksi. @fi
toolkit label: foretrukket referanse @no
toolkit definition: En henvisning til en manifestasjon i den form som opphavsperson, utgiver, oppbevarer, indekseringstjenester eller tjenester som lager sammendrag, foretrekker. @no
label: έχει προτιμώμενη αναφορά @el
definition: Συνδέει μια εκδήλωση με μια αναφορά για μια εκδήλωση στη μορφή που προτιμάται από έναν δημιουργό, έναν εκδότη, έναν θεματοφύλακα, μια υπηρεσία ευρετηρίασης ή επιτομής κ.λπ. @el
toolkit label: προτιμώμενη αναφορά @el
toolkit definition: Μια αναφορά για μια εκδήλωση στη μορφή που προτιμάται από έναν δημιουργό, έναν εκδότη, έναν θεματοφύλακα, μια υπηρεσία ευρετηρίασης ή επιτομής κ.λπ. @el
has element type: 6
label: előnyben részesített hivatkozása a következő: @hu
definition: Hozzákapcsol egy megjelenési formát egy megjelenési formára utaló hivatkozáshoz olyan formában, amelyet egy létrehozó, kiadó, gyűjteményvezető, indexelő vagy referáló szolgáltatás vagy egyéb ágens előnyben részesít. @hu
toolkit label: előnyben részesített hivatkozása a következő: @hu
toolkit definition: Egy megjelenési formára utaló hivatkozás olyan formában, amelyet egy létrehozó, kiadó, gyűjteményvezető, indexelő vagy referáló szolgáltatás vagy egyéb ágens előnyben részesít. @hu
label: ensisijainen viittausmuoto @fi
label: har foretrukket referanse @no
definition: Relaterer en manifestasjon til en henvisning til en manifestasjon i den form som opphavsperson, utgiver, oppbevarer, indekseringstjenester eller tjenester som lager sammendrag, foretrekker. @no
label: heeft voorkeurscitatie @nl
definition: Relateert een manifestatie aan een citatie voor een manifestatie in de vorm geprefereerd door een maker, uitgever, bewaarder, dienst voor indexeren of samenvatten, of andere actor. @nl
label: له استشهاد مفضل @ar
definition: يربط بين تجسيدة واستشهاد لتجسيدة في الشكل المفضل للمنشئ، أو الناشر، أو الجهة المودعة، أو خدمة التكشيف والاستخلاص، أو وكيل آخر. @ar
toolkit label: استشهاد مفضل @ar
toolkit definition: استشهاد لتجسيدة في الشكل المفضل للمنشئ، أو الناشر، أو الجهة المودعة، أو خدمة التكشيف والاستخلاص، أو وكيل آخر. @ar
label: eelistatud viitevorm @et
definition: Seostab kehastuse kehastuse viitega vormis, mida eelistab autor, kirjastaja, säilitaja, indekseerimis- ja annoteerimisteenus vms. @et
toolkit label: eelistatud viitevorm @et
toolkit definition: Kehastuse viide vormis, mida eelistab autor, kirjastaja, säilitaja, indekseerimis- ja annoteerimisteenus vms. @et
label: ha come citazione preferita @it
definition: Correla una manifestazione a una citazione per una manifestazione nella forma preferita dal creatore, editore, depositario, servizio di indicizzazione o abstracting, etc. @it
toolkit label: citazione preferita @it
toolkit definition: Citazione per una manifestazione nella forma preferita dal creatore, editore, depositario, servizio di indicizzazione o abstracting, etc. @it
label: prioritārā atsauce @lv
definition: Sasaista manifestāciju ar atsauci manifestācijai, kas izteikta radītāja, izdevēja, glabātāja, indeksēšanas dienesta, u.tml. izvēlētā prioritārā formā. @lv
toolkit label: prioritārā atsauce @lv
toolkit definition: Atsauce manifestācijai, kas izteikta radītāja, izdevēja, glabātāja, indeksēšanas dienesta, u.tml. izvēlētā prioritārā formā. @lv
label: 有首选引文 @zh-hans
definition: 将一种载体表现与创作者、出版者、保管者、索引或摘要机构等首选的一个载体形态的引文形式关联起来。 @zh-hans
toolkit label: 首选引文 @zh-hans
toolkit definition: 创作者、出版者、保管者、索引或摘要机构等首选的一个载体形态的引文形式 @zh-hans
label: tercih edilen atıf ile ilişkilidir @tr
definition: Bir gösterimi, bir yaratıcı, yayıncı, koruyucu, indeksleme veya soyutlama hizmeti veya başka bir aracı tarafından tercih edilen formdaki bir gösterim için bir alıntıyla ilişkilendirir. @tr
toolkit label: tercih edilen alıntı @tr
toolkit definition: Bir yaratıcı, yayıncı, koruyucu, indeksleme veya özetleme hizmeti ya da diğer bir temsilcinin tercih ettiği biçimdeki bir gösterim için yapılan alıntı. @tr
label: tiene cita preferida @es
definition: Relaciona una manifestación con una cita para una manifestación en la forma preferida por un creador, editorial, custodio, servicio de indexación o abstracción, u otro agente. @es

has emulsion on microfilm and microfiche
status: Published
definition: Relates a manifestation to a suspension of light-sensitive chemicals that is used as a coating on a microfilm or microfiche.
type: Property
domain: C10007
sub property of: has applied material
lexical alias: emulsionOnMicrofilmAndMicrofiche.en
instruction number: 3.7.2
toolkit label: emulsion on microfilm and microfiche
toolkit definition: A suspension of light-sensitive chemicals that is used as a coating on a microfilm or microfiche.
label: a pour émulsion sur microfilm et microfiche @fr
definition: Met une manifestation en relation avec une suspension de produits chimiques photosensibles qui est utilisée comme revêtement sur un microfilm ou une microfiche. @fr
toolkit label: émulsion sur microfilm et microfiche @fr
toolkit definition: Suspension de produits chimiques photosensibles qui est utilisée comme revêtement sur un microfilm ou une microfiche. @fr
toolkit label: emulsión en microfilm y microficha @es
toolkit definition: Una suspensión de sustancias químicas sensibles a la luz que se utiliza como recubrimiento en un microfilm o microficha. @es
label: har emulsion på mikrofilm och mikrofiche @sv
toolkit label: emulsion på mikrofilm och mikrofiche @sv
toolkit label: emulsie op microfilm en microfiche @nl
toolkit definition: Een suspensie van lichtgevoelige chemicaliën die gebruikt is als coating op microfilm of microfiche. @nl
label: có thể sữa trên vi phim và vi phiếu @vi
definition: Liên kết biểu thị với thể vẩn của hoá chất nhậy sáng được sử dụng như là lớp phủ trên vi phim hoặc vi phiếu. @vi
toolkit label: thể sữa trên vi phim và vi phiếu @vi
toolkit definition: Thể vẩn của hoá chất nhậy sáng được sử dụng như là lớp phủ trên vi phim hoặc vi phiếu. @vi
label: har emulsion på mikrofilm og mikrofiche @da
definition: Relaterer en manifestation til en opslæmning af lysfølsomme kemikalier, som anvendes som belægning på en mikrofilm eller mikrofiche. @da
toolkit label: emulsion på mikrofilm og mikrofiche @da
toolkit definition: Opslæmning af lysfølsomme kemikalier, som anvendes som belægning på en mikrofilm eller mikrofiche. @da
label: hat Emulsionsschicht auf Mikrofilm und Mikrofiche @de
definition: Setzt eine Manifestation in Beziehung zu einer Suspension aus lichtempfindlichen Chemikalien, die als Beschichtung eines Mikrofilms oder eines Mikrofiches verwendet wird. @de
toolkit label: Emulsionsschicht auf Mikrofilm und Mikrofiche @de
toolkit definition: Eine Suspension aus lichtempfindlichen Chemikalien, die als Beschichtung eines Mikrofilms oder eines Mikrofiches verwendet wird. @de
label: té com a emulsió sobre microfilm i microfitxa @ca
definition: Relaciona una manifestació amb una suspensió de substàncies químiques sensibles a la llum que s’usa com a revestiment d’un microfilm o una microfitxa. @ca
toolkit label: emulsió sobre microfilm i microfitxa @ca
toolkit definition: Suspensió de substàncies químiques sensibles a la llum que s’usa com a revestiment d’un microfilm o una microfitxa. @ca
definition: Liittää manifestaation mikrofilmin tai mikrokortin valoherkkiä kemikaaleja sisältävään pinnoitteeseen. @fi
toolkit label: mikrofilmin ja mikrokortin emulsio @fi
toolkit definition: Mikrofilmin tai mikrokortin valoherkkiä kemikaaleja sisältävä pinnoite. @fi
toolkit label: emulsjon på mikrofilm og mikrofilmkort @no
toolkit definition: En suspensjon av lysfølsomme kjemikalier som er brukt som belegg på mikrofilm eller mikrofilmkort. @no
label: έχει γαλάκτωμα στη μικροταινία και το μικροδελτίο @el
definition: Συνδέει μια εκδήλωση με ένα αιώρημα χαμηλής ευαισθησίας χημικών που χρησιμοποιείται ως επίστρωση πάνω σε μικροταινία ή σε μικροδελτίο. @el
toolkit label: γαλάκτωμα στη μικροταινία και το μικροδελτίο @el
toolkit definition: Ένα αιώρημα χαμηλής ευαισθησίας χημικών που χρησιμοποιείται ως επίστρωση πάνω σε μικροταινία ή σε μικροδελτίο. @el
has element type: 4
label: emulziója mikrofilmen és mikrofilmlapon a következő: @hu
definition: Hozzákapcsol egy megjelenési formát fényérzékeny vegyszerek szuszpenziójához, amelyet bevonatként használnak mikrofilmen vagy mikrofilmlapon. @hu
toolkit label: emulziója mikrofilmen és mikrofilmlapon: @hu
toolkit definition: Fényérzékeny vegyszerek szuszpenziója, amelyet bevonatként használnak mikrofilmen vagy mikrofilmlapon. @hu
label: mikrofilmin ja mikrokortin emulsio @fi
label: har emulsjon på mikrofilm og mikrofilmkort @no
definition: Relaterer en manifestasjon til en suspensjon av lysfølsomme kjemikalier som er brukt som belegg på mikrofilm eller mikrofilmkort. @no
label: heeft emulsie op microfilm en microfiche @nl
definition: Relateert een manifestatie aan een suspensie van lichtgevoelige chemicaliën die gebruikt is als coating op microfilm of microfiche. @nl
label: له طبقة حساسة على ميكروفيلم وميكروفيش @ar
definition: يربط بين تجسيدة ونظام تسجيل خاص بالمواد الكيميائية المستخدمة كغطاء على ميكروفيلم أو ميكروفيش. @ar
toolkit label: طبقة حساسة على ميكروفيلم وميكروفيش @ar
toolkit definition: نظام تسجيل خاص بالمواد الكيميائية المستخدمة كغطاء على ميكروفيلم أو ميكروفيش. @ar
label: mikrofilmi ja mikrokaardi emulsioon @et
definition: Seostab kehastuse valgustundliku kemikaali kihiga, mida on kasutatud mikrofilmi või mikrokaardi pinna katmiseks. @et
toolkit label: mikrofilmi ja mikrokaardi emulsioon @et
toolkit definition: Valgustundliku kemikaali kiht, mida on kasutatud mikrofilmi või mikrokaardi pinna katmiseks. @et
label: ha come emulsione su microfilm e microfiche @it
definition: Correla una manifestazione a una sospensione di sostanza chimica fotosensibile utilizzata come uno strato su un microfilm o una microfiche. @it
toolkit label: emulsione su microfilm e microfiche @it
toolkit definition: Sospensione di sostanza chimica fotosensibile utilizzata come uno strato su un microfilm o una microfiche. @it
label: mikrofilmas un mikrofišas emulsijas pārklājums @lv
definition: Sasaista manifestāciju ar gaismas jutīgu ķimikāliju slāni, ar kuru pārklāj mikrofilmas vai mikrofišas. @lv
toolkit label: mikrofilmas un mikrofišas emulsijas pārklājums @lv
toolkit definition: Gaismas jutīgu ķimikāliju slānis, ar kuru pārklāj mikrofilmas vai mikrofišas. @lv
label: 有缩微胶卷和缩微平片上的乳剂 @zh-hans
definition: 将一种载体表现与缩微胶卷或缩微平片表面感光化合物的悬浮涂层关联起来。 @zh-hans
toolkit label: 缩微胶卷和缩微平片上的乳剂 @zh-hans
toolkit definition: 缩微胶卷或缩微平片表面感光化合物的悬浮涂层 @zh-hans
label: mikrofilm ve mikrofiş üzerinde emülsiyon ile ilişkilidir @tr
definition: Bir gösterimi, bir mikrofilm veya mikrofiş üzerinde kaplama olarak kullanılan ışığa duyarlı kimyasalların bir süspansiyonuyla ilişkilendirir. @tr
toolkit label: mikrofilm ve mikrofiş üzerine emülsiyon @tr
toolkit definition: Mikrofilm veya mikrofiş üzerinde kaplama olarak kullanılan, ışığa duyarlı kimyasalların süspansiyonu. @tr
label: tiene emulsión en microfilm y microficha @es

has engraver agent
status: Published
definition: Relates a manifestation to an agent who is responsible for creating a manifestation by cutting letters, figures, or other marks on a surface such as a wooden or metal plate used for printing.
type: Property
domain: C10007
lexical alias: engraverAgent.en
toolkit label: engraver agent
toolkit definition: An agent who is responsible for creating a manifestation by cutting letters, figures, or other marks on a surface such as a wooden or metal plate used for printing.
label: a pour agent graveur @fr
definition: Met une manifestation en relation avec un agent qui est responsable de la création d’une manifestation en gravant des lettres, des figures ou d’autres marques sur une surface telle qu’une plaque de bois ou de métal utilisée pour l’impression. @fr
toolkit label: agent graveur @fr
toolkit definition: Agent qui est responsable de la création d’une manifestation en gravant des lettres, des figures ou d’autres marques sur une surface telle qu’une plaque de bois ou de métal utilisée pour l’impression. @fr
toolkit label: agente grabador @es
toolkit definition: Un agente que es responsable de crear una manifestación cortando letras, figuras u otras marcas en una superficie como una placa de madera o metal utilizada para imprimir. @es
instruction number: 18.5
toolkit label: graveur-actor @nl
toolkit definition: Een actor die verantwoordelijk is voor het creëren van een manifestatie middels het snijden van letters, figuren of andere markeringen, in een oppervlak zoals een houten of metalen plaat gebruikt bij het drukken. @nl
label: có người khắc @vi
definition: Liên kết biểu thị với tác nhân có liên quan tới chế tạo biểu thị theo trách nhiệm tạo chữ, hình, v.v..., trên bề mặt như là gỗ hoặc kim laoij được dùng khi in. @vi
toolkit label: người khắc @vi
toolkit definition: Tác nhân có liên quan tới chế tạo biểu thị theo trách nhiệm tạo chữ, hình, v.v..., trên bề mặt như là gỗ hoặc kim laoij được dùng khi in. @vi
label: har agent, som er gravør @da
definition: Relaterer en manifestation til en agent, som er involveret i fremstillingen af en manifestation ved at udskære bogstaver, figurer etc. på en overflade såsom en træ- eller metalplade, som anvendes til trykning. @da
toolkit label: agent, som er gravør @da
toolkit definition: Agent, som er involveret i fremstillingen af en manifestation ved at udskære bogstaver, figurer etc. på en overflade såsom en træ- eller metalplade, som anvendes til trykning. @da
label: hat Stecherin/Stecher (Akteur) @de
definition: Setzt eine Manifestation in Beziehung zu einem Akteur, der für die Herstellung einer Manifestation verantwortlich ist, indem er Buchstaben, figürliche Darstellungen oder andere Zeichen in eine Oberfläche, wie zum Beispiel eine Holz- oder Metallplatte schneidet, die zum Drucken benutzt wird. @de
toolkit label: Stecherin/Stecher (Akteur) @de
toolkit definition: Ein Akteur, der für die Herstellung einer Manifestation verantwortlich ist, indem er Buchstaben, figürliche Darstellungen oder andere Zeichen in eine Oberfläche, wie zum Beispiel eine Holz- oder Metallplatte schneidet, die zum Drucken benutzt wird. @de
label: té com a agent gravador @ca
definition: Relaciona una manifestació amb un agent que és responsable de la creació d’una manifestació mitjançant la gravació de lletres, figures o altres marques sobre una superfície com ara una planxa de fusta o de metall usada en la impressió. @ca
toolkit label: agent gravador @ca
toolkit definition: Agent que és responsable de la creació d’una manifestació mitjançant la gravació de lletres, figures o altres marques sobre una superfície com ara una planxa de fusta o de metall usada en la impressió. @ca
definition: Liittää manifestaation toimijaan, joka on vastuussa manifestaation valmistamisesta kaivertamalla kirjaimia, kuvioita tai muita merkkejä painamisessa käytettävälle pinnalle, kuten puu- tai metallipinnalle. @fi
toolkit label: kaivertaja (toimija) @fi
toolkit definition: Toimija, joka on vastuussa manifestaation valmistamisesta kaivertamalla kirjaimia, kuvioita tai muita merkkejä painamisessa käytettävälle pinnalle, kuten puu- tai metallipinnalle. @fi
toolkit label: gravør (agent) @no
toolkit definition: En agent som er involvert i framstillingen av en manifestasjon ved å skjære ut bokstaver, figurer, etc. i en overflate som en tre- eller metallplate som brukes til trykking. @no
label: έχει χαράκτη @el
definition: Συνδέει μια εκδήλωση με έναν φορέα που εμπλέκεται στην κατασκευή μιας εκδήλωσης μέσω της κοπής γραμμάτων, ψηφίων κ.λπ. σε μια επιφάνεια, όπως μια ξύλινη ή μεταλλική πλάκα που χρησιμοποιείται για την εκτύπωση. @el
toolkit label: χαράκτης @el
toolkit definition: Ένας φορέας που εμπλέκεται στην κατασκευή μιας εκδήλωσης μέσω της κοπής γραμμάτων, ψηφίων κ.λπ. σε μια επιφάνεια, όπως μια ξύλινη ή μεταλλική πλάκα που χρησιμοποιείται για την εκτύπωση. @el
has element type: 2
label: vésnök ágense a következő: @hu
definition: Hozzákapcsol egy megjelenési formát egy ágenshez, amely felelős egy megjelenési forma gyártásáért oly módon, hogy betűket, ábrákat vagy egyéb jeleket vés nyomtatáshoz használatos fa- vagy fémlemezhez hasonló felületre. @hu
toolkit label: vésnök ágens: @hu
toolkit definition: Egy ágens, amely felelős egy megjelenési forma gyártásáért oly módon, hogy betűket, ábrákat vagy egyéb jeleket vés nyomtatáshoz használatos fa- vagy fémlemezhez hasonló felületre. @hu
alternative label: engraver
alternative label: kaivertaja @fi
label: kaivertaja (toimija) @fi
label: har gravør (agent) @no
definition: Relaterer en manifestasjon til en agent som er involvert i framstillingen av en manifestasjon ved å skjære ut bokstaver, figurer, etc. i en overflate som en tre- eller metallplate som brukes til trykking. @no
alternative label: gravør @no
alternative label: graveur @fr
label: heeft graveur-actor @nl
definition: Relateert een manifestatie aan een actor die verantwoordelijk is voor het creëren van een manifestatie middels het snijden van letters, figuren of andere markeringen, in een oppervlak zoals een houten of metalen plaat gebruikt bij het drukken. @nl
label: له وكيل نقاش @ar
definition: يربط بين تجسيدة ووكيل مسئول عن تصنيع تجسيدة برص الحروف، والأشكال، إلخ، على سطح مثل لوح خشبي أو معدني يستخدم للطباعة. @ar
alternative label: نقاش @ar
toolkit label: وكيل نقاش @ar
toolkit definition: وكيل مسئول عن تصنيع تجسيدة برص الحروف، والأشكال، إلخ، على سطح مثل لوح خشبي أو معدني يستخدم للطباعة. @ar
alternative label: gravador @ca
label: graveerija (tegija) @et
definition: Seostab kehastuse tegijaga, kes osaleb kehastuse valmistamises, lõigates tähti, kujundeid jms trükkimiseks kasutatava puidust, metallist või muust materjalist plaadi pinnale. @et
alternative label: graveerija @et
toolkit label: graveerija (tegija) @et
toolkit definition: Tegija, kes osaleb kehastuse valmistamises, lõigates tähti, kujundeid jms trükkimiseks kasutatava puidust, metallist või muust materjalist plaadi pinnale. @et
alternative label: vésnök: @hu
label: ha come incisore agente @it
definition: Correla una manifestazione all'agente coinvolto nella manifattura di una manifestazione tramite l'intaglio di lettere, figure, etc. su una superficie, come una lastra di legno o metallo utilizzata per la stampa. @it
alternative label: incisore @it
toolkit label: incisore agente @it
toolkit definition: Agente coinvolto nella manifattura di una manifestazione tramite l'intaglio di lettere, figure, etc. su una superficie, come una lastra di legno o metallo utilizzata per la stampa. @it
label: gravieris (aģents) @lv
definition: Sasaista manifestāciju ar aģentu, kas iesaistīts manifestācijas ražošanā, uz drukāšanai izmantojama materiāla (piemēram, uz koka vai metāla plāksnes) virsmas iegriežot burtus, zīmes u.tml. @lv
toolkit label: gravieris (aģents) @lv
toolkit definition: Aģents, kas iesaistīts manifestācijas ražošanā, uz drukāšanai izmantojama materiāla (piemēram, uz koka vai metāla plāksnes) virsmas iegriežot burtus, zīmes u.tml. @lv
sub property of: has printmaker agent
alternative label: Stecher @de
alternative label: 雕版者 @zh-hans
toolkit label: 雕版者行为者 @zh-hans

has engraver collective agent
status: Published
lexical alias: engraverCollectiveAgent.en
definition: Relates a manifestation to a collective agent who is responsible for creating a manifestation by cutting letters, figures, or other marks on a surface such as a wooden or metal plate used for printing.
toolkit label: engraver collective agent
toolkit definition: A collective agent who is responsible for creating a manifestation by cutting letters, figures, or other marks on a surface such as a wooden or metal plate used for printing.
type: Property
domain: C10007
has element type: 2
sub property of: has engraver agent
label: kaivertaja (yhteistoimija) @fi
definition: Liittää manifestaation yhteistoimijaan, joka on vastuussa manifestaation valmistamisesta kaivertamalla kirjaimia, kuvioita tai muita merkkejä painamisessa käytettävälle pinnalle, kuten puu- tai metallipinnalle. @fi
toolkit label: kaivertaja (yhteistoimija) @fi
toolkit definition: Yhteistoimija, joka on vastuussa manifestaation valmistamisesta kaivertamalla kirjaimia, kuvioita tai muita merkkejä painamisessa käytettävälle pinnalle, kuten puu- tai metallipinnalle. @fi
label: har gravør (kollektiv agent) @no
definition: Relaterer en manifestasjon til en kollektiv agent som er involvert i framstillingen av en manifestasjon ved å skjære ut bokstaver, figurer, etc. i en overflate som en tre- eller metallplate som brukes til trykking. @no
toolkit label: gravør (kollektiv agent) @no
toolkit definition: En kollektiv agent som er involvert i framstillingen av en manifestasjon ved å skjære ut bokstaver, figurer, etc. i en overflate som en tre- eller metallplate som brukes til trykking. @no
label: a pour agent collectif graveur @fr
definition: Met une manifestation en relation avec un agent collectif qui est responsable de la création d’une manifestation en gravant des lettres, des figures ou d’autres marques sur une surface telle qu’une plaque de bois ou de métal utilisée pour l’impression. @fr
toolkit label: agent collectif graveur @fr
toolkit definition: Agent collectif qui est responsable de la création d’une manifestation en gravant des lettres, des figures ou d’autres marques sur une surface telle qu’une plaque de bois ou de métal utilisée pour l’impression. @fr
label: heeft graveur-collectieve actor @nl
definition: Relateert een manifestatie aan een collectieve actor die verantwoordelijk is voor het creëren van een manifestatie middels het snijden van letters, figuren of andere markeringen, in een oppervlak zoals een houten of metalen plaat gebruikt bij het drukken. @nl
toolkit label: graveur-collectieve actor @nl
toolkit definition: Een collectieve actor die verantwoordelijk is voor het creëren van een manifestatie middels het snijden van letters, figuren of andere markeringen, in een oppervlak zoals een houten of metalen plaat gebruikt bij het drukken. @nl
label: له وكيل جماعي نقاش @ar
definition: يربط بين تجسيدة ووكيل جماعي مسئول عن تصنيع تجسيدة برص الحروف، والأشكال، إلخ، على سطح مثل لوح خشبي أو معدني يستخدم للطباعة. @ar
toolkit label: وكيل جماعي نقاش @ar
toolkit definition: وكيل جماعي مسئول عن تصنيع تجسيدة برص الحروف، والأشكال، إلخ، على سطح مثل لوح خشبي أو معدني يستخدم للطباعة. @ar
label: té com a agent col·lectiu gravador @ca
definition: Relaciona una manifestació amb un agent col·lectiu que és responsable de la creació d’una manifestació mitjançant la gravació de lletres, figures o altres marques sobre una superfície com ara una planxa de fusta o de metall usada en la impressió. @ca
toolkit label: agent col·lectiu gravador @ca
toolkit definition: Agent col·lectiu que és responsable de la creació d’una manifestació mitjançant la gravació de lletres, figures o altres marques sobre una superfície com ara una planxa de fusta o de metall usada en la impressió. @ca
label: har kollektiv agent, som er gravør @da
definition: Relaterer en manifestation til en kollektiv agent, som er involveret i fremstillingen af en manifestation ved at udskære bogstaver, figurer etc. på en overflade såsom en træ- eller metalplade, som anvendes til trykning. @da
toolkit label: kollektiv agent, som er gravør @da
toolkit definition: Kollektiv agent, som er involveret i fremstillingen af en manifestation ved at udskære bogstaver, figurer etc. på en overflade såsom en træ- eller metalplade, som anvendes til trykning. @da
label: graveerija (kollektiiv) @et
definition: Seostab kehastuse kollektiiviga, kes osaleb kehastuse valmistamises, lõigates tähti, kujundeid jms trükkimiseks kasutatava puidust, metallist või muust materjalist plaadi pinnale. @et
toolkit label: graveerija (kollektiiv) @et
toolkit definition: Kollektiiv, kes osaleb kehastuse valmistamises, lõigates tähti, kujundeid jms trükkimiseks kasutatava puidust, metallist või muust materjalist plaadi pinnale. @et
label: hat Stecherin/Stecher (Gemeinschaftlicher Akteur) @de
definition: Setzt eine Manifestation in Beziehung zu einem gemeinschaftlichen Akteur, der für die Herstellung einer Manifestation verantwortlich ist, indem er Buchstaben, figürliche Darstellungen oder andere Zeichen in eine Oberfläche, wie zum Beispiel eine Holz- oder Metallplatte schneidet, die zum Drucken benutzt wird. @de
toolkit label: Stecherin/Stecher (Gemeinschaftlicher Akteur) @de
toolkit definition: Ein gemeinschaftlicher Akteur, der für die Herstellung einer Manifestation verantwortlich ist, indem er Buchstaben, figürliche Darstellungen oder andere Zeichen in eine Oberfläche, wie zum Beispiel eine Holz- oder Metallplatte schneidet, die zum Drucken benutzt wird. @de
label: vésnök kollektív ágense a következő: @hu
definition: Hozzákapcsol egy megjelenési formát egy kollektív ágenshez, amely felelős egy megjelenési forma gyártásáért oly módon, hogy betűket, ábrákat vagy egyéb jeleket vés nyomtatáshoz használatos fa- vagy fémlemezhez hasonló felületre. @hu
toolkit label: vésnök kollektív ágens: @hu
toolkit definition: Egy kollektív ágens, amely felelős egy megjelenési forma gyártásáért oly módon, hogy betűket, ábrákat vagy egyéb jeleket vés nyomtatáshoz használatos fa- vagy fémlemezhez hasonló felületre. @hu
label: ha come incisore agente collettivo @it
definition: Correla una manifestazione all'agente collettivo coinvolto nella manifattura di una manifestazione tramite l’intaglio di lettere, figure, etc. su di una superficie come una lastra di legno o metallo utilizzata per la stampa. @it
toolkit label: incisore agente collettivo @it
toolkit definition: Agente collettivo coinvolto nella manifattura di una manifestazione tramite l'intaglio di lettere, figure, etc. su di una superficie come una lastra di legno o metallo utilizzata per la stampa. @it
label: gravieris (grupa) @lv
definition: Sasaista manifestāciju ar grupu, kas iesaistīta manifestācijas ražošanā, uz drukāšanai izmantojama materiāla (piemēram, uz koka vai metāla plāksnes) virsmas iegriežot burtus, zīmes u.tml. @lv
toolkit label: gravieris (grupa) @lv
toolkit definition: Grupa, kas iesaistīta manifestācijas ražošanā, uz drukāšanai izmantojama materiāla (piemēram, uz koka vai metāla plāksnes) virsmas iegriežot burtus, zīmes u.tml. @lv
sub property of: has printmaker collective agent
label: 有雕版者集体行为者 @zh-hans
definition: 将一个载体表现与通过在用于印刷的木版或金属版的表面上雕刻字母、图像或其他记号负责载体表现的创建的一个集体行为者关联起来。 @zh-hans
toolkit label: 雕版者集体行为者 @zh-hans
toolkit definition: 通过在用于印刷的木版或金属版的表面上雕刻字母、图像或其他记号负责载体表现的创建的一个集体行为者 @zh-hans
label: gravür sanatçısı kolektif temsilcisi ile ilişkilidir @tr
definition: Bir gösterimi, baskı için kullanılan ahşap veya metal bir plaka gibi bir yüzey üzerinde harfleri, şekilleri veya diğer işaretleri keserek bir gösterim yaratmaktan sorumlu olan kolektif bir temsilciyle ilişkilendirir. @tr
toolkit label: gravür sanatçısı kolektif temsilcisi @tr
toolkit definition: Baskı için kullanılan ahşap veya metal bir plaka gibi bir yüzey üzerinde harfleri, şekilleri veya diğer işaretleri keserek bir gösterim yaratmaktan sorumlu kolektif bir temsilci. @tr
label: tiene agente colectivo grabador @es
definition: Relaciona una manifestación con un agente colectivo que es responsable de crear una manifestación cortando letras, figuras u otras marcas en una superficie como una placa de madera o metal utilizada para imprimir. @es
toolkit label: agente colectivo grabador @es
toolkit definition: Un agente colectivo que es responsable de crear una manifestación cortando letras, figuras u otras marcas en una superficie como una placa de madera o metal utilizada para imprimir. @es
has subproperty: has engraver corporate body
has subproperty: has engraver family
has subproperty: P30379

has engraver corporate body
status: Published
lexical alias: engraverCorporateBody.en
definition: Relates a manifestation to a corporate body who is responsible for creating a manifestation by cutting letters, figures, or other marks on a surface such as a wooden or metal plate used for printing.
toolkit label: engraver corporate body
toolkit definition: A corporate body who is responsible for creating a manifestation by cutting letters, figures, or other marks on a surface such as a wooden or metal plate used for printing.
type: Property
domain: C10007
has element type: 2
sub property of: has engraver collective agent
label: kaivertaja (yhteisö) @fi
definition: Liittää manifestaation yhteisöön, joka on vastuussa manifestaation valmistamisesta kaivertamalla kirjaimia, kuvioita tai muita merkkejä painamisessa käytettävälle pinnalle, kuten puu- tai metallipinnalle. @fi
toolkit label: kaivertaja (yhteisö) @fi
toolkit definition: Yhteisö, joka on vastuussa manifestaation valmistamisesata kaivertamalla kirjaimia, kuvioita tai muita merkkejä painamisessa käytettävälle pinnalle, kuten puu- tai metallipinnalle. @fi
label: har gravør (korporasjon) @no
definition: Relaterer en manifestasjon til en korporasjon som er involvert i framstillingen av en manifestasjon ved å skjære ut bokstaver, figurer, etc. i en overflate som en tre- eller metallplate som brukes til trykking. @no
toolkit label: gravør (korporasjon) @no
toolkit definition: En korporasjon som er involvert i framstillingen av en manifestasjon ved å skjære ut bokstaver, figurer, etc. i en overflate som en tre- eller metallplate som brukes til trykking. @no
label: a pour collectivité graveuse @fr
definition: Met une manifestation en relation avec une collectivité qui est responsable de la création d’une manifestation en gravant des lettres, des figures ou d’autres marques sur une surface telle qu’une plaque de bois ou de métal utilisée pour l’impression. @fr
toolkit label: collectivité graveuse @fr
toolkit definition: Collectivité qui est responsable de la création d’une manifestation en gravant des lettres, des figures ou d’autres marques sur une surface telle qu’une plaque de bois ou de métal utilisée pour l’impression. @fr
label: heeft graveur-corporatie @nl
definition: Relateert een manifestatie aan een corporatie die verantwoordelijk is voor het creëren van een manifestatie middels het snijden van letters, figuren of andere markeringen, in een oppervlak zoals een houten of metalen plaat gebruikt bij het drukken. @nl
toolkit label: graveur-corporatie @nl
toolkit definition: Een corporatie die verantwoordelijk is voor het creëren van een manifestatie middels het snijden van letters, figuren of andere markeringen, in een oppervlak zoals een houten of metalen plaat gebruikt bij het drukken. @nl
label: له هيئة نقاش @ar
definition: يربط بين تجسيدة وهيئة مسئولة عن تصنيع تجسيدة برص الحروف، والأشكال، إلخ، على سطح مثل لوح خشبي أو معدني يستخدم للطباعة. @ar
toolkit label: هيئة نقاش @ar
toolkit definition: هيئة مسئولة عن تصنيع تجسيدة برص الحروف، والأشكال، إلخ، على سطح مثل لوح خشبي أو معدني يستخدم للطباعة. @ar
label: té com a entitat corporativa gravadora @ca
definition: Relaciona una manifestació amb una entitat corporativa que és responsable de la creació d’una manifestació mitjançant la gravació de lletres, figures o altres marques sobre una superfície com ara una planxa de fusta o de metall usada en la impressió. @ca
toolkit label: entitat corporativa gravadora @ca
toolkit definition: Entitat corporativa que és responsable de la creació d’una manifestació mitjançant la gravació de lletres, figures o altres marques sobre una superfície com ara una planxa de fusta o de metall usada en la impressió. @ca
label: har korporation, som er gravør @da
definition: Relaterer en manifestation til en korporation, som er involveret i fremstillingen af en manifestation ved at udskære bogstaver, figurer etc. på en overflade såsom en træ- eller metalplade, som anvendes til trykning. @da
toolkit label: korporation, som er gravør @da
toolkit definition: Korporation, som er involveret i fremstillingen af en manifestation ved at udskære bogstaver, figurer etc. på en overflade såsom en træ- eller metalplade, som anvendes til trykning. @da
label: graveerija (asutus) @et
definition: Seostab kehastuse asutusega, kes osaleb kehastuse valmistamises, lõigates tähti, kujundeid jms trükkimiseks kasutatava puidust, metallist või muust materjalist plaadi pinnale. @et
toolkit label: graveerija (asutus) @et
toolkit definition: Asutus, kes osaleb kehastuse valmistamises, lõigates tähti, kujundeid jms trükkimiseks kasutatava puidust, metallist või muust materjalist plaadi pinnale. @et
label: hat Stecherin/Stecher (Körperschaft) @de
definition: Setzt eine Manifestation in Beziehung zu einer Körperschaft, die für die Herstellung einer Manifestation verantwortlich ist, indem sie Buchstaben, figürliche Darstellungen oder andere Zeichen in eine Oberfläche, wie zum Beispiel eine Holz- oder Metallplatte schneidet, die zum Drucken benutzt wird. @de
toolkit label: Stecherin/Stecher (Körperschaft) @de
toolkit definition: Eine Körperschaft, die für die Herstellung einer Manifestation verantwortlich ist, indem sie Buchstaben, figürliche Darstellungen oder andere Zeichen in eine Oberfläche, wie zum Beispiel eine Holz- oder Metallplatte schneidet, die zum Drucken benutzt wird. @de
label: vésnök testülete a következő: @hu
definition: Hozzákapcsol egy megjelenési formát egy testülethez, amely felelős egy megjelenési forma gyártásáért oly módon, hogy betűket, ábrákat vagy egyéb jeleket vés nyomtatáshoz használatos fa- vagy fémlemezhez hasonló felületre. @hu
toolkit label: vésnök testület: @hu
toolkit definition: Egy testület, amely felelős egy megjelenési forma gyártásáért oly módon, hogy betűket, ábrákat vagy egyéb jeleket vés nyomtatáshoz használatos fa- vagy fémlemezhez hasonló felületre. @hu
label: ha come incisore ente @it
definition: Correla una manifestazione all'ente coinvolto nella manifattura di una manifestazione, tramite l'intaglio di lettere, figure, etc. su di una superficie, come una lastra di legno o metallo utilizzata per la stampa. @it
toolkit label: incisore ente @it
toolkit definition: Ente coinvolto nella manifattura di una manifestazione, tramite l'intaglio di lettere, figure, etc. su di una superficie come una lastra di legno o metallo utilizzata per la stampa. @it
label: gravieris (institūcija) @lv
definition: Sasaista manifestāciju ar institūciju, kas iesaistīta manifestācijas ražošanā, uz drukāšanai izmantojama materiāla (piemēram, uz koka vai metāla plāksnes) virsmas iegriežot burtus, zīmes u.tml. @lv
toolkit label: gravieris (institūcija) @lv
toolkit definition: Institūcija, kas iesaistīta manifestācijas ražošanā, uz drukāšanai izmantojama materiāla (piemēram, uz koka vai metāla plāksnes) virsmas iegriežot burtus, zīmes u.tml. @lv
sub property of: has printmaker corporate body
label: 有雕版者团体 @zh-hans
definition: 将一种载体表现与通过在用于印刷的木版或金属版的表面上雕刻字母、图像或其他记号负责载体表现的创建的一个团体关联起来。 @zh-hans
toolkit label: 雕版者团体 @zh-hans
toolkit definition: 通过在用于印刷的木版或金属版的表面上雕刻字母、图像或其他记号负责载体表现的创建的一个团体 @zh-hans
label: gravür sanatçısı tüzel kişisi ile ilişkilidir @tr
definition: Bir gösterimi, basım için kullanılan ahşap veya metal bir levha gibi bir yüzey üzerinde harfleri, şekilleri veya diğer işaretleri keserek bir gösterimi yaratmaktan sorumlu olan bir tüzel kişiyle ilişkilendirir. @tr
toolkit label: gravür sanatçısı tüzel kişisi @tr
toolkit definition: Baskı için kullanılan ahşap veya metal bir plaka gibi bir yüzey üzerinde harf, şekil veya diğer işaretleri keserek bir gösterimi yaratmaktan sorumlu bir tüzel kişi. @tr
label: tiene cuerpo corporativo grabador @es
definition: Relaciona una manifestación con un cuerpo corporativo que es responsable de crear una manifestación cortando letras, figuras u otras marcas en una superficie como una placa de madera o metal utilizada para imprimir. @es
toolkit label: cuerpo corporativo grabador @es
toolkit definition: Un cuerpo corporativoque es responsable de crear una manifestación cortando letras, figuras u otras marcas en una superficie como una placa de madera o metal utilizada para imprimir. @es
has subproperty: P30408

has engraver family
status: Published
lexical alias: engraverFamily.en
definition: Relates a manifestation to a family who is responsible for creating a manifestation by cutting letters, figures, or other marks on a surface such as a wooden or metal plate used for printing.
toolkit label: engraver family
toolkit definition: A family who is responsible for creating a manifestation by cutting letters, figures, or other marks on a surface such as a wooden or metal plate used for printing.
type: Property
domain: C10007
has element type: 2
sub property of: has engraver collective agent
label: kaivertaja (suku) @fi
definition: Liittää manifestaation sukuun, joka on vastuussa manifestaation valmistamisesta kaivertamalla kirjaimia, kuvioita tai muita merkkejä painamisessa käytettävälle pinnalle, kuten puu- tai metallipinnalle. @fi
toolkit label: kaivertaja (suku) @fi
toolkit definition: Suku, joka on vastuussa manifestaation valmistamisesta kaivertamalla kirjaimia, kuvioita tai muita merkkejä painamisessa käytettävälle pinnalle, kuten puu- tai metallipinnalle. @fi
label: har gravør (familie) @no
definition: Relaterer en manifestasjon til en familie som er involvert i framstillingen av en manifestasjon ved å skjære ut bokstaver, figurer, etc. i en overflate som en tre- eller metallplate som brukes til trykking. @no
toolkit label: gravør (familie) @no
toolkit definition: En familie som er involvert i framstillingen av en manifestasjon ved å skjære ut bokstaver, figurer, etc. i en overflate som en tre- eller metallplate som brukes til trykking. @no
label: a pour famille graveuse @fr
definition: Met une manifestation en relation avec une famille qui est responsable de la création d’une manifestation en gravant des lettres, des figures ou d’autres marques sur une surface telle qu’une plaque de bois ou de métal utilisée pour l’impression. @fr
toolkit label: famille graveuse @fr
toolkit definition: Famille qui est responsable de la création d’une manifestation en gravant des lettres, des figures ou d’autres marques sur une surface telle qu’une plaque de bois ou de métal utilisée pour l’impression. @fr
label: heeft graveur-familie @nl
definition: Relateert een manifestatie aan een familie die verantwoordelijk is voor het creëren van een manifestatie middels het snijden van letters, figuren of andere markeringen, in een oppervlak zoals een houten of metalen plaat gebruikt bij het drukken. @nl
toolkit label: graveur-familie @nl
toolkit definition: Een familie die verantwoordelijk is voor het creëren van een manifestatie middels het snijden van letters, figuren of andere markeringen, in een oppervlak zoals een houten of metalen plaat gebruikt bij het drukken. @nl
label: له عائلة نقاش @ar
definition: يربط بين تجسيدة وعائلة مسئولة عن تصنيع تجسيدة بالتصميم الجرافيكي الكامل لكتاب، بما في ذلك توضيب حروف الطباعة، والإيضاحيات، واختيار المواد، والعمليات المستخدمة. @ar
toolkit label: عائلة نقاش @ar
toolkit definition: عائلة مسئولة عن تصنيع تجسيدة برص الحروف، والأشكال، إلخ، على سطح مثل لوح خشبي أو معدني يستخدم للطباعة. @ar
label: té com a família gravadora @ca
definition: Relaciona una manifestació amb una família que és responsable de la creació d’una manifestació mitjançant la gravació de lletres, figures o altres marques sobre una superfície com ara una planxa de fusta o de metall usada en la impressió. @ca
toolkit label: família gravadora @ca
toolkit definition: Família que és responsable de la creació d’una manifestació mitjançant la gravació de lletres, figures o altres marques sobre una superfície com ara una planxa de fusta o de metall usada en la impressió. @ca
label: har familie, som er gravør @da
definition: Relaterer en manifestation til en familie, som er involveret i fremstillingen af en manifestation ved at udskære bogstaver, figurer etc. på en overflade såsom en træ- eller metalplade, som anvendes til trykning. @da
toolkit label: familie, som er gravør @da
toolkit definition: Familie, som er involveret i fremstillingen af en manifestation ved at udskære bogstaver, figurer etc. på en overflade såsom en træ- eller metalplade, som anvendes til trykning. @da
label: graveerija (perekond) @et
definition: Seostab kehastuse perekonnaga, kes osaleb kehastuse valmistamises, lõigates tähti, kujundeid jms trükkimiseks kasutatava puidust, metallist või muust materjalist plaadi pinnale. @et
toolkit label: graveerija (perekond) @et
toolkit definition: Perekond, kes osaleb kehastuse valmistamises, lõigates tähti, kujundeid jms trükkimiseks kasutatava puidust, metallist või muust materjalist plaadi pinnale. @et
label: hat Stecherin/Stecher (Familie) @de
definition: Setzt eine Manifestation in Beziehung zu einer Familie, die für die Herstellung einer Manifestation verantwortlich ist, indem sie Buchstaben, figürliche Darstellungen oder andere Zeichen in eine Oberfläche, wie zum Beispiel eine Holz- oder Metallplatte schneidet, die zum Drucken benutzt wird. @de
toolkit label: Stecherin/Stecher (Familie) @de
toolkit definition: Eine Familie, die für die Herstellung einer Manifestation verantwortlich ist, indem sie Buchstaben, figürliche Darstellungen oder andere Zeichen in eine Oberfläche, wie zum Beispiel eine Holz- oder Metallplatte schneidet, die zum Drucken benutzt wird. @de
label: vésnök családja a következő: @hu
definition: Hozzákapcsol egy megjelenési formát egy családhoz, amely felelős egy megjelenési forma gyártásáért oly módon, hogy betűket, ábrákat vagy egyéb jeleket vés nyomtatáshoz használatos fa- vagy fémlemezhez hasonló felületre. @hu
toolkit label: vésnök család: @hu
toolkit definition: Egy család, amely felelős egy megjelenési forma gyártásáért oly módon, hogy betűket, ábrákat vagy egyéb jeleket vés nyomtatáshoz használatos fa- vagy fémlemezhez hasonló felületre. @hu
label: ha come incisore famiglia @it
definition: Correla una manifestazione alla famiglia coinvolta nella manifattura di una manifestazione, tramite l'intaglio di lettere, figure, etc. su di una superficie come una lastra di legno o metallo utilizzata per la stampa. @it
toolkit label: incisore famiglia @it
toolkit definition: Famiglia coinvolta nella manifattura di una manifestazione, tramite l’intaglio di lettere, figure, etc. su di una superficie come una lastra di legno o metallo utilizzata per la stampa. @it
label: gravieris (dzimta/ģimene) @lv
definition: Sasaista manifestāciju ar dzimtu/ģimeni, kas iesaistīta manifestācijas ražošanā, uz drukāšanai izmantojama materiāla (piemēram, uz koka vai metāla plāksnes) virsmas iegriežot burtus, zīmes u.tml. @lv
toolkit label: gravieris (dzimta/ģimene) @lv
toolkit definition: Dzimta/ģimene, kas iesaistīta manifestācijas ražošanā, uz drukāšanai izmantojama materiāla (piemēram, uz koka vai metāla plāksnes) virsmas iegriežot burtus, zīmes u.tml. @lv
sub property of: has printmaker family
label: 有雕版者家族 @zh-hans
definition: 将一种载体表现与通过在用于印刷的木版或金属版的表面上雕刻字母、图像或其他记号负责载体表现的创建的一个家族关联起来。 @zh-hans
toolkit label: 雕版者家族 @zh-hans
toolkit definition: 通过在用于印刷的木版或金属版的表面上雕刻字母、图像或其他记号负责载体表现的创建的一个家族 @zh-hans
label: gravür sanatçısı ailesi ile ilişkilidir @tr
definition: Bir gösterimi; harfler, figürler veya basım için kullanılan tahta veya metal plaka gibi yüzeylerin üzerinde diğer izleri keserek bir gösterim oluşturmaktan sorumlu aileyle ilişkilendirir. @tr
toolkit label: gravür sanatçısı aile @tr
toolkit definition: Harfler, figürler veya basım için kullanılan tahta veya metal plaka gibi yüzeylerin üzerinde diğer izleri keserek bir gösterim oluşturmaktan sorumlu aile. @tr
label: tiene familia grabadora @es
definition: Relaciona una manifestación con una familia que es responsable de crear una manifestación al cortar letras, figuras, etc., sobre una superficie tal como una placa de madera o metal utilizada para imprimir. @es
toolkit label: familia grabadora @es
toolkit definition: Una familia que es responsable de crear una manifestación al cortar letras, figuras, etc., sobre una superficie tal como una placa de madera o metal utilizada para imprimir. @es
has subproperty: P30437

has engraver person
status: Published
lexical alias: engraverPerson.en
definition: Relates a manifestation to a person who is responsible for creating a manifestation by cutting letters, figures, or other marks on a surface such as a wooden or metal plate used for printing.
toolkit label: engraver person
toolkit definition: A person who is responsible for creating a manifestation by cutting letters, figures, or other marks on a surface such as a wooden or metal plate used for printing.
type: Property
domain: C10007
has element type: 2
sub property of: has engraver agent
label: kaivertaja (henkilö) @fi
definition: Liittää manifestaation henkilöön, joka on vastuussa manifestaation valmistamisesta kaivertamalla kirjaimia, kuvioita tai muita merkkejä painamisessa käytettävälle pinnalle, kuten puu- tai metallipinnalle. @fi
toolkit label: kaivertaja (henkilö) @fi
toolkit definition: Henkilö, joka on vastuussa manifestaation valmistamisesta kaivertamalla kirjaimia, kuvioita tai muita merkkejä painamisessa käytettävälle pinnalle, kuten puu- tai metallipinnalle. @fi
label: har gravør (person) @no
definition: Relaterer en manifestasjon til en person som er involvert i framstillingen av en manifestasjon ved å skjære ut bokstaver, figurer, etc. i en overflate som en tre- eller metallplate som brukes til trykking. @no
toolkit label: gravør (person) @no
toolkit definition: En person som er involvert i framstillingen av en manifestasjon ved å skjære ut bokstaver, figurer, etc. i en overflate som en tre- eller metallplate som brukes til trykking. @no
label: a pour personne graveuse @fr
definition: Met une manifestation en relation avec une personne qui est responsable de la création d’une manifestation en gravant des lettres, des figures ou d’autres marques sur une surface telle qu’une plaque de bois ou de métal utilisée pour l’impression. @fr
toolkit label: personne graveuse @fr
toolkit definition: Personne qui est responsable de la création d’une manifestation en gravant des lettres, des figures ou d’autres marques sur une surface telle qu’une plaque de bois ou de métal utilisée pour l’impression. @fr
label: heeft graveur-persoon @nl
definition: Relateert een manifestatie aan een persoon die verantwoordelijk is voor het creëren van een manifestatie middels het snijden van letters, figuren of andere markeringen, in een oppervlak zoals een houten of metalen plaat gebruikt bij het drukken. @nl
toolkit label: graveur-persoon @nl
toolkit definition: Een persoon die verantwoordelijk is voor het creëren van een manifestatie middels het snijden van letters, figuren of andere markeringen, in een oppervlak zoals een houten of metalen plaat gebruikt bij het drukken. @nl
label: له شخص نقاش @ar
definition: يربط بين تجسيدة وشخص مسئول عن تصنيع تجسيدة برص الحروف، والأشكال، إلخ، على سطح مثل لوح خشبي أو معدني يستخدم للطباعة. @ar
toolkit label: شخص نقاش @ar
toolkit definition: شخص مسئول عن تصنيع تجسيدة برص الحروف، والأشكال، إلخ، على سطح مثل لوح خشبي أو معدني يستخدم للطباعة. @ar
label: té com a persona gravadora @ca
definition: Relaciona una manifestació amb una persona que és responsable de la creació d’una manifestació mitjançant la gravació de lletres, figures o altres marques sobre una superfície com ara una planxa de fusta o de metall usada en la impressió. @ca
toolkit label: persona gravadora @ca
toolkit definition: Persona que és responsable de la creaació d’una manifestació mitjançant la gravació de lletres, figures o altres marques sobre una superfície com ara una planxa de fusta o de metall usada en la impressió. @ca
label: har person, som er gravør @da
definition: Relaterer en manifestation til en person, som er involveret i fremstillingen af en manifestation ved at udskære bogstaver, figurer etc. på en overflade såsom en træ- eller metalplade, som anvendes til trykning. @da
toolkit label: person, som er gravør @da
toolkit definition: Person, som er involveret i fremstillingen af en manifestation ved at udskære bogstaver, figurer etc. på en overflade såsom en træ- eller metalplade, som anvendes til trykning. @da
label: graveerija (isik) @et
definition: Seostab kehastuse isikuga, kes osaleb kehastuse valmistamises, lõigates tähti, kujundeid jms trükkimiseks kasutatava puidust, metallist või muust materjalist plaadi pinnale. @et
toolkit label: graveerija (isik) @et
toolkit definition: Isik, kes osaleb kehastuse valmistamises, lõigates tähti, kujundeid jms trükkimiseks kasutatava puidust, metallist või muust materjalist plaadi pinnale. @et
label: hat Stecherin/Stecher (Person) @de
definition: Setzt eine Manifestation in Beziehung zu einer Person, die für die Herstellung einer Manifestation verantwortlich ist, indem sie Buchstaben, figürliche Darstellungen oder andere Zeichen in eine Oberfläche, wie zum Beispiel eine Holz- oder Metallplatte schneidet, die zum Drucken benutzt wird. @de
toolkit label: Stecherin/Stecher (Person) @de
toolkit definition: Eine Person, die für die Herstellung einer Manifestation verantwortlich ist, indem sie Buchstaben, figürliche Darstellungen oder andere Zeichen in eine Oberfläche, wie zum Beispiel eine Holz- oder Metallplatte schneidet, die zum Drucken benutzt wird. @de
label: vésnök személye a következő: @hu
definition: Hozzákapcsol egy megjelenési formát egy személyhez, aki felelős egy megjelenési forma gyártásáért oly módon, hogy betűket, ábrákat vagy egyéb jeleket vés nyomtatáshoz használatos fa- vagy fémlemezhez hasonló felületre. @hu
toolkit label: vésnök személy: @hu
toolkit definition: Egy személy, aki felelős egy megjelenési forma gyártásáért oly módon, hogy betűket, ábrákat vagy egyéb jeleket vés nyomtatáshoz használatos fa- vagy fémlemezhez hasonló felületre. @hu
label: ha come incisore persona @it
definition: Correla una manifestazione alla persona coinvolta nella manifattura di una manifestazione, tramite l'intaglio di lettere, figure, etc. su di una superficie come una lastra di legno o metallo utilizzata per la stampa. @it
toolkit label: incisore persona @it
toolkit definition: Persona coinvolta nella manifattura di una manifestazione tramite l'intaglio di lettere, figure, etc. su di una superficie come una lastra di legno o metallo utilizzata per la stampa. @it
label: gravieris (persona) @lv
definition: Sasaista manifestāciju ar personu, kura iesaistīta manifestācijas ražošanā, uz drukāšanai izmantojama materiāla (piemēram, uz koka vai metāla plāksnes) virsmas iegriežot burtus, zīmes u.tml. @lv
toolkit label: gravieris (persona) @lv
toolkit definition: Persona, kura iesaistīta manifestācijas ražošanā, uz drukāšanai izmantojama materiāla (piemēram, uz koka vai metāla plāksnes) virsmas iegriežot burtus, zīmes u.tml. @lv
sub property of: has printmaker person
label: 有雕版者个人 @zh-hans
definition: 将一种载体表现与通过在用于印刷的木版或金属版的表面上雕刻字母、图像或其他记号负责载体表现的创建的个人关联起来。 @zh-hans
toolkit label: 雕版者个人 @zh-hans
toolkit definition: 通过在用于印刷的木版或金属版的表面上雕刻字母、图像或其他记号负责载体表现的创建的个人 @zh-hans
label: gravür sanatçısı kişisi ile ilişkilidir @tr
definition: Bir gösterimi, baskı için kullanılan ahşap veya metal bir plaka gibi bir yüzey üzerinde harfler, şekiller veya diğer işaretleri keserek bir öğe oluşturmaktan sorumlu olan bir kişiyle ilişkilendirir. @tr
toolkit label: gravür sanatçısı @tr
toolkit definition: Baskı için kullanılan ahşap veya metal bir plaka gibi bir yüzey üzerinde harfleri, şekilleri veya diğer işaretleri keserek bir gösterim oluşturmaktan sorumlu kişi. @tr
label: tiene persona grabadora @es
definition: Relaciona una manifestación con una persona que es responsable de crear una manifestación cortando letras, figuras u otras marcas en una superficie como una placa de madera o metal utilizada para imprimir. @es
toolkit label: persona grabadora @es
toolkit definition: Una persona que es responsable de crear una manifestación cortando letras, figuras u otras marcas en una superficie como una placa de madera o metal utilizada para imprimir. @es
has subproperty: P30350

a pour relation de manifestation équivalente
status: Deprecated
type: Property
domain: C10007
lexical alias: equivalentManifestationRelationship.en
definition: Met une manifestation en relation avec une manifestation qui est équivalente à une autre manifestation. @fr
toolkit label: relation de manifestation équivalente @fr
toolkit definition: Manifestation qui est équivalente à une autre manifestation. @fr
toolkit label: relaciones de manifestación equivalente @es
toolkit definition: Una manifestación que es equivalente a la manifestación. @es
sub property of: has related manifestation of manifestation
instruction number: 24.5
toolkit label: gelijkwaardige manifestatie relatie @nl
toolkit definition: Een manifestatie die gelijkwaardig is aan de manifestatie. @nl
label: có mối quan hệ biểu thị tương đương @vi
definition: Liên kết biểu thị với biểu thị tương đương vớii biểu thị khác. @vi
toolkit label: mối quan hệ biểu thị tương đương @vi
toolkit definition: Biểu thị tương đương vớii biểu thị khác. @vi
label: har tilsvarende manifestationsrelation med @da
definition: Relaterer en manifestation til en manifestation der tilsvarer en manifestation. @da
toolkit label: tilsvarende manifestationsrelation @da
toolkit definition: Manifestation der tilsvarer en manifestation. @da
label: hat Äquivalenzbeziehung auf Manifestationsebene @de
definition: Setzt eine Manifestation mit einer Manifestation, die mit einem anderen Manifestation äquivalent ist, in Beziehung. @de
toolkit label: Äquivalenzbeziehung auf Manifestationsebene @de
toolkit definition: Eine Manifestation, die mit einem anderen Manifestation äquivalent ist. @de
label: té com a relació de manifestació equivalent @ca
definition: Relaciona una manifestació amb una manifestació que és equivalent a una altra manifestació. @ca
toolkit label: relació de manifestació equivalent @ca
toolkit definition: Manifestació que és equivalent a una altra manifestació. @ca
label: manifestaation vastaavuussuhde @fi
definition: Liittää manifestaation manifestaatioon, joka vastaa toista manifestaatiota. @fi
toolkit label: manifestaation vastaavuussuhde @fi
toolkit definition: Manifestaatio, joka vastaa toista manifestaatiota. @fi
toolkit label: ekvivalent manifestasjon: relasjonstype @no
toolkit definition: En manifestasjon som tilsvarer en annen manifestasjon. @no
label: έχει ισοδύναμη σχέση εκδήλωσης με @el
definition: Συνδέει μια εκδήλωση με μια εκδήλωση που είναι ισοδύναμη με μια άλλη εκδήλωση. @el
toolkit label: ισοδύναμη σχέση εκδήλωσης @el
toolkit definition: Μια εκδήλωση που είναι ισοδύναμη με μια άλλη εκδήλωση. @el
has subproperty: P30212

has equipment or system requirement
status: Published
definition: Relates a manifestation to a system or equipment required for access to the content of an electronic analog or digital manifestation.
type: Property
domain: C10007
lexical alias: equipmentOrSystemRequirement.en
toolkit label: equipment or system requirement
toolkit definition: A system or equipment required for access to the content of an electronic analog or digital manifestation.
label: a pour équipement ou système requis @fr
definition: Met une manifestation en relation avec un équipement ou un système nécessaire pour accéder au contenu d’une manifestation électronique analogique ou numérique. @fr
toolkit label: équipement ou système requis @fr
toolkit definition: Équipement ou système nécessaire pour accéder au contenu d’une manifestation électronique analogique ou numérique. @fr
toolkit label: requisitos de equipo o sistema @es
toolkit definition: Un sistema o equipo requerido para acceder al contenido de una manifestación electrónica analógica o digital. @es
label: har utrustning eller systemkrav @sv
toolkit label: utrustning eller systemkrav @sv
toolkit label: apparatuur- of systeemeis @nl
toolkit definition: Een systeem of apparatuur benodigd voor toegang tot de content van een elektronisch-analoge of digitale manifestatie. @nl
label: có yêu cầu thiết bị hoặc hệ thống @vi
definition: Liên kết biểu thị với hệ thống hoặc thiết bị được yêu cầu cho sử dụng, phát lại, v.v..., biểu thị tương tự, số, v.v... @vi
toolkit label: yêu cầu thiết bị hoặc hệ thống @vi
toolkit definition: Hệ thống hoặc thiết bị được yêu cầu cho sử dụng, phát lại, v.v..., biểu thị tương tự, số, v.v... @vi
label: har afspilningsudstyr eller systemkrav @da
definition: Relaterer en manifestation til et system eller udstyr påkrævet, for anvendelse, afspilning, ect. af en elektronisk analog eller digital manifestation. @da
toolkit label: afspilningsudstyr eller systemkrav @da
toolkit definition: System eller udstyr påkrævet, for anvendelse, afspilning, ect. af en elektronisk analog eller digital manifestation. @da
label: hat Geräte- oder Systemanforderung @de
definition: Setzt eine Manifestation in Beziehung zu einem Gerät oder einem System, das für den Zugriff auf den Inhalt einer analog-elektronischen oder digitalen Manifestation erforderlich ist. @de
toolkit label: Geräte- oder Systemanforderung @de
toolkit definition: Ein Gerät oder ein System, das für den Zugriff auf den Inhalt einer analog-elektronischen oder digitalen Manifestation erforderlich ist. @de
label: té com a equipament o sistema requerit @ca
definition: Relaciona una manifestació amb un sistema o equipament necessari per accedir al contingut d’una manifestació electrònica analògica o digital. @ca
toolkit label: equipament o sistema requerit @ca
toolkit definition: Sistema o equipament necessari per accedir al contingut d’una manifestació electrònica analògica o digital. @ca
definition: Liittää manifestaation laitteisiin tai järjestelmiin, joita tarvitaan analogiseen tai digitaaliseen manifestaatioon pääsemiseksi. @fi
toolkit label: laitteisto- tai järjestelmävaatimukset @fi
toolkit definition: Laitteet tai järjestelmät, joita tarvitaan analogiseen tai digitaaliseen manifestaatioon pääsemiseksi. @fi
toolkit label: utstyrs- eller systemkrav @no
toolkit definition: Et system eller utstyr for bruk, avspilling etc. av en elektronisk analog eller digital manifestasjon. @no
label: έχει εξοπλισμό ή απαιτήσεις του συστήματος @el
definition: Συνδέει μια εκδήλωση με ένα σύστημα ή εξοπλισμό που απαιτείται για τη χρήση, την αναπαραγωγή κ.λπ. μιας αναλογικής, ψηφιακής κ.λπ. εκδήλωσης. @el
toolkit label: εξοπλισμός ή απαιτήσεις συστήματος @el
toolkit definition: Ένα σύστημα ή εξοπλισμός που απαιτείται για τη χρήση, την αναπαραγωγή κ.λπ. μιας αναλογικής, ψηφιακής κ.λπ. εκδήλωσης. @el
has element type: 6
label: eszköz- vagy rendszerkövetelménye a következő: @hu
definition: Hozzákapcsol egy megjelenési formát egy rendszerhez vagy eszközhöz, amely egy analóg vagy digitális megjelenési forma tartalmához való hozzáféréshez szükséges. @hu
toolkit label: eszköz- vagy rendszerkövetelménye: @hu
toolkit definition: Egy rendszer vagy eszköz, amely egy analóg vagy digitális megjelenési forma tartalmához való hozzáféréshez szükséges. @hu
instruction number: 3.2
label: laitteisto- tai järjestelmävaatimukset @fi
label: har utstyrs- eller systemkrav @no
definition: Relaterer en manifestasjon til et system eller utstyr for bruk, avspilling etc. av en elektronisk analog eller digital manifestasjon. @no
label: heeft apparatuur- of systeemeis @nl
definition: Relateert een manifestatie aan een systeem of apparatuur benodigd voor toegang tot de content van een elektronisch-analoge of digitale manifestatie. @nl
label: له أجهزة أو متطلبات تشغيل @ar
definition: يربط بين تجسيدة ونظام أو جهاز مطلوب للاستخدام، أو التشغيل، إلخ. الخاص بتجسيدة إلكترونية تناظرية أو رقمية. @ar
toolkit label: أجهزة أو متطلبات تشغيل @ar
toolkit definition: نظام أو جهاز مطلوب للاستخدام، أو التشغيل، إلخ. الخاص بتجسيدة إلكترونية تناظرية أو رقمية. @ar
label: seadme- ja süsteeminõuded @et
definition: Seostab kehastuse süsteemi või seadmega, mida on vaja elektroonilise analoogkehastuse või digitaalkehastuse kasutamiseks, taasesituseks jne. @et
toolkit label: seadme- ja süsteeminõuded @et
toolkit definition: Süsteem või seade, mida on vaja elektroonilise analoogkehastuse või digitaalkehastuse kasutamiseks, taasesituseks jne. @et
label: ha come requisiti di sistema o di attrezzatura @it
definition: Correla una manifestazione a un sistema o attrezzatura necessari per l'uso, la riproduzione, etc. di una manifestazione analogica, digitale, etc. @it
toolkit label: requisiti di sistema o di attrezzatura @it
toolkit definition: Sistema o attrezzatura necessari per l'uso, la riproduzione, etc. di una manifestazione analogica, digitale, etc. @it
label: iekārtas vai sistēmas prasības @lv
definition: Sasaista manifestāciju ar iekārta vai sistēmu, kas nepieciešama analogas, digitālas, u.tml. manifestācijas izmantošanai, atskaņošanai u.tml. @lv
toolkit label: iekārtas vai sistēmas prasības @lv
toolkit definition: Iekārta vai sistēma, kas nepieciešama analogas, digitālas, u.tml. manifestācijas izmantošanai, atskaņošanai u.tml. @lv
label: 有设备或系统要求 @zh-hans
definition: 将一种载体表现与存取一种电子模拟或数字载体表现内容所要求的系统或设备关联起来。 @zh-hans
toolkit label: 设备或系统要求 @zh-hans
toolkit definition: 存取一种电子模拟或数字载体表现内容所要求的系统或设备 @zh-hans
label: ekipman veya sistem gereksinimi ile ilişkilidir @tr
definition: Bir gösterimi, bir elektronik analog veya dijital gösterimin içeriğine erişim için gerekli olan bir sistem veya ekipmanla ilişkilendirir. @tr
toolkit label: ekipman veya sistem gerekliliği @tr
toolkit definition: Bir elektronik analog veya dijital gösterimin içeriğine erişim için gerekli olan bir sistem veya ekipman. @tr
label: tiene requisitos de equipo o sistema @es
definition: Relaciona una manifestación con un sistema o equipo requerido para acceder al contenido de una manifestación electrónica analógica o digital. @es

has etcher agent
status: Published
definition: Relates a manifestation to an agent who is responsible for creating a manifestation by subjecting metal, glass, or some other surface used for printing, to acid or another corrosive substance.
type: Property
domain: C10007
lexical alias: etcherAgent.en
toolkit label: etcher agent
toolkit definition: An agent who is responsible for creating a manifestation by subjecting metal, glass, or some other surface used for printing, to acid or another corrosive substance.
label: a pour agent aquafortiste @fr
definition: Met une manifestation en relation avec un agent qui est responsable de la création d’une manifestation en soumettant à l’acide ou à une autre substance corrosive du métal, du verre ou une autre surface utilisée pour l’impression. @fr
toolkit label: agent aquafortiste @fr
toolkit definition: Agent qui est responsable de la création d’une manifestation en soumettant à l’acide ou à une autre substance corrosive du métal, du verre ou une autre surface utilisée pour l’impression. @fr
toolkit label: agente grabador @es
toolkit definition: Un agente que es responsable de crear una manifestación sometiendo el metal, el vidrio o alguna otra superficie utilizada para imprimir, a un ácido u otra sustancia corrosiva. @es
instruction number: 18.5
toolkit label: etser-actor @nl
toolkit definition: Een actor die verantwoordelijk is voor het creëren van een manifestatie middels het blootstellen van metaal, glas of een ander oppervlak gebruikt voor het drukproces, aan zuur of een ander bijtend middel. @nl
label: có người khắc axit @vi
definition: Liên kết biểu thị với tác nhân có liên quan tới chế tạo biểu thị theo trách nhiệm đưa kim loại, thuỷ tinh, hoặc mặt phẳng khác được dùng cho in, vào axit hoặc chất ăn mòn khác. @vi
toolkit label: người khắc axit @vi
toolkit definition: Tác nhân có liên quan tới chế tạo biểu thị theo trách nhiệm đưa kim loại, thuỷ tinh, hoặc mặt phẳng khác được dùng cho in, vào axit hoặc chất ăn mòn khác. @vi
label: har agent, som er raderer @da
definition: Relaterer en manifestation til en agent, som er involveret i fremstillingen af en manifestation ved at udsætte metal, glas eller en anden overflade, som anvendes til trykning, for syre eller andet ætsende stof. @da
toolkit label: agent, som er raderer @da
toolkit definition: Agent, som er involveret i fremstillingen af en manifestation ved at udsætte metal, glas eller en anden overflade, som anvendes til trykning, for syre eller andet ætsende stof. @da
label: hat Radiererin/Radierer (Akteur) @de
definition: Setzt eine Manifestation in Beziehung zu einem Akteur, der für die Herstellung einer Manifestation verantwortlich ist, indem er Metall, Glas oder eine andere Oberfläche, die zum Drucken benutzt wird, mit Säure oder einer anderen ätzenden Substanz behandelt. @de
toolkit label: Radiererin/Radierer (Akteur) @de
toolkit definition: Ein Akteur, der für die Herstellung einer Manifestation verantwortlich ist, indem er Metall, Glas oder eine andere Oberfläche, die zum Drucken benutzt wird, mit Säure oder einer anderen ätzenden Substanz behandelt. @de
label: té com a agent aiguafortista @ca
definition: Relaciona una manifestació amb un agent que és responsable de la creació d’una manifestació sotmetent a l’àcid, o a qualsevol altra substància corrosiva, el metall, el vidre o qualsevol altra superfície usada en la impressió. @ca
toolkit label: agent aiguafortista @ca
toolkit definition: Agent que és responsable de la creació d’una manifestació sotmetent a l’àcid, o a qualsevol altra substància corrosiva, el metall, el vidre o qualsevol altra superfície usada en la impressió. @ca
definition: Liittää manifestaation toimijaan, joka on vastuussa manifestaation valmistamisesta etsaamalla metallia, lasia tai muuta pintaa hapon tai muun syövyttävän aineen avulla. @fi
toolkit label: etsaaja (toimija) @fi
toolkit definition: Toimija, joka on vastuussa manifestaation valmistamisesta etsaamalla metallia, lasia tai muuta pintaa hapon tai muun syövyttävän aineen avulla. @fi
toolkit label: etser (agent) @no
toolkit definition: En agent som er involvert i framstillingen av en manifestasjon ved å utsette metall, glass eller et annet overflatemateriale som brukes til trykking, for syre eller et annet etsende stoff. @no
label: έχει οξυγράφο @el
definition: Συνδέει μια εκδήλωση με έναν φορέα που εμπλέκεται στην κατασκευή μιας εκδήλωσης υποβάλλοντας μέταλλο, γυαλί ή κάποια άλλη επιφάνεια που χρησιμοποιείται για την εκτύπωση σε οξύ ή άλλη οξειδωτική ουσία. @el
toolkit label: οξυγράφος @el
toolkit definition: Ένας φορέας που εμπλέκεται στην κατασκευή μιας εκδήλωσης υποβάλλοντας μέταλλο, γυαλί ή κάποια άλλη επιφάνεια που χρησιμοποιείται για την εκτύπωση σε οξύ ή άλλη οξειδωτική ουσία. @el
has element type: 2
label: karckészítő ágense a következő: @hu
definition: Hozzákapcsol egy megjelenési formát egy ágenshez, amely felelős egy megjelenési forma gyártásáért oly módon, hogy nyomtatáshoz használt fém-, üveg- vagy valamilyen más felületet savnak vagy más maró anyagnak vet alá. @hu
toolkit label: karckészítő ágens. @hu
toolkit definition: Egy ágens, amely felelős egy megjelenési forma gyártásáért oly módon, hogy nyomtatáshoz használt fém-, üveg- vagy valamilyen más felületet savnak vagy más maró anyagnak vet alá. @hu
alternative label: etcher
alternative label: etsaaja @fi
label: etsaaja (toimija) @fi
label: har etser (agent) @no
definition: Relaterer en manifestasjon til en agent som er involvert i framstillingen av en manifestasjon ved å utsette metall, glass eller et annet overflatemateriale som brukes til trykking, for syre eller et annet etsende stoff. @no
alternative label: etser @no
alternative label: aquafortiste @fr
label: heeft etser-actor @nl
definition: Relateert een manifestatie aan een actor die verantwoordelijk is voor het creëren van een manifestatie middels het blootstellen van metaal, glas of een ander oppervlak gebruikt voor het drukproces, aan zuur of een ander bijtend middel. @nl
label: له وكيل حفار زنكوغراف (كليشيهات) @ar
definition: يربط بين تجسيدة ووكيل مسئول عن تصنيع تجسيدة لإخضاع المعدن، أو الزجاج، أو أي سطح آخر يستخدم في الطباعة، بالحمض أو أي مادة أخرى كاوية. @ar
alternative label: حفار زنكوغراف (كليشيهات) @ar
toolkit label: وكيل حفار زنكوغراف (كليشيهات) @ar
toolkit definition: وكيل مسئول عن تصنيع تجسيدة لإخضاع المعدن، أو الزجاج، أو أي سطح آخر يستخدم في الطباعة، بالحمض أو أي مادة أخرى كاوية. @ar
alternative label: aiguafortista @ca
alternative label: raderer @da
label: söövitaja (tegija) @et
definition: Seostab kehastuse tegijaga, kes osaleb kehastuse valmistamises, töödeldes happe või muu söövitava ainega trükkimiseks kasutatavat metallist, klaasist või muust materjalist pinda. @et
alternative label: söövitaja @et
toolkit label: söövitaja (tegija) @et
toolkit definition: Tegija, kes osaleb kehastuse valmistamises, töödeldes happe või muu söövitava ainega trükkimiseks kasutatavat metallist, klaasist või muust materjalist pinda. @et
alternative label: karckészítő: @hu
label: ha come acquafortista agente @it
definition: Correla una manifestazione all'agente coinvolto nella manifattura di una manifestazione, sottoponendo all'acido o ad altra sostanza corrosiva, del metallo, vetro o altra superficie utilizzata per la stampa. @it
alternative label: acquafortista @it
toolkit label: acquafortista agente @it
toolkit definition: Agente coinvolto nella manifattura di una manifestazione, sottoponendo all'acido o ad altra sostanza corrosiva, del metallo, vetro o altra superficie utilizzata per la stampa. @it
label: ofortists (aģents) @lv
definition: Sasaista manifestāciju ar aģentu, kas iesaistīts manifestācijas ražošanā, pakļaujot metāla, stikla vai kādu citu drukāšanai paredzētu virsmu skābei vai citai kodīgai vielai. @lv
toolkit label: ofortists (aģents) @lv
toolkit definition: Aģents, kas iesaistīts manifestācijas ražošanā, pakļaujot metāla, stikla vai kādu citu drukāšanai paredzētu virsmu skābei vai citai kodīgai vielai. @lv
sub property of: has printmaker agent
alternative label: Radierer @de
toolkit label: 蚀刻者行为者 @zh-hans

has etcher collective agent
status: Published
lexical alias: etcherCollectiveAgent.en
definition: Relates a manifestation to a collective agent who is responsible for creating a manifestation by subjecting metal, glass, or some other surface used for printing, to acid or another corrosive substance.
toolkit label: etcher collective agent
toolkit definition: A collective agent who is responsible for creating a manifestation by subjecting metal, glass, or some other surface used for printing, to acid or another corrosive substance.
type: Property
domain: C10007
has element type: 2
sub property of: has etcher agent
label: etsaaja (yhteistoimija) @fi
definition: Liittää manifestaation yhteistoimijaan, joka on vastuussa manifestaation valmistamisesta etsaamalla metallia, lasia tai muuta pintaa hapon tai muun syövyttävän aineen avulla. @fi
toolkit label: etsaaja (yhteistoimija) @fi
toolkit definition: Yhteistoimija, joka on vastuussa manifestaation valmistamisesta etsaamalla metallia, lasia tai muuta pintaa hapon tai muun syövyttävän aineen avulla. @fi
label: har etser (kollektiv agent) @no
definition: Relaterer en manifestasjon til en kollektiv agent som er involvert i framstillingen av en manifestasjon ved å utsette metall, glass eller et annet overflatemateriale som brukes til trykking, for syre eller et annet etsende stoff. @no
toolkit label: etser (kollektiv agent) @no
toolkit definition: En kollektiv agent som er involvert i framstillingen av en manifestasjon ved å utsette metall, glass eller et annet overflatemateriale som brukes til trykking, for syre eller et annet etsende stoff. @no
label: a pour agent collectif aquafortiste @fr
definition: Met une manifestation en relation avec un agent collectif qui est responsable de la création d’une manifestation en soumettant à l’acide ou à une autre substance corrosive du métal, du verre ou une autre surface utilisée pour l’impression. @fr
toolkit label: agent collectif aquafortiste @fr
toolkit definition: Agent collectif qui est responsable de la création d’une manifestation en soumettant à l’acide ou à une autre substance corrosive du métal, du verre ou une autre surface utilisée pour l’impression. @fr
label: heeft etser-collectieve actor @nl
definition: Relateert een manifestatie aan een collectieve actor die verantwoordelijk is voor het creëren van een manifestatie middels het blootstellen van metaal, glas of een ander oppervlak gebruikt voor het drukproces, aan zuur of een ander bijtend middel. @nl
toolkit label: etser-collectieve actor @nl
toolkit definition: Een collectieve actor die verantwoordelijk is voor het creëren van een manifestatie middels het blootstellen van metaal, glas of een ander oppervlak gebruikt voor het drukproces, aan zuur of een ander bijtend middel. @nl
label: له وكيل جماعي حفار زنكوغراف (كليشيهات) @ar
definition: يربط بين تجسيدة ووكيل جماعي مسئول عن تصنيع تجسيدة لإخضاع المعدن، أو الزجاج، أو أي سطح آخر يستخدم في الطباعة، بالحمض أو أي مادة أخرى كاوية. @ar
toolkit label: وكيل جماعي حفار زنكوغراف (كليشيهات) @ar
toolkit definition: وكيل جماعي مسئول عن تصنيع تجسيدة لإخضاع المعدن، أو الزجاج، أو أي سطح آخر يستخدم في الطباعة، بالحمض أو أي مادة أخرى كاوية. @ar
label: té com a agent col·lectiu aiguafortista @ca
definition: Relaciona una manifestació amb un agent col·lectiu que és responsable de la creació d’una manifestació sotmetent a l’àcid, o a qualsevol altra substància corrosiva, el metall, el vidre o qualsevol altra superfície usada en la impressió. @ca
toolkit label: agent col·lectiu aiguafortista @ca
toolkit definition: Agent col·lectiu que és responsable de la creació d’una manifestació sotmetent a l’àcid, o a qualsevol altra substància corrosiva, el metall, el vidre o qualsevol altra superfície usada en la impressió. @ca
label: har kollektiv agent, som er raderer @da
definition: Relaterer en manifestation til en kollektiv agent, som er involveret i fremstillingen af en manifestation ved at udsætte metal, glas eller en anden overflade, som anvendes til trykning, for syre eller andet ætsende stof. @da
toolkit label: kollektiv agent, som er raderer @da
toolkit definition: Kollektiv agent, som er involveret i fremstillingen af en manifestation ved at udsætte metal, glas eller en anden overflade, som anvendes til trykning, for syre eller andet ætsende stof. @da
label: söövitaja (kollektiiv) @et
definition: Seostab kehastuse kollektiiviga, kes osaleb kehastuse valmistamises, töödeldes happe või muu söövitava ainega trükkimiseks kasutatavat metallist, klaasist või muust materjalist pinda. @et
toolkit label: söövitaja (kollektiiv) @et
toolkit definition: Kollektiiv, kes osaleb kehastuse valmistamises, töödeldes happe või muu söövitava ainega trükkimiseks kasutatavat metallist, klaasist või muust materjalist pinda. @et
label: hat Radiererin/Radierer (Gemeinschaftlicher Akteur) @de
definition: Setzt eine Manifestation in Beziehung zu einem gemeinschaftlichen Akteur, der für die Herstellung einer Manifestation verantwortlich ist, indem er Metall, Glas oder eine andere Oberfläche, die zum Drucken benutzt wird, mit Säure oder einer anderen ätzenden Substanz behandelt. @de
toolkit label: Radiererin/Radierer (Gemeinschaftlicher Akteur) @de
toolkit definition: Ein gemeinschaftlicher Akteur, der für die Herstellung einer Manifestation verantwortlich ist, indem er Metall, Glas oder eine andere Oberfläche, die zum Drucken benutzt wird, mit Säure oder einer anderen ätzenden Substanz behandelt. @de
label: karckészítő kollektív ágense a következő: @hu
definition: Hozzákapcsol egy megjelenési formát egy kollektív ágenshez, amely felelős egy megjelenési forma gyártásáért oly módon, hogy nyomtatáshoz használt fém-, üveg- vagy valamilyen más felületet savnak vagy más maró anyagnak vet alá. @hu
toolkit label: karckészítő kollektív ágens: @hu
toolkit definition: Egy kollektív ágens, amely felelős egy megjelenési forma gyártásáért oly módon, hogy nyomtatáshoz használt fém-, üveg- vagy valamilyen más felületet savnak vagy más maró anyagnak vet alá. @hu
label: ha come acquafortista agente collettivo @it
definition: Correla una manifestazione all'agente collettivo coinvolto nella manifattura di una manifestazione, sottoponendo all'acido o ad altra sostanza corrosiva, del metallo, vetro o altra superficie utilizzata per la stampa. @it
toolkit label: acquafortista agente collettivo @it
toolkit definition: Agente collettivo coinvolto nella manifattura di una manifestazione, sottoponendo all'acido o ad altra sostanza corrosiva, del metallo, vetro o altra superficie utilizzata per la stampa. @it
label: ofortists (grupa) @lv
definition: Sasaista manifestāciju ar grupu, kas iesaistīta manifestācijas ražošanā, pakļaujot metāla, stikla vai kādu citu drukāšanai paredzētu virsmu skābei vai citai kodīgai vielai. @lv
toolkit label: ofortists (grupa) @lv
toolkit definition: Grupa, kas iesaistīta manifestācijas ražošanā, pakļaujot metāla, stikla vai kādu citu drukāšanai paredzētu virsmu skābei vai citai kodīgai vielai. @lv
sub property of: has printmaker collective agent
label: 有蚀刻者集体行为者 @zh-hans
definition: 将一种载体表现与通过使用酸或其他腐蚀性物质施于用来印刷的金属、玻璃或其他表面上而对一种载体表现的创建负责的一个集体行为者关联起来。 @zh-hans
toolkit label: 蚀刻者集体行为者 @zh-hans
toolkit definition: 通过使用酸或其他腐蚀性物质施于用来印刷的金属、玻璃或其他表面上而对一种载体表现的创建负责的一个集体行为者 @zh-hans
label: oymacı kolektif temsilcisi ile ilişkilidir @tr
definition: Bir gösterimi, metali, camı veya baskı için kullanılan diğer bazı yüzeyleri asit veya başka bir aşındırıcı maddeye tabi tutarak bir gösterim yaratmaktan sorumlu olan kolektif bir temsilci ile ilişkilendirir. @tr
toolkit label: oymacı kolektif temsilcisi @tr
toolkit definition: Metal, cam veya baskı için kullanılan başka bir yüzeyi asit veya başka bir aşındırıcı maddeye tabi tutarak bir gösterim yaratmaktan sorumlu kolektif bir temsilci. @tr
label: tiene agente colectivo grabador @es
definition: Relaciona una manifestación con un agente colectivo que es responsable de crear una manifestación sometiendo metal, vidrio o alguna otra superficie utilizada para imprimir, a ácido u otra sustancia corrosiva. @es
toolkit label: agente colectivo grabador @es
toolkit definition: Un agente colectivo que es responsable de crear una manifestación sometiendo metal, vidrio o alguna otra superficie utilizada para imprimir, a ácido u otra sustancia corrosiva. @es
has subproperty: has etcher corporate body
has subproperty: has etcher family
has subproperty: P30385

has etcher corporate body
status: Published
lexical alias: etcherCorporateBody.en
definition: Relates a manifestation to a corporate body who is responsible for creating a manifestation by subjecting metal, glass, or some other surface used for printing, to acid or another corrosive substance.
toolkit label: etcher corporate body
toolkit definition: A corporate body who is responsible for creating a manifestation by subjecting metal, glass, or some other surface used for printing, to acid or another corrosive substance.
type: Property
domain: C10007
has element type: 2
sub property of: has etcher collective agent
label: etsaaja (yhteisö) @fi
definition: Liittää manifestaation yhteisöön, joka on vastuussa manifestaation valmistamisesta etsaamalla metallia, lasia tai muuta pintaa hapon tai muun syövyttävän aineen avulla. @fi
toolkit label: etsaaja (yhteisö) @fi
toolkit definition: Yhteisö, joka on vastuussa manifestaation valmistamisesta etsaamalla metallia, lasia tai muuta pintaa hapon tai muun syövyttävän aineen avulla. @fi
label: har etser (korporasjon) @no
definition: Relaterer en manifestasjon til en korporasjon som er involvert i framstillingen av en manifestasjon ved å utsette metall, glass eller et annet overflatemateriale som brukes til trykking, for syre eller et annet etsende stoff. @no
toolkit label: etser (korporasjon) @no
toolkit definition: En korporasjon som er involvert i framstillingen av en manifestasjon ved å utsette metall, glass eller et annet overflatemateriale som brukes til trykking, for syre eller et annet etsende stoff. @no
label: a pour collectivité aquafortiste @fr
definition: Met une manifestation en relation avec une collectivité qui est responsable de la création d’une manifestation en soumettant à l’acide ou à une autre substance corrosive du métal, du verre ou une autre surface utilisée pour l’impression. @fr
toolkit label: collectivité aquafortiste @fr
toolkit definition: Collectivité qui est responsable de la création d’une manifestation en soumettant à l’acide ou à une autre substance corrosive du métal, du verre ou une autre surface utilisée pour l’impression. @fr
label: heeft etser-corporatie @nl
definition: Relateert een manifestatie aan een corporatie die verantwoordelijk is voor het creëren van een manifestatie middels het blootstellen van metaal, glas of een ander oppervlak gebruikt voor het drukproces, aan zuur of een ander bijtend middel. @nl
toolkit label: etser-corporatie @nl
toolkit definition: Een corporatie die verantwoordelijk is voor het creëren van een manifestatie middels het blootstellen van metaal, glas of een ander oppervlak gebruikt voor het drukproces, aan zuur of een ander bijtend middel. @nl
label: له هيئة حفار زنكوغراف (كليشيهات) @ar
definition: يربط بين تجسيدة وهيئة مسئولة عن تصنيع تجسيدة لإخضاع المعدن، أو الزجاج، أو أي سطح آخر يستخدم في الطباعة، بالحمض أو أي مادة أخرى كاوية. @ar
toolkit label: هيئة حفار زنكوغراف (كليشيهات) @ar
toolkit definition: هيئة مسئولة عن تصنيع تجسيدة لإخضاع المعدن، أو الزجاج، أو أي سطح آخر يستخدم في الطباعة، بالحمض أو أي مادة أخرى كاوية. @ar
label: té com a entitat corporativa aiguafortista @ca
definition: Relaciona una manifestació amb una entitat corporativa que és responsable de la creació d’una manifestació sotmetent a l’àcid, o a qualsevol altra substància corrosiva, el metall, el vidre o qualsevol altra superfície usada en la impressió. @ca
toolkit label: entitat corporativa aiguafortista @ca
toolkit definition: Entitat corporativa que és responsable de la creació d’una manifestació sotmetent a l’àcid, o a qualsevol altra substància corrosiva, el metall, el vidre o qualsevol altra superfície usada en la impressió. @ca
label: har korporation, som er raderer @da
definition: Relaterer en manifestation til en korporation, som er involveret i fremstillingen af en manifestation ved at udsætte metal, glas eller en anden overflade, som anvendes til trykning, for syre eller andet ætsende stof. @da
toolkit label: korporation, som er raderer @da
toolkit definition: Korporation, som er involveret i fremstillingen af en manifestation ved at udsætte metal, glas eller en anden overflade, som anvendes til trykning, for syre eller andet ætsende stof. @da
label: söövitaja (asutus) @et
definition: Seostab kehastuse asutusega, kes osaleb kehastuse valmistamises, töödeldes happe või muu söövitava ainega trükkimiseks kasutatavat metallist, klaasist või muust materjalist pinda. @et
toolkit label: söövitaja (asutus) @et
toolkit definition: Asutus, kes osaleb kehastuse valmistamises, töödeldes happe või muu söövitava ainega trükkimiseks kasutatavat metallist, klaasist või muust materjalist pinda. @et
label: hat Radiererin/Radierer (Körperschaft) @de
definition: Setzt eine Manifestation in Beziehung zu einer Körperschaft, die für die Herstellung einer Manifestation verantwortlich ist, indem sie Metall, Glas oder eine andere Oberfläche, die zum Drucken benutzt wird, mit Säure oder einer anderen ätzenden Substanz behandelt. @de
toolkit label: Radiererin/Radierer (Körperschaft) @de
toolkit definition: Eine Körperschaft, die für die Herstellung einer Manifestation verantwortlich ist, indem sie Metall, Glas oder eine andere Oberfläche, die zum Drucken benutzt wird, mit Säure oder einer anderen ätzenden Substanz behandelt. @de
label: karckészítő testülete a következő: @hu
definition: Hozzákapcsol egy megjelenési formát egy testülethez, amely felelős egy megjelenési forma gyártásáért oly módon, hogy nyomtatáshoz használt fém-, üveg- vagy valamilyen más felületet savnak vagy más maró anyagnak vet alá. @hu
toolkit label: karckészítő testület: @hu
toolkit definition: Egy testület, amely felelős egy megjelenési forma gyártásáért oly módon, hogy nyomtatáshoz használt fém-, üveg- vagy valamilyen más felületet savnak vagy más maró anyagnak vet alá. @hu
label: ha come acquafortista ente @it
definition: Correla una manifestazione all'ente coinvolto nella manifattura di una manifestazione, sottoponendo all'acido o a un'altra sostanza corrosiva, del metallo, vetro o altra superficie utilizzata per la stampa. @it
toolkit label: acquafortista ente @it
toolkit definition: Ente coinvolto nella manifattura di una manifestazione, sottoponendo all'acido o a un'altra sostanza corrosiva, del metallo, vetro o altra superficie utilizzata per la stampa. @it
label: ofortists (institūcija) @lv
definition: Sasaista manifestāciju ar institūciju, kas iesaistīta manifestācijas ražošanā, pakļaujot metāla, stikla vai kādu citu drukāšanai paredzētu virsmu skābei vai citai kodīgai vielai. @lv
toolkit label: ofortists (institūcija) @lv
toolkit definition: Institūcija, kas iesaistīta manifestācijas ražošanā, pakļaujot metāla, stikla vai kādu citu drukāšanai paredzētu virsmu skābei vai citai kodīgai vielai. @lv
sub property of: has printmaker corporate body
label: 有蚀刻者团体 @zh-hans
definition: 将一种载体表现与通过使用酸或其他腐蚀性物质施于用来印刷的金属、玻璃或其他表面上而对一种载体表现的创建负责的一个团体关联起来。 @zh-hans
toolkit label: 蚀刻者团体 @zh-hans
toolkit definition: 通过使用酸或其他腐蚀性物质施于用来印刷的金属、玻璃或其他表面上而对一种载体表现的创建负责的一个团体 @zh-hans
label: oymacı tüzel kişisi ile ilişkilidir @tr
definition: Bir gösterimi metal, cam veya baskı için kullanılan diğer bazı yüzeyleri asit veya başka bir aşındırıcı maddeye tabi tutarak bir gösterim oluşturmaktan sorumlu olan bir tüzel kişi ile ilişkilendirir. @tr
toolkit label: oymacı tüzel kişisi @tr
toolkit definition: Metal, cam veya basım için kullanılan diğer bazı yüzeyleri asit veya başka bir aşındırıcı maddeye tabi tutarak gösterim oluşturmaktan sorumlu olan tüzel kişi. @tr
label: tiene cuerpo corporativo grabador @es
definition: Relaciona una manifestación con un cuerpo corporativo que es responsable de crear una manifestación sometiendo metal, vidrio o alguna otra superficie utilizada para imprimir, a ácido u otra sustancia corrosiva. @es
toolkit label: cuerpo corporativo grabador @es
toolkit definition: Un cuerpo corporativo que es responsable de crear una manifestación sometiendo metal, vidrio o alguna otra superficie utilizada para imprimir, a ácido u otra sustancia corrosiva. @es
has subproperty: P30414

has etcher family
status: Published
lexical alias: etcherFamily.en
definition: Relates a manifestation to a family who is responsible for creating a manifestation by subjecting metal, glass, or some other surface used for printing, to acid or another corrosive substance.
toolkit label: etcher family
toolkit definition: A family who is responsible for creating a manifestation by subjecting metal, glass, or some other surface used for printing, to acid or another corrosive substance.
type: Property
domain: C10007
has element type: 2
sub property of: has etcher collective agent
label: etsaaja (suku) @fi
definition: Liittää manifestaation sukuun, joka on vastuussa manifestaation valmistamisesta etsaamalla metallia, lasia tai muuta pintaa hapon tai muun syövyttävän aineen avulla. @fi
toolkit label: etsaaja (suku) @fi
toolkit definition: Suku, joka on vastuussa manifestaation valmistamisesta etsaamalla metallia, lasia tai muuta pintaa hapon tai muun syövyttävän aineen avulla. @fi
label: har etser (familie) @no
definition: Relaterer en manifestasjon til en familie som er involvert i framstillingen av en manifestasjon ved å utsette metall, glass eller et annet overflatemateriale som brukes til trykking, for syre eller et annet etsende stoff. @no
toolkit label: etser (familie) @no
toolkit definition: En familie som er involvert i framstillingen av en manifestasjon ved å utsette metall, glass eller et annet overflatemateriale som brukes til trykking, for syre eller et annet etsende stoff. @no
label: a pour famille aquafortiste @fr
definition: Met une manifestation en relation avec une famille qui est responsable de la création d’une manifestation en soumettant à l’acide ou à une autre substance corrosive du métal, du verre ou une autre surface utilisée pour l’impression. @fr
toolkit label: famille aquafortiste @fr
toolkit definition: Famille qui est responsable de la création d’une manifestation en soumettant à l’acide ou à une autre substance corrosive du métal, du verre ou une autre surface utilisée pour l’impression. @fr
label: heeft etser-familie @nl
definition: Relateert een manifestatie aan een familie die verantwoordelijk is voor het creëren van een manifestatie middels het blootstellen van metaal, glas of een ander oppervlak gebruikt voor het drukproces, aan zuur of een ander bijtend middel. @nl
toolkit label: etser-familie @nl
toolkit definition: Een familie die verantwoordelijk is voor het creëren van een manifestatie middels het blootstellen van metaal, glas of een ander oppervlak gebruikt voor het drukproces, aan zuur of een ander bijtend middel. @nl
label: له عائلة حفار زنكوغراف (كليشيهات) @ar
definition: يربط بين تجسيدة وعائلة مسئولة عن تصنيع تجسيدة لإخضاع المعدن، أو الزجاج، أو أي سطح آخر يستخدم في الطباعة، بالحمض أو أي مادة أخرى كاوية. @ar
toolkit label: عائلة حفار زنكوغراف (كليشيهات) @ar
toolkit definition: عائلة مسئولة عن تصنيع تجسيدة لإخضاع المعدن، أو الزجاج، أو أي سطح آخر يستخدم في الطباعة، بالحمض أو أي مادة أخرى كاوية. @ar
label: té com a família aiguafortista @ca
definition: Relaciona una manifestació amb una família que és responsable de la creació d’una manifestació sotmetent a l’àcid, o a qualsevol altra substància corrosiva, el metall, el vidre o qualsevol altra superfície usada en la impressió. @ca
toolkit label: família aiguafortista @ca
toolkit definition: Família que és responsable de la creació d’una manifestació sotmetent a l’àcid, o a qualsevol altra substància corrosiva, el metall, el vidre o qualsevol altra superfície usada en la impressió. @ca
label: har familie, som er raderer @da
definition: Relaterer en manifestation til en familie, som er involveret i fremstillingen af en manifestation ved at udsætte metal, glas eller en anden overflade, som anvendes til trykning, for syre eller andet ætsende stof. @da
toolkit label: familie, som er raderer @da
toolkit definition: Familie, som er involveret i fremstillingen af en manifestation ved at udsætte metal, glas eller en anden overflade, som anvendes til trykning, for syre eller andet ætsende stof. @da
label: söövitaja (perekond) @et
definition: Seostab kehastuse perekonnaga, kes osaleb kehastuse valmistamises, töödeldes happe või muu söövitava ainega trükkimiseks kasutatavat metallist, klaasist või muust materjalist pinda. @et
toolkit label: söövitaja (perekond) @et
toolkit definition: Perekond, kes osaleb kehastuse valmistamises, töödeldes happe või muu söövitava ainega trükkimiseks kasutatavat metallist, klaasist või muust materjalist pinda. @et
label: hat Radiererin/Radierer (Familie) @de
definition: Setzt eine Manifestation in Beziehung zu einer Familie, die für die Herstellung einer Manifestation verantwortlich ist, indem sie Metall, Glas oder eine andere Oberfläche, die zum Drucken benutzt wird, mit Säure oder einer anderen ätzenden Substanz behandelt. @de
toolkit label: Radiererin/Radierer (Familie) @de
toolkit definition: Eine Familie, die für die Herstellung einer Manifestation verantwortlich ist, indem sie Metall, Glas oder eine andere Oberfläche, die zum Drucken benutzt wird, mit Säure oder einer anderen ätzenden Substanz behandelt. @de
label: karckészítő családja a következő: @hu
definition: Hozzákapcsol egy megjelenési formát egy családhoz, amely felelős egy megjelenési forma gyártásáért oly módon, hogy nyomtatáshoz használt fém-, üveg- vagy valamilyen más felületet savnak vagy más maró anyagnak vet alá. @hu
toolkit label: karckészítő család: @hu
toolkit definition: Egy család, amely felelős egy megjelenési forma gyártásáért oly módon, hogy nyomtatáshoz használt fém-, üveg- vagy valamilyen más felületet savnak vagy más maró anyagnak vet alá. @hu
label: ha come acquafortista famiglia @it
definition: Correla una manifestazione alla famiglia coinvolta nella manifattura di una manifestazione, sottoponendo all'acido o a un'altra sostanza corrosiva, del metallo, vetro o altra superficie utilizzata per la stampa. @it
toolkit label: acquafortista famiglia @it
toolkit definition: Famiglia coinvolta nella manifattura di una manifestazione, sottoponendo all'acido o a un'altra sostanza corrosiva, del metallo, vetro o altra superficie utilizzata per la stampa. @it
label: ofortists (dzimta/ģimene) @lv
definition: Sasaista manifestāciju ar dzimtu/ģimeni, kas iesaistīta manifestācijas ražošanā, pakļaujot metāla, stikla vai kādu citu drukāšanai paredzētu virsmu skābei vai citai kodīgai vielai. @lv
toolkit label: ofortists (dzimta/ģimene) @lv
toolkit definition: Dzimta/ģimene, kas iesaistīta manifestācijas ražošanā, pakļaujot metāla, stikla vai kādu citu drukāšanai paredzētu virsmu skābei vai citai kodīgai vielai. @lv
sub property of: has printmaker family
label: 有蚀刻者家族 @zh-hans
definition: 将一种载体表现与通过使用酸或其他腐蚀性物质施于用来印刷的金属、玻璃或其他表面上而对一种载体表现的创建负责的一个家族关联起来。 @zh-hans
toolkit label: 蚀刻者家族 @zh-hans
toolkit definition: 通过使用酸或其他腐蚀性物质施于用来印刷的金属、玻璃或其他表面上而对一种载体表现的创建负责的一个家族 @zh-hans
label: oymacı ailesi ile ilişkilidir @tr
definition: Bir gösterimi; baskı için kullanılan metal, cam veya diğer bazı yüzeyleri asit veya başka bir aşındırıcı maddeye maruz bırakarak bir gösterim oluşturmakla sorumlu aileyle ilişkilendirir. @tr
toolkit label: oymacı ailesi @tr
toolkit definition: Baskı için kullanılan metal, cam veya diğer bazı yüzeyleri asit veya başka bir aşındırıcı maddeye maruz bırakarak bir gösterim oluşturmakla sorumlu aile. @tr
label: tiene familia aguafuertista @es
definition: Relaciona una manifestación con una familia que es responsable de crear una manifestación al someter metal, vidrio u otra superficie utilizada para imprimir a un ácido u otra sustancia corrosiva. @es
toolkit label: familia aguafuertista @es
toolkit definition: Una familia que es responsable de crear una manifestación al someter metal, vidrio u otra superficie utilizada para imprimir a un ácido u otra sustancia corrosiva. @es
has subproperty: P30443

has etcher person
status: Published
lexical alias: etcherPerson.en
definition: Relates a manifestation to a person who is responsible for creating a manifestation by subjecting metal, glass, or some other surface used for printing, to acid or another corrosive substance.
toolkit label: etcher person
toolkit definition: A person who is responsible for creating a manifestation by subjecting metal, glass, or some other surface used for printing, to acid or another corrosive substance.
type: Property
domain: C10007
has element type: 2
sub property of: has etcher agent
label: etsaaja (henkilö) @fi
definition: Liittää manifestaation henkilöön, joka on vastuussa manifestaation valmistamisesta etsaamalla metallia, lasia tms. pintaa hapon tai muun syövyttävän aineen avulla. @fi
toolkit label: etsaaja (henkilö) @fi
toolkit definition: Henkilö, joka on vastuussa manifestaation valmistamisesta etsaamalla metallia, lasia tms. pintaa hapon tai muun syövyttävän aineen avulla. @fi
label: har etser (person) @no
definition: Relaterer en manifestasjon til en person som er involvert i framstillingen av en manifestasjon ved å utsette metall, glass eller et annet overflatemateriale som brukes til trykking, for syre eller et annet etsende stoff. @no
toolkit label: etser (person) @no
toolkit definition: En person som er involvert i framstillingen av en manifestasjon ved å utsette metall, glass eller et annet overflatemateriale som brukes til trykking, for syre eller et annet etsende stoff. @no
label: a pour personne aquafortiste @fr
definition: Met une manifestation en relation avec une personne qui est responsable de la création d’une manifestation en soumettant à l’acide ou à une autre substance corrosive du métal, du verre ou une autre surface utilisée pour l’impression. @fr
toolkit label: personne aquafortiste @fr
toolkit definition: Personne qui est responsable de la création d’une manifestation en soumettant à l’acide ou à une autre substance corrosive du métal, du verre ou une autre surface utilisée pour l’impression. @fr
label: heeft etser-persoon @nl
definition: Relateert een manifestatie aan een persoon die verantwoordelijk is voor het creëren van een manifestatie middels het blootstellen van metaal, glas of een ander oppervlak gebruikt voor het drukproces, aan zuur of een ander bijtend middel. @nl
toolkit label: etser-persoon @nl
toolkit definition: Een persoon die verantwoordelijk is voor het creëren van een manifestatie middels het blootstellen van metaal, glas of een ander oppervlak gebruikt voor het drukproces, aan zuur of een ander bijtend middel. @nl
label: له شخص حفار زنكوغراف (كليشيهات) @ar
definition: يربط بين تجسيدة وشخص مسئول عن تصنيع تجسيدة لإخضاع المعدن، أو الزجاج، أو أي سطح آخر يستخدم في الطباعة، بالحمض أو أي مادة أخرى كاوية. @ar
toolkit label: شخص حفار زنكوغراف (كليشيهات) @ar
toolkit definition: شخص مسئول عن تصنيع تجسيدة لإخضاع المعدن، أو الزجاج، أو أي سطح آخر يستخدم في الطباعة، بالحمض أو أي مادة أخرى كاوية. @ar
label: té com a persona aiguafortista @ca
definition: Relaciona una manifestació amb una persona que és responsable de la creació d’una manifestació sotmetent a l’àcid, o a qualsevol altra substància corrosiva, el metall, el vidre o qualsevol altra superfície usada en la impressió. @ca
toolkit label: persona aiguafortista @ca
toolkit definition: Persona que és responsable de la creaació d’una manifestació sotmetent a l’àcid, o a qualsevol altra substància corrosiva, el metall, el vidre o qualsevol altra superfície usada en la impressió. @ca
label: har person, som er raderer @da
definition: Relaterer en manifestation til en person, som er involveret i fremstillingen af en manifestation ved at udsætte metal, glas eller en anden overflade, som anvendes til trykning, for syre eller andet ætsende stof. @da
toolkit label: person, som er raderer @da
toolkit definition: Person, som er involveret i fremstillingen af en manifestation ved at udsætte metal, glas eller en anden overflade, som anvendes til trykning, for syre eller andet ætsende stof. @da
label: söövitaja (isik) @et
definition: Seostab kehastuse isikuga, kes osaleb kehastuse valmistamises, töödeldes happe või muu söövitava ainega trükkimiseks kasutatavat metallist, klaasist või muust materjalist pinda. @et
toolkit label: söövitaja (isik) @et
toolkit definition: Isik, kes osaleb kehastuse valmistamises, töödeldes happe või muu söövitava ainega trükkimiseks kasutatavat metallist, klaasist või muust materjalist pinda. @et
label: hat Radiererin/Radierer (Person) @de
definition: Setzt eine Manifestation in Beziehung zu einer Person, die für die Herstellung einer Manifestation verantwortlich ist, indem sie Metall, Glas oder eine andere Oberfläche, die zum Drucken benutzt wird, mit Säure oder einer anderen ätzenden Substanz behandelt. @de
toolkit label: Radiererin/Radierer (Person) @de
toolkit definition: Eine Person, die für die Herstellung einer Manifestation verantwortlich ist, indem sie Metall, Glas oder eine andere Oberfläche, die zum Drucken benutzt wird, mit Säure oder einer anderen ätzenden Substanz behandelt. @de
label: karckészítő személye a következő: @hu
definition: Hozzákapcsol egy megjelenési formát egy személyhez, aki felelős egy megjelenési forma gyártásáért oly módon, hogy nyomtatáshoz használt fém-, üveg- vagy valamilyen más felületet savnak vagy más maró anyagnak vet alá. @hu
toolkit label: karckészítő személy: @hu
toolkit definition: Egy személy, aki felelős egy megjelenési forma gyártásáért oly módon, hogy nyomtatáshoz használt fém-, üveg- vagy valamilyen más felületet savnak vagy más maró anyagnak vet alá. @hu
label: ha come acquafortista persona @it
definition: Correla una manifestazione alla persona coinvolta nella manifattura di una manifestazione, sottoponendo all'acido o ad altra sostanza corrosiva, del metallo, vetro o altra superficie utilizzata per la stampa. @it
toolkit label: acquafortista persona @it
toolkit definition: Persona coinvolta nella manifattura di una manifestazione, sottoponendo all'acido o ad altra sostanza corrosiva, del metallo, vetro o altra superficie utilizzata per la stampa. @it
label: ofortists (persona) @lv
definition: Sasaista manifestāciju ar personu, kura iesaistīta manifestācijas ražošanā, pakļaujot metāla, stikla vai kādu citu drukāšanai paredzētu virsmu skābei vai citai kodīgai vielai. @lv
toolkit label: ofortists (persona) @lv
toolkit definition: Persona, kura iesaistīta manifestācijas ražošanā, pakļaujot metāla, stikla vai kādu citu drukāšanai paredzētu virsmu skābei vai citai kodīgai vielai. @lv
sub property of: has printmaker person
label: 有蚀刻者个人 @zh-hans
definition: 将一种载体表现与通过使用酸或其他腐蚀性物质施于用来印刷的金属、玻璃或其他表面上而对一种载体表现的创建负责的一个个人关联起来。 @zh-hans
toolkit label: 蚀刻者个人 @zh-hans
toolkit definition: 通过使用酸或其他腐蚀性物质施于用来印刷的金属、玻璃或其他表面上而对一种载体表现的创建负责的一个个人 @zh-hans
label: oymacı kişisi ile ilişkilidir @tr
definition: Bir gösterimi, metali, camı veya baskı için kullanılan başka bir yüzeyi asit veya başka bir aşındırıcı maddeye maruz bırakarak bir öğe oluşturmaktan sorumlu olan kişiyle ilişkilendirir. @tr
toolkit label: oymacı @tr
toolkit definition: Metal, cam veya baskı için kullanılan başka bir yüzeyi asit veya başka bir aşındırıcı maddeye maruz bırakarak bir gösterim oluşturmakla sorumlu olan kişi. @tr
label: tiene persona grabadora @es
definition: Relaciona una manifestación con una persona que se encarga de crear una manifestación sometiendo metal, vidrio o alguna otra superficie utilizada para imprimir, en ácido u otra sustancia corrosiva. @es
toolkit label: persona grabadora @es
toolkit definition: Una persona que se encarga de crear una manifestación sometiendo metal, vidrio o alguna otra superficie utilizada para imprimir, en ácido u otra sustancia corrosiva. @es
has subproperty: P30356

is evaluation of (manifestation) (Deprecated)
status: Deprecated
type: Property
toolkit definition: A manifestation that is examined or judged. (Deprecated)
toolkit label: evaluation of (manifestation) (Deprecated)
definition: Relates a work to a manifestation that is examined or judged. (Deprecated)
sub property of: is description of (manifestation) (Deprecated)
lexical alias: evaluationOfManifestation.en
domain: C10001

has extent of cartographic resource (Deprecated)
status: Deprecated
type: Property
domain: C10007
sub property of: has extent of manifestation
lexical alias: extentOfCartographicResource.en
label: a pour importance matérielle de la ressource cartographique @fr
definition: Met une manifestation en relation avec le nombre et le type d’unités et/ou de sous-unités formant une ressource cartographique. @fr
toolkit label: importance matérielle de la ressource cartographique @fr
toolkit definition: Le nombre et le type d’unités et/ou de sous-unités formant une ressource cartographique. @fr
toolkit label: extensión de recurso cartográfico @es
toolkit definition: El número y tipo de unidades y/o subunidades que constituyen un recurso cartográfico. @es
instruction number: 3/4/2002

has extent of notated music (Deprecated)
status: Deprecated
type: Property
domain: C10007
sub property of: has extent of manifestation
lexical alias: extentOfNotatedMusic.en
label: a pour importance matérielle de la musique notée @fr
definition: Met une manifestation en relation avec le nombre et le type d’unités et/ou de sous-unités formant une ressource constituée de musique notée, avec ou sans texte d’accompagnement et/ou illustrations. @fr
toolkit label: importance matérielle de la musique notée @fr
toolkit definition: Le nombre et le type d’unités et/ou de sous-unités formant une ressource constituée de musique notée, avec ou sans texte d’accompagnement et/ou illustrations. @fr
toolkit label: extensión de la música notada @es
toolkit definition: El número y tipo de unidades y/o subunidades que constituyen un recurso que consiste en música notada (con o sin acompañamiento de texto y/o ilustraciones). @es
instruction number: 3/4/2003

has extent of still image (Deprecated)
status: Deprecated
type: Property
domain: C10007
sub property of: has extent of manifestation
lexical alias: extentOfStillImage.en
label: a pour importance matérielle de l’image fixe @fr
definition: Met une manifestation en relation avec le nombre et le type d’unités et/ou de sous-unités formant une ressource constituée d’une ou de plusieurs images fixes. @fr
toolkit label: importance matérielle de l’image fixe @fr
toolkit definition: Le nombre et le type d’unités et/ou de sous-unités formant une ressource constituée d’une ou de plusieurs images fixes. @fr
toolkit label: extensión de la imagen fija @es
toolkit definition: El número y tipo de unidades y/o subunidades que constituyen un recurso que consiste en una o más imágenes fijas. @es
instruction number: 3/4/2004

has extent of text (Deprecated)
status: Deprecated
type: Property
domain: C10007
sub property of: has extent of manifestation
lexical alias: extentOfText.en
label: a pour importance matérielle du texte @fr
definition: Met une manifestation en relation avec le nombre et le type d’unités et/ou de sous-unités formant une ressource constituée de texte, avec ou sans illustrations. @fr
toolkit label: importance matérielle du texte @fr
toolkit definition: Le nombre et le type d’unités et/ou de sous-unités formant une ressource constituée de texte, avec ou sans illustrations. @fr
toolkit label: extensión del texto @es
toolkit definition: El número y tipo de unidades y/o subunidades que constituyen un recurso que consiste en texto (con o sin ilustraciones). @es
instruction number: 3/4/2005

has extent of three-dimensional form (Deprecated)
status: Deprecated
type: Property
domain: C10007
sub property of: has extent of manifestation
lexical alias: extentOfThreeDimensionalForm.en
label: a pour importance matérielle de la forme tridimensionnelle @fr
definition: Met une manifestation en relation avec le nombre et le type d’unités et/ou de sous-unités formant une ressource constituée d’une ou de plusieurs formes tridimensionnelles. @fr
toolkit label: importance matérielle de la forme tridimensionnelle @fr
toolkit definition: Le nombre et le type d’unités et/ou de sous-unités formant une ressource constituée d’une ou de plusieurs formes tridimensionnelles. @fr
toolkit label: extensión de la forma tridimensional @es
toolkit definition: El número y tipo de unidades y/o subunidades que constituyen un recurso que consiste en una o más formas tridimensionales. @es
instruction number: 3/4/2006

is facsimile of item of
status: Published
type: Property
lexical alias: facsimileOfItemOf.en
definition: Relates a manifestation to an item that is used as the basis for an exact reproduction.
domain: C10007
sub property of: is reproduction of item of
toolkit label: facsimile of item of
toolkit definition: An item that is used as the basis for an exact reproduction.
has element type: 2
label: näköispainos kappaleesta @fi
definition: Liittää manifestaation kappaleeseen, jota on käytetty täsmällisen jäljennöksen pohjana. @fi
toolkit label: näköispainos kappaleesta @fi
toolkit definition: Kappale, jota on käytetty täsmällisen jäljennöksen pohjana. @fi
label: er faksimile av eksemplar av @no
definition: Relaterer en manifestasjon til et eksemplar som brukes som grunnlag for en nøyaktig reproduksjon. @no
toolkit label: faksimile av eksemplar av @no
toolkit definition: Et eksemplar som brukes som grunnlag for en nøyaktig reproduksjon. @no
label: est un fac-similé d’un item de @fr
definition: Met une manifestation en relation avec un item qui sert de base à une reproduction exacte. @fr
toolkit label: fac-similé d’un item de @fr
toolkit definition: Item qui sert de base à une reproduction exacte. @fr
label: heeft facsimile van item van @nl
definition: Relateert een manifestatie aan een item dat gebruikt is als de basis voor een exacte reproductie. @nl
toolkit label: facsimile van item van @nl
toolkit definition: Een item dat gebruikt is als de basis voor een exacte reproductie. @nl
label: هو صورة طبق الأصل لمفردة لـ @ar
definition: يربط بين تجسيدة ومفردة تستخدم كأساس لعملية الإستنساخ الدقيق. @ar
toolkit label: صورة صورة طبق الأصل لمفردة لـ @ar
toolkit definition: مفردة تستخدم كأساس لعملية الإستنساخ الدقيق. @ar
label: és facsímil d’un ítem de @ca
definition: Relaciona una manifestació amb un ítem que s’usa com a base d’una reproducció exacta. @ca
toolkit label: facsímil d’un ítem de @ca
toolkit definition: Ítem que s’usa com a base d’una reproducció exacta. @ca
label: er faksimile af eksemplar af @da
definition: Relaterer en manifestation til et eksemplar, som anvendes som grundlag for en nøjagtig reproduktion. @da
toolkit label: faksimile af eksemplar af @da
toolkit definition: Eksemplar, som anvendes som grundlag for en nøjagtig reproduktion. @da
label: faksiimile eksemplarist @et
definition: Seostab kehastuse eksemplariga, mida on kasutatud täpse reproduktsiooni alusena. @et
toolkit label: faksiimile eksemplarist @et
toolkit definition: Eksemplar, mida on kasutatud täpse reproduktsiooni alusena. @et
label: ist Faksimile eines Exemplars von @de
definition: Setzt eine Manifestation in Beziehung zu einem Exemplar, das als Grundlage für eine exakte Reproduktion verwendet wird. @de
toolkit label: Faksimile eines Exemplars von @de
toolkit definition: Ein Exemplar, das als Grundlage für eine exakte Reproduktion verwendet wird. @de
label: hasonmása a következő példánynak: @hu
definition: Hozzákapcsol egy megjelenési formát egy példányhoz, amelyet egy pontos másolat alapjaként használnak. @hu
toolkit label: példány hasonmása: @hu
toolkit definition: Egy példány, amelyet egy pontos másolat alapjaként használnak. @hu
label: è facsimile di item di @it
definition: Correla una manifestazione a un item utilizzato come base per una riproduzione esatta. @it
toolkit label: facsimile di item di @it
toolkit definition: Item utilizzato come base per una riproduzione esatta. @it
label: ir faksimils vienībai @lv
definition: Sasaista manifestāciju ar vienību, kas ir izmantota par pamatu precīzai reprodukcijai. @lv
toolkit label: ir faksimils vienībai @lv
toolkit definition: Vienība, kas ir izmantota par pamatu precīzai reprodukcijai. @lv
label: 是……的单件的摹真品 @zh-hans
definition: 将一种载体表现与用作一种精确复制品之基础的一个单件关联起来。 @zh-hans
toolkit label: ……的单件的摹真品 @zh-hans
toolkit definition: 用作一种精确复制品之基础的一个单件 @zh-hans
label: kopyasının tıpkıbasımıdır @tr
definition: Bir gösterimi, tam bir yeniden üretim için temel olarak kullanılan bir kopyayla ilişkilendirir. @tr
toolkit label: kopyanın tıpkıbasımı @tr
toolkit definition: Birebir çoğaltma için temel olarak kullanılan bir kopya. @tr
label: es un facsímil del item de @es
definition: Relaciona una manifestación con un item que se utiliza como base para una reproducción exacta. @es
toolkit label: facsímil del item de @es
toolkit definition: Un item que se utiliza como base para una reproducción exacta. @es
has subproperty: is preservation facsimile of item of
has subproperty: P30300

is facsimile of manifestation of
status: Published
definition: Relates a manifestation to a manifestation that is used as the basis for an exact reproduction.
type: Property
domain: C10007
sub property of: is reproduction of manifestation of
lexical alias: facsimileOfManifestationOf.en
toolkit label: facsimile of manifestation of
toolkit definition: A manifestation that is used as the basis for an exact reproduction.
label: est un fac-similé d’une manifestation de @fr
definition: Met une manifestation en relation avec une manifestation qui sert de base à une reproduction exacte. @fr
toolkit label: fac-similé d’une manifestation de @fr
toolkit definition: Manifestation qui sert de base à une reproduction exacte. @fr
toolkit label: facsímil de manifestación de @es
toolkit definition: Una manifestación que se utiliza como base para una reproducción exacta. @es
instruction number: 24.5
toolkit label: facsimile van manifestatie van @nl
toolkit definition: Een manifestatie die gebruikt is als de basis voor een exacte reproductie. @nl
label: là bản sao chép của (biểu thị) @vi
definition: Liên kết biểu thị với biểu thị được sử dụng như là cơ sở cho bản tái tạo. @vi
toolkit label: bản sao chép của (biểu thị) @vi
toolkit definition: Biểu thị được sử dụng như là cơ sở cho bản tái tạo. @vi
label: er faksimile af manifestation af @da
definition: Relaterer en manifestation til en manifestation, som anvendes som grundlag for en nøjagtig reproduktion. @da
toolkit label: faksimile af manifestation af @da
toolkit definition: Manifestation, som anvendes som grundlag for en nøjagtig reproduktion. @da
label: ist Faksimile einer Manifestation von @de
definition: Setzt eine Manifestation in Beziehung zu einer Manifestation, die als Grundlage für eine exakte Reproduktion verwendet wird. @de
toolkit label: Faksimile einer Manifestation von @de
toolkit definition: Eine Manifestation, die als Grundlage für eine exakte Reproduktion verwendet wird. @de
label: és facsímil d’una manifestació de @ca
definition: Relaciona una manifestació amb una manifestació que s’usa com a base d’una reproducció exacta. @ca
toolkit label: facsímil d’una manifestació de @ca
toolkit definition: Manifestació que s’usa com a base d’una reproducció exacta. @ca
definition: Liittää manifestaation manifestaatioon, jota on käytetty täsmällisen jäljennöksen perustana. @fi
toolkit label: näköispainos manifestaatiosta @fi
toolkit definition: Manifestaatio, jota on käytetty täsmällisen jäljennöksen perustana. @fi
toolkit label: faksimile av manifestasjon av @no
toolkit definition: En manifestasjon som brukes som utgangspunkt for en eksakt reproduksjon. @no
label: είναι ομοιότυπο της (εκδήλωση) @el
definition: Συνδέει μια εκδήλωση με μια εκδήλωση που χρησιμοποιείται ως η βάση για μια αναπαραγωγή ακριβείας. @el
toolkit label: ομοιότυπο της (εκδήλωση) @el
toolkit definition: Μια εκδήλωση που χρησιμοποιείται ως η βάση για μια αναπαραγωγή ακριβείας. @el
has element type: 2
label: hasonmása (megjelenési forma) @hu
definition: Hozzákapcsol egy megjelenési formát egy megjelenési formához, amelyet egy pontos másolat alapjaként használnak. @hu
toolkit label: hasonmása (megjelenési forma) @hu
toolkit definition: Egy megjelenési forma, amelyet egy pontos másolat alapjaként használnak. @hu
label: näköispainos manifestaatiosta @fi
label: er faksimile av manifestasjon av @no
definition: Relaterer en manifestasjon til en manifestasjon som brukes som utgangspunkt for en eksakt reproduksjon. @no
label: is facsimile van manifestatie van @nl
definition: Relateert een manifestatie aan een manifestatie die gebruikt is als de basis voor een exacte reproductie. @nl
label: هو نسخة طبق الأصل لتجسيدة لـ @ar
definition: يربط بين تجسيدة وتجسيدة تستخدم كأساس لإعادة الإنتاج طبق الأصل. @ar
toolkit label: طبق الأصل لتجسيدة لـ @ar
toolkit definition: تجسيدة تستخدم كأساس لإعادة الإنتاج طبق الأصل. @ar
label: faksiimile kehastusest @et
definition: Seostab kehastuse kehastusega, mida on kasutatud täpse reproduktsiooni alusena. @et
toolkit label: faksiimile kehastusest @et
toolkit definition: Kehastus, mida on kasutatud täpse reproduktsiooni alusena. @et
label: è facsimile di una manifestazione di @it
definition: Correla una manifestazione a una manifestazione utilizzata come base per una riproduzione esatta. @it
toolkit label: facsimile di una manifestazione di @it
toolkit definition: Manifestazione utilizzata come base per una riproduzione esatta. @it
label: ir faksimils manifestācijai @lv
definition: Sasaista manifestāciju ar manifestāciju, kas ir izmantota par pamatu precīzai reprodukcijai. @lv
toolkit label: ir faksimils manifestācijai @lv
toolkit definition: Manifestācija, kas ir izmantota par pamatu precīzai reprodukcijai. @lv
label: 是……的载体表现的摹真品 @zh-hans
definition: 将一种载体表现与被用作一个精确复制品之基础的一种载体表现关联起来。 @zh-hans
toolkit label: ……的载体表现的摹真品 @zh-hans
toolkit definition: 被用作一个精确复制品之基础的一种载体表现 @zh-hans
label: gösteriminin tıpkıbasımıdır @tr
definition: Bir gösterimi, tıpatıp yeniden üretim için temel olarak kullanılan bir gösterim ile ilişkilendirir. @tr
toolkit label: gösterimin tıpkıbasımı @tr
toolkit definition: Tıpatıp röprodüksiyonu için temel olarak kullanılan bir gösterim @tr
label: es un facsímil de la manifestación de @es
definition: Relaciona una manifestación con una manifestación que se utiliza como base para una reproducción exacta. @es
has subproperty: is preservation facsimile of manifestation of

has facsimile part
status: Published
definition: Relates a manifestation to a manifestation that is exactly reproduced as a part of another manifestation.
type: Property
domain: C10007
sub property of: has part manifestation
lexical alias: facsimilePart.en
toolkit label: facsimile part
toolkit definition: A manifestation that is exactly reproduced as a part of another manifestation.
label: a pour partie de fac-similé @fr
definition: Met une manifestation en relation avec une manifestation qui est reproduite exactement comme partie intégrante d’une autre manifestation. @fr
toolkit label: partie de fac-similé @fr
toolkit definition: Manifestation qui est reproduite exactement comme partie intégrante d’une autre manifestation. @fr
toolkit label: facsímil parcial @es
toolkit definition: Una manifestación que se reproduce exactamente como parte de otra manifestación. @es
instruction number: 24.5
toolkit label: facsimile deel @nl
toolkit definition: Een manifestatie die exact gereproduceerd is als onderdeel van een andere manifestatie. @nl
label: là vỏ chứa bản sao chép của @vi
definition: Liên kết biểu thị với biểu thị được sử dụng như là cơ sở cho bản tái tạo là bộ phận cấu thành tách biệt của biểu thị lớn hơn. @vi
toolkit label: vỏ chứa bản sao chép của @vi
toolkit definition: Biểu thị được sử dụng như là cơ sở cho bản tái tạo là bộ phận cấu thành tách biệt của biểu thị lớn hơn. @vi
label: har faksimiledel @da
definition: Relaterer en manifestation til en manifestation, som er nøjagtigt gengivet som en del af en anden manifestation. @da
toolkit label: faksimiledel @da
toolkit definition: Manifestation, som er nøjagtigt gengivet som en del af en anden manifestation. @da
definition: Setzt eine Manifestation in Beziehung zu einer Manifestation, die als ein Teil einer anderen Manifestation exakt reproduziert ist. @de
toolkit label: Enthält Faksimile von @de
toolkit definition: Eine Manifestation, die als ein Teil einer anderen Manifestation exakt reproduziert ist. @de
label: té com a part de facsímil @ca
definition: Relaciona una manifestació amb una manifestació que es reprodueix exactament com una part d’una altra manifestació. @ca
toolkit label: part de facsímil @ca
toolkit definition: Manifestació que es reprodueix exactament com una part d’una altra manifestació. @ca
definition: Liittää manifestaatioon manifestaation täsmällisen jäljennöksen, joka on toisen manifestaation osana. @fi
toolkit label: näköispainososa @fi
toolkit definition: Manifestaation täsmällinen jäljennös, joka on toisen manifestaation osana. @fi
toolkit label: faksimile som del @no
toolkit definition: En manifestasjon som er en tro kopi av en del av en annen manifestasjon. @no
label: είναι περιέκτης του ομοιότυπου του @el
definition: Συνδέει μια εκδήλωση με μια εκδήλωση που χρησιμοποιείται ως η βάση για μια αναπαραγωγή ακριβείας, η οποία είναι διακριτό συστατικό μιας μεγαλύτερης εκδήλωσης. @el
toolkit label: περιέκτης του ομοιότυπου @el
toolkit definition: Μια εκδήλωση που χρησιμοποιείται ως η βάση για μια αναπαραγωγή ακριβείας, η οποία είναι διακριτό συστατικό μιας μεγαλύτερης εκδήλωσης. @el
has element type: 2
label: hasonmás része a következő: @hu
definition: Egy megjelenési formát hozzákapcsol egy olyan megjelenési formához, amelyet pontos reprodukció alapjaként használnak, amely egy nagyobb megjelenési forma megkülönböztethető alkotóeleme. @hu
toolkit label: hasonmás része: @hu
toolkit definition: Egy megjelenési forma, amely egy pontos reprodukció alapjaként használnak, amely egy nagyobb megjelenési forma megkülönböztethető alkotóeleme. @hu
alternative label: facsimile container of
label: näköispainososa @fi
label: har faksimile som del @no
definition: Relaterer en manifestasjon til en manifestasjon som er en tro kopi av en del av en annen manifestasjon. @no
label: heeft facsimile deel @nl
definition: Relateert een manifestatie aan een manifestatie die exact gereproduceerd is als onderdeel van een andere manifestatie. @nl
label: له جزء طبق الأصل @ar
definition: يربط بين تجسيدة وتجسيدة أعيد إنتاجها طبق الأصل كجزء من تجسيدة أخرى. @ar
toolkit label: جزء طبق الأصل @ar
toolkit definition: تجسيدة أعيد إنتاجها طبق الأصل كجزء من تجسيدة أخرى @ar
label: faksiimile osa @et
definition: Seostab kehastuse kehastusega, mis on täpselt reprodutseeritud kui teise kehastuse osa. @et
toolkit label: faksiimile osa @et
toolkit definition: Kehastus, mis on täpselt reprodutseeritud kui teise kehastuse osa. @et
label: hat enthaltenes Faksimile von @de
alternative label: Enthält Faksimile von @de
label: ha come parte di facsimile @it
definition: Correla una manifestazione a una manifestazione riprodotta esattamente come parte di un'altra manifestazione. @it
toolkit label: parte di facsimile @it
toolkit definition: Manifestazione riprodotta esattamente come parte di un'altra manifestazione. @it
label: faksimila daļa @lv
definition: Sasaista manifestāciju ar manifestāciju, kas ir precīzi reproducēta kā citas citas manifestācijas daļa. @lv
toolkit label: faksimila daļa @lv
toolkit definition: Manifestācija, kas ir precīzi reproducēta kā citas citas manifestācijas daļa. @lv
alternative label: نسخة طبق الأصل حاوية لـ @ar
alternative label: faksimile container af @da
alternative label: contenidor facsímil de @ca
alternative label: ……的摹真品整体 @zh-hans
label: 有摹真品部分 @zh-hans
definition: 将一种载体表现与被精确复制为另一种载体表现之部分的一种载体表现关联起来。 @zh-hans
toolkit label: 摹真品部分 @zh-hans
toolkit definition: 被精确复制为另一种载体表现之部分的一种载体表现 @zh-hans
alternative label: contenedor facsímil de @es

is facsimile part of
status: Published
definition: Relates a manifestation to a manifestation that is a part manifestation that exactly reproduces another manifestation.
type: Property
domain: C10007
sub property of: is part of manifestation
lexical alias: facsimilePartOf.en
toolkit label: facsimile part of
toolkit definition: A manifestation that is a part manifestation that exactly reproduces another manifestation.
label: est une partie de fac-similé de @fr
definition: Met une manifestation en relation avec une manifestation qui est une partie de manifestation et qui reproduit exactement une autre manifestation. @fr
toolkit label: partie de fac-similé de @fr
toolkit definition: Manifestation qui est une partie de manifestation et qui reproduit exactement une autre manifestation. @fr
toolkit label: parte facsímil de @es
toolkit definition: Una manifestación que es una manifestación en parte que reproduce exactamente otra manifestación. @es
instruction number: 24.5
toolkit label: facsimile deel van @nl
toolkit definition: Een manifestatie die een deelmanifestatie is dat een andere manifestatie exact reproduceert. @nl
label: là bản sao được chứa trong @vi
definition: Liên kết biểu thị với biểu thị lớn hơn mà phần là bộ phận cấu thành tách biệt tạo lại chính xác biểu thị khác thể hiện cùng biểu hiện của tác phẩm. @vi
toolkit label: bản sao được chứa trong @vi
toolkit definition: Biểu thị lớn hơn mà phần là bộ phận cấu thành tách biệt tạo lại chính xác biểu thị khác thể hiện cùng biểu hiện của tác phẩm. @vi
label: er faksimile del af @da
definition: Relaterer en manifestation til en manifestation, som er en delmanifestation, som nøjagtigt gengiver en anden manifestation. @da
toolkit label: faksimile del af @da
toolkit definition: Manifestation, som er en delmanifestation, som nøjagtigt gengiver en anden manifestation. @da
label: ist Faksimile als Teil von @de
definition: Setzt eine Manifestation in Beziehung zu einer Manifestation, die eine Teil-Manifestation einer anderen Manifestation ist, die diese exakt reproduziert. @de
toolkit label: Faksimile als Teil von @de
toolkit definition: Eine Manifestation, die eine Teil-Manifestation einer anderen Manifestation ist, die diese exakt reproduziert. @de
label: és part de facsímil de @ca
definition: Relaciona una manifestació amb una manifestació que és una manifestació de part que reprodueix exactament una altra manifestació. @ca
toolkit label: part de facsímil de @ca
toolkit definition: Manifestació que és una manifestació de part que reprodueix exactament una altra manifestació. @ca
definition: Liittää manifestaation manifestaatioon, jonka osa on täsmällinen jäljennös toisesta manifestaatiosta. @fi
toolkit label: näköispainososa sisältyy manifestaatioon @fi
toolkit definition: Manifestaatio, jonka osa on täsmällinen jäljennös toisesta manifestaatiosta. @fi
toolkit label: faksimile som del av @no
toolkit definition: En manifestasjon som er en del av en manifestasjon som eksakt gjengir en annen manifestasjon. @no
label: είναι ομοιότυπο που περιέχεται σε @el
definition: Συνδέει μια εκδήλωση με μια μεγαλύτερη εκδήλωση της οποίας ένα μέρος συνιστά ένα διακριτό συστατικό, το οποίο αναπαράγει με ακρίβεια μια άλλη εκδήλωση που ενσωματώνει την ίδια έκφραση ενός έργου. @el
toolkit label: ομοιότυπο περιέχεται σε @el
toolkit definition: Μια μεγαλύτερη εκδήλωση της οποίας ένα μέρος συνιστά ένα διακριτό συστατικό, το οποίο αναπαράγει με ακρίβεια μια άλλη εκδήλωση που ενσωματώνει την ίδια έκφραση ενός έργου. @el
has element type: 2
label: hasonmásrésze a következőnek: @hu
definition: Egy megjelenési formát hozzákapcsol egy nagyobb megjelenési formához, amelynek egy része különálló alkotóelem, amely pontosan újraalkot egy másik megjelenési formát, amely egy műnek ugyanazt a kifejezési formáját testesíti meg. @hu
toolkit label: hasonmásrésze: @hu
toolkit definition: Egy nagyobb megjelenési forma, amelynek egy része különálló alkotóelem, amely pontosan reprodukál egy mű ugyanazon kifejezési formáját megtestesítő másik megjelenési formát. @hu
alternative label: facsimile contained in
label: näköispainososa sisältyy manifestaatioon @fi
label: har faksimile som del av @no
definition: Relaterer en manifestasjon til en manifestasjon som er en del av en manifestasjon som eksakt gjengir en annen manifestasjon. @no
label: is facsimile deel van @nl
definition: Relateert een manifestatie aan een manifestatie die een deelmanifestatie is dat een andere manifestatie exact reproduceert. @nl
label: هو جزء طبق الأصل لـ @ar
definition: يربط بين تجسيدة وتجسيدة تكون تجسيدة لجزء يعد استنساخًا تامًا لتجسيدة أخرى. @ar
toolkit label: جزء طبق الأصل لـ @ar
toolkit definition: تجسيدة تكون تجسيدة لجزء يعد استنساخًا تامًا لتجسيدة أخرى. @ar
label: faksiimile sisaldub kehastuses @et
definition: Seostab kehastuse kehastuse osaga, mis on teise kehastuse täpne reproduktsioon. @et
toolkit label: faksiimile sisaldub kehastuses @et
toolkit definition: Kehastuse osa, mis on teise kehastuse täpne reproduktsioon. @et
label: è parte facsimilare di @it
definition: Correla una manifestazione a una manifestazione che è una parte di manifestazione che riproduce esattamente un'altra manifestazione. @it
toolkit label: parte facsimilare di @it
toolkit definition: Manifestazione che è una parte di manifestazione che riproduce esattamente un'altra manifestazione. @it
label: ir faksimila daļa @lv
definition: Sasaista manifestāciju ar manifestāciju, kas ir manisfestācijas daļa, kas precīzi reproducē citu manifestāciju. @lv
toolkit label: ir faksimila daļa @lv
toolkit definition: Manifestācija, kas ir manisfestācijas daļa, kas precīzi reproducē citu manifestāciju. @lv
alternative label: näköispainos sisältyy manifestaatioon @fi
alternative label: نسخة طبق الأصل مُحتواه في @ar
alternative label: faksimile indeholdt i @da
alternative label: Faksimile enthalten in @de
alternative label: facsímil contingut en @ca
alternative label: 包含于……的摹真品 @zh-hans
label: 是……的摹真品部分 @zh-hans
definition: 将一种载体表现与作为精确复制另一种载体表现的一个部分载体表现的一种载体表现关联起来。 @zh-hans
toolkit label: ……的摹真品部分 @zh-hans
toolkit definition: 作为精确复制另一种载体表现的一个部分载体表现的一种载体表现 @zh-hans

has mount
status: Published
definition: Relates a manifestation to a physical material used for the support or backing to which the base material of a manifestation has been attached.
type: Property
domain: C10007
lexical alias: mount.en
instruction number: 3.8
toolkit label: mount
toolkit definition: A physical material used for the support or backing to which the base material of a manifestation has been attached.
label: a pour monture @fr
definition: Met une manifestation en relation avec un matériau physique utilisé pour le support ou le renforcement, sur lequel le matériau de base d’une manifestation a été fixé. @fr
toolkit label: monture @fr
toolkit definition: Matériau physique utilisé pour le support ou le renforcement, sur lequel le matériau de base d’une manifestation a été fixé. @fr
toolkit label: montaje @es
toolkit definition: Un material físico utilizado como soporte o respaldo al que se ha adherido el material base de una manifestación. @es
label: har montering @sv
toolkit label: montering @sv
toolkit label: ondersteuning @nl
toolkit definition: Een fysiek materiaal gebruikt als steun of ondergrond waaraan het basismateriaal van een resource is bevestigd. @nl
label: có khung @vi
definition: Liên kết biểu thị với vật liệu vật lý được sử dụng để hỗ trợ hoặc đỡ mà vật liệu cơ sở của biểu thị được gắn vào. @vi
toolkit label: khung @vi
toolkit definition: Vật liệu vật lý được sử dụng để hỗ trợ hoặc đỡ mà vật liệu cơ sở của biểu thị được gắn vào. @vi
label: har monteringskarton @da
definition: Relaterer en manifestation til et fysisk materiale, som udgør den støtte eller bagbeklædning, som en manifestations basismateriale er fastgjort på. @da
toolkit label: monteringskarton @da
toolkit definition: Fysisk materiale, som udgør den støtte eller bagbeklædning, som en manifestations basismateriale er fastgjort på. @da
label: hat Halterung @de
definition: Setzt eine Manifestation in Beziehung zu einem physischen Material, das für die Halterung oder die Stütze verwendet wird, an dem das Trägermaterial einer Manifestation angebracht ist. @de
toolkit label: Halterung @de
toolkit definition: Ein physisches Material, das für die Halterung oder die Stütze verwendet wird, an dem das Trägermaterial einer Manifestation angebracht ist. @de
label: té com a muntura @ca
definition: Relaciona una manifestació amb un material físic usat de suport o de reforçament al qual s’ha subjectat el material de base d’una manifestació. @ca
toolkit label: muntura @ca
toolkit definition: Material físic usat de suport o de reforçament al qual s’ha subjectat el material de base d’una manifestació. @ca
definition: Liittää manifestaation materiaaliin, johon aineiston pohjamateriaali kiinnitetään manifestaation tukemiseksi tai kannattamiseksi. @fi
toolkit label: tukimateriaali @fi
toolkit definition: Materiaali, johon aineiston pohjamateriaali kiinnitetään manifestaation tukemiseksi tai kannattamiseksi. @fi
toolkit label: underlag eller ramme @no
toolkit definition: Et fysisk materiale som brukes som støtte eller bakgrunn og som basismaterialet til en manifestasjon er festet til. @no
label: έχει βάση στήριξης @el
definition: Συνδέει μια εκδήλωση με ένα φυσικό υλικό το οποίο χρησιμοποιείται για τη στήριξη ή την υποστήριξη με το οποίο έχει συνδεθεί το βασικό υλικό μιας εκδήλωσης. @el
toolkit label: βάση στήριξης @el
toolkit definition: Ένα φυσικό υλικό το οποίο χρησιμοποιείται για τη στήριξη ή την υποστήριξη με το οποίο έχει συνδεθεί το βασικό υλικό μιας εκδήλωσης. @el
has element type: 4
label: foglalata a következő: @hu
definition: Hozzákapcsol egy megjelenési formát egy fizikai anyaghoz, amelyet tartóként vagy támaszként használnak, amelyhez egy forrás alapanyagát csatolták. @hu
toolkit label: foglalata: @hu
toolkit definition: Egy fizikai anyag, amelyet tartóként vagy támaszként használnak, amelyhez egy forrás alapanyagát csatolták. @hu
label: tukimateriaali @fi
label: har underlag eller ramme @no
definition: Relaterer en manifestasjon til et fysisk materiale som brukes som støtte eller bakgrunn og som basismaterialet til en manifestasjon er festet til. @no
label: heeft ondersteuning @nl
definition: Relateert een manifestatie aan een fysiek materiaal gebruikt als steun of ondergrond waaraan het basismateriaal van een resource is bevestigd. @nl
label: له حامل @ar
definition: يربط بين تجسيدة ومادة مادية تستخدم في التدعيم أو السند لمادة القاعدة التي تكون تجسيدة ملصقة بها. @ar
toolkit label: حامل @ar
toolkit definition: مادة مادية تستخدم في التدعيم أو السند لمادة القاعدة التي تكون تجسيدة ملصقة بها. @ar
label: tugimaterjal @et
definition: Seostab kehastuse toestava materjaliga, mille külge on kinnitatud kehastuse alusmaterjal. @et
toolkit label: tugimaterjal @et
toolkit definition: Toestav materjal, mille külge on kinnitatud kehastuse alusmaterjal. @et
label: ha come montatura @it
definition: Correla una manifestazione al materiale fisico utilizzato come supporto o sostegno al quale si fissa il materiale di base di una manifestazione. @it
toolkit label: montatura @it
toolkit definition: Materiale fisico utilizzato come supporto o sostegno al quale si fissa il materiale di base di una manifestazione. @it
label: balsts/paliktnis @lv
definition: Sasaista manifestāciju ar materiālu, ko lieto atbalstam vai kā paliktni, pie kura piestiprināts manifestācijas pamatmateriāls. @lv
toolkit label: balsts/paliktnis @lv
toolkit definition: Materiāls, ko lieto atbalstam vai kā paliktni, pie kura piestiprināts manifestācijas pamatmateriāls. @lv
label: 有衬底/底座 @zh-hans
definition: 将一种载体表现与用于支撑或背衬的载体表现的基底材料所附着的物理材料关联起来。 @zh-hans
toolkit label: 衬底/底座 @zh-hans
toolkit definition: 用于支撑或背衬的载体表现的基底材料所附着的物理材料 @zh-hans
label: montaj malzemesi ile ilişkilidir @tr
definition: Bir gösterimi, bir gösterimin temel malzemesinin eklendiği destek veya arkalık için kullanılan fiziksel bir malzeme ile ilişkilendirir. @tr
toolkit label: dayanak @tr
toolkit definition: Bir gösterimin temel malzemesinin eklendiği destek veya zemin için kullanılan fiziksel bir malzeme. @tr
label: tiene montaje @es
definition: Relaciona una manifestación con un material físico utilizado como soporte o respaldo al que se ha adherido el material base de una manifestación. @es

has details of mount
status: Published
type: Property
lexical alias: detailsOfMount.en
definition: Relates a manifestation to details of a physical material that is used for the support or backing to which the base material of a manifestation has been attached.
domain: C10007
instruction number: 3.8.1.4
toolkit label: details of mount
toolkit definition: Details of a physical material that is used for the support or backing to which the base material of a manifestation has been attached.
toolkit label: detalles de montaje @es
toolkit definition: Detalles de un material físico que se utiliza como soporte o respaldo al que se ha adherido el material base de una manifestación. @es
label: har detaljerad information om montering @sv
toolkit label: detaljerad information om montering @sv
toolkit label: details van ondersteuning @nl
toolkit definition: Details van een fysiek materiaal gebruikt als steun of ondergrond waaraan het basismateriaal van een resource is bevestigd. @nl
label: có chi tiết của khung @vi
definition: Liên kết biểu thị với chi tiết của vật liệu vật lý được sử dụng để hỗ trợ hoặc đỡ mà vật liệu cơ sở của biểu thị được gắn vào. @vi
toolkit label: chi tiết của khung @vi
toolkit definition: Chi tiết của vật liệu vật lý được sử dụng để hỗ trợ hoặc đỡ mà vật liệu cơ sở của biểu thị được gắn vào. @vi
label: har detaljer om monteringskarton @da
definition: Relaterer en manifestation til detaljer om det fysiske materiale, som udgør den støtte eller bagbeklædning, som en manifestations basismateriale er fastgjort på. @da
toolkit label: detaljer om monteringskarton @da
toolkit definition: Detaljer om det fysiske materiale, som udgør den støtte eller bagbeklædning, som en manifestations basismateriale er fastgjort på. @da
label: hat Details zur Halterung @de
definition: Setzt eine Manifestation in Beziehung zu den Details zu dem physischen Material, das für die Halterung oder die Stütze verwendet wird, an dem das Trägermaterial einer Manifestation angebracht ist. @de
toolkit label: Details zur Halterung @de
toolkit definition: Details zu dem physischen Material, das für die Halterung oder die Stütze verwendet wird, an dem das Trägermaterial einer Manifestation angebracht ist. @de
label: té com a particularitats de muntura @ca
definition: Relaciona una manifestació amb les particularitats d’un material físic que s’usa de suport o de reforçament al qual s’ha subjectat el material de base d’una manifestació. @ca
toolkit label: particularitats de muntura @ca
toolkit definition: Particularitats d’un material físic que s’usa de suport o de reforçament al qual s’ha subjectat el material de base d’una manifestació. @ca
definition: Liittää manifestaation tarkempiin tietoihin materiaalista, johon manifestaation pohjamateriaali kiinnitetään aineiston tukemiseksi tai kannattamiseksi. @fi
toolkit label: tukimateriaalin tarkemmat tiedot @fi
toolkit definition: Tarkemmat tiedot materiaalista, johon manifestaation pohjamateriaali kiinnitetään aineiston tukemiseksi tai kannattamiseksi. @fi
toolkit label: detaljer vedrørende underlag eller ramme @no
toolkit definition: Detaljer vedrørende det fysiske materialet som er brukt som støtte eller bakgrunn og som basismaterialet til en manifestasjon er festet til. @no
label: έχει λεπτομέρειες της βάσης στήριξης @el
definition: Συνδέει μια εκδήλωση με τις λεπτομέρειες ενός φυσικού υλικού το οποίο χρησιμοποιείται για τη στήριξη ή την υποστήριξη, με το οποίο έχει συνδεθεί το βασικό υλικό μιας εκδήλωσης. @el
toolkit label: λεπτομέρειες της βάσης στήριξης @el
toolkit definition: Λεπτομέρειες ενός φυσικού υλικού που χρησιμοποιείται για τη στήριξη ή την υποστήριξη, με το οποίο έχει συνδεθεί το βασικό υλικό μιας εκδήλωσης. @el
label: a pour particularités d’une monture @fr
definition: Met une manifestation en relation avec des particularités d’un matériau physique qui est utilisé pour le support ou le renforcement, sur lequel le matériau de base d’une manifestation a été fixé. @fr
toolkit label: particularités d’une monture @fr
toolkit definition: Particularités d’un matériau physique qui est utilisé pour le support ou le renforcement, sur lequel le matériau de base d’une manifestation a été fixé. @fr
has element type: 6
label: foglalat részletei a következők: @hu
definition: Hozzákapcsol egy megjelenési formát egy megjelenési forma alapanyagához csatolt tartóként vagy támaszként használt fizikai anyag részleteihez. @hu
toolkit label: foglalat részletei: @hu
toolkit definition: Egy megjelenési forma alapanyagához csatolt tartóként vagy támaszként használt fizikai anyag részletei. @hu
label: tukimateriaalin tarkemmat tiedot @fi
label: har detaljer vedrørende underlag eller ramme @no
definition: Relaterer en manifestasjon til detaljer vedrørende det fysiske materialet som er brukt som støtte eller bakgrunn og som basismaterialet til en manifestasjon er festet til. @no
label: heeft details van ondersteuning @nl
definition: Relateert een manifestatie aan details van een fysiek materiaal gebruikt als steun of ondergrond waaraan het basismateriaal van een resource is bevestigd. @nl
label: له تفاصيل عن حامل @ar
definition: يربط بين تجسيدة وتفاصيل مادة مادية مستخدمة في التدعيم أو السند لمادة القاعدة التي تكون تجسيدة ملصقة بها. @ar
toolkit label: تفاصيل عن حامل @ar
toolkit definition: تفاصيل مادة مادية مستخدمة في التدعيم أو السند لمادة القاعدة التي تكون تجسيدة ملصقة بها. @ar
label: tugimaterjali täpsustus @et
definition: Seostab kehastuse täpsemate andmetega toestava materjali kohta, mille külge on kinnitatud kehastuse alusmaterjal. @et
toolkit label: tugimaterjali täpsustus @et
toolkit definition: Täpsemad andmed toestava materjali kohta, mille külge on kinnitatud kehastuse alusmaterjal. @et
label: ha come particolari relativi alla montatura @it
definition: Correla una manifestazione ai particolari relativi a un materiale fisico utilizzato come supporto o sostegno al quale si fissa il materiale di base di una manifestazione. @it
toolkit label: particolari relativi alla montatura @it
toolkit definition: Particolari relativi a un materiale fisico utilizzato come supporto o sostegno al quale si fissa il materiale di base di una manifestazione. @it
label: detalizēti par balstu/paliktni @lv
definition: Sasaista manifestāciju ar sīkāku informāciju par materiālu, ko lieto atbalstam vai kā paliktni, uz kura piestiprināts manifestācijas pamatmateriāls. @lv
toolkit label: detalizēti par balstu/paliktni @lv
toolkit definition: Sīkāka informācija par materiālu, ko lieto atbalstam vai kā paliktni, uz kura piestiprināts manifestācijas pamatmateriāls. @lv
label: 有衬底/底座细节 @zh-hans
definition: 将一种载体表现与用于支撑或背衬的载体表现的基底材料所附着的物理材料的细节关联起来。 @zh-hans
toolkit label: 衬底/底座细节 @zh-hans
toolkit definition: 用于支撑或背衬的载体表现的基底材料所附着的物理材料的细节 @zh-hans
label: montaj ayrıntıları ile ilişkilidir @tr
definition: Bir gösterimi, bir gösterimin temel malzemesinin iliştirildiği destek veya arkalık için kullanılan fiziksel bir malzemenin detaylarıyla ilişkilendirir. @tr
toolkit label: montajın ayrıntıları @tr
toolkit definition: Bir gösterimin temel malzemesinin iliştirildiği destek veya arka yüzey olarak kullanılan fiziksel malzemenin ayrıntıları. @tr
label: tiene detalles de montaje @es
definition: Relaciona una manifestación con detalles de un material físico que se utiliza como soporte o respaldo al que se ha adherido el material base de una manifestación. @es

has file size
status: Published
definition: Relates a manifestation to a number of bytes in a digital file.
type: Property
domain: C10007
sub property of: has digital file characteristic
lexical alias: fileSize.en
instruction number: 3.19.4
toolkit label: file size
toolkit definition: A number of bytes in a digital file.
label: a pour taille de fichier @fr
definition: Met une manifestation en relation avec un nombre d’octets d’un fichier numérique. @fr
toolkit label: taille de fichier @fr
toolkit definition: Nombre d’octets d’un fichier numérique. @fr
toolkit label: tamaño de archivo @es
toolkit definition: Una cantidad de bytes en un archivo digital. @es
label: har filstorlek @sv
toolkit label: filstorlek @sv
toolkit label: bestandsgrootte @nl
toolkit definition: Een aantal bytes in een digitaal bestand. @nl
label: có cỡ tệp @vi
definition: Liên kết biểu thị với số lượng byte trong tệp số. @vi
toolkit label: cỡ tệp @vi
toolkit definition: Số lượng byte trong tệp số. @vi
label: har filstørrelse @da
definition: Relaterer en manifestation til antal bytes i en digital fil. @da
toolkit label: filstørrelse @da
toolkit definition: Antal bytes i en digital fil. @da
label: hat Dateigröße @de
definition: Setzt eine Manifestation in Beziehung zu einer Anzahl der Bytes in einer Datei. @de
toolkit label: Dateigröße @de
toolkit definition: Eine Anzahl der Bytes in einer Datei. @de
label: té com a mida de fitxer @ca
definition: Relaciona una manifestació amb un nombre de bytes d’un fitxer digital. @ca
toolkit label: mida de fitxer @ca
toolkit definition: Nombre de bytes d’un fitxer digital. @ca
definition: Liittää manifestaation digitaalisen tiedoston tavujen määrään. @fi
toolkit label: tiedostokoko @fi
toolkit definition: Digitaalisen tiedoston tavujen määrä. @fi
toolkit definition: Et antall bytes i en digital fil. @no
label: έχει μέγεθος αρχείου @el
definition: Συνδέει μια εκδήλωση με έναν αριθμό δυφιοσυλλαβών σε ένα ψηφιακό αρχείο. @el
toolkit label: μέγεθος αρχείου @el
toolkit definition: Ένας αριθμός δυφιοσυλλαβών σε ένα ψηφιακό αρχείο. @el
has element type: 6
label: fájlmérete a következő: @hu
definition: Hozzákapcsol egy megjelenési formát egy digitális fájl bájtjainak számához. @hu
toolkit label: fájlmérete: @hu
toolkit definition: Egy digitális fájl bájtjainak száma. @hu
label: tiedostokoko @fi
definition: Relaterer en manifestasjon til et antall bytes i en digital fil. @no
label: heeft bestandsgrootte @nl
definition: Relateert een manifestatie aan een aantal bytes in een digitaal bestand. @nl
label: له حجم الملف @ar
definition: يربط بين تجسيدة وعدد البايتات في ملف رقمي. @ar
toolkit label: حجم الملف @ar
toolkit definition: عدد البايتات في ملف رقمي. @ar
label: faili suurus @et
definition: Seostab kehastuse failis sisalduvate baitide arvuga. @et
toolkit label: faili suurus @et
toolkit definition: Failis sisalduvate baitide arv. @et
label: ha come dimensioni del file @it
definition: Correla una manifestazione a un numero di byte di un file digitale. @it
toolkit label: dimensioni del file @it
toolkit definition: Numero di byte di un file digitale. @it
label: datnes izmērs @lv
definition: Sasaista manifestāciju ar datnes fizisko izmēru (bitos, baitos, kilobaitos, megabaitos u.tml.). @lv
toolkit label: datnes izmērs @lv
toolkit definition: Datnes fiziskais izmērs (bitos, baitos, kilobaitos, megabaitos u.tml.). @lv
label: 有文件大小 @zh-hans
definition: 将一种载体表现与一个数字文件中的字节数关联起来。 @zh-hans
toolkit label: 文件大小 @zh-hans
toolkit definition: 一个数字文件中的字节数 @zh-hans
label: dosya boyutu ile ilişkilidir @tr
definition: Bir gösterimi, dijital bir dosyadaki birkaç bayt ile ilişkilendirir. @tr
toolkit label: dosya boyutu @tr
toolkit definition: Dijital bir dosyadaki bayt sayısı. @tr
label: tiene tamaño de archivo @es
definition: Relaciona una manifestación con una cantidad de bytes en un archivo digital. @es
has subproperty: P30183

has file type
status: Published
definition: Relates a manifestation to a general type of data content encoded in a computer file.
type: Property
domain: C10007
sub property of: has digital file characteristic
lexical alias: fileType.en
instruction number: 3.19.2
toolkit label: file type
toolkit definition: A general type of data content encoded in a computer file.
label: a pour type de fichier @fr
definition: Met une manifestation en relation avec un type général de contenu des données encodées dans un fichier informatique. @fr
toolkit label: type de fichier @fr
toolkit definition: Type général de contenu des données encodées dans un fichier informatique. @fr
toolkit label: tipo de archivo @es
toolkit definition: Un tipo general de contenido de datos codificado en un archivo de computadora. @es
label: har filtyp @sv
toolkit label: filtyp @sv
toolkit label: bestandstype @nl
toolkit definition: Een algemeen type data gecodeerd in een computerbestand. @nl
label: có loại tệp @vi
definition: Liên kết biểu thị với loại chung của nội dung dữ liệu được lập mã trong tệp máy tính. @vi
toolkit label: loại tệp @vi
toolkit definition: Loại chung của nội dung dữ liệu được lập mã trong tệp máy tính. @vi
label: har filtype @da
definition: Relaterer en manifestation til en type af dataindhold, som er kodet i en computerfil. @da
toolkit label: filtype @da
toolkit definition: Type af dataindhold, som er kodet i en computerfil. @da
label: hat Dateityp @de
definition: Setzt eine Manifestation in Beziehung zu einer allgemeinen Art von Dateninhalt, der in einer Datei kodiert ist. @de
toolkit label: Dateityp @de
toolkit definition: Eine allgemeine Art von Dateninhalt, der in einer Datei kodiert ist. @de
label: té com a tipus de fitxer @ca
definition: Relaciona una manifestació amb un tipus general de contingut de les dades codificades en un fitxer informàtic. @ca
toolkit label: tipus de fitxer @ca
toolkit definition: Tipus general de contingut de les dades codificades en un fitxer informàtic. @ca
definition: Liittää manifestaation tiedostoon koodatun datasisällön yleiseen tyyppiin. @fi
toolkit label: tiedostotyyppi @fi
toolkit definition: Tiedostoon koodatun datasisällön yleinen tyyppi. @fi
toolkit definition: En generell type datainnhold kodet i en datafil. @no
label: έχει τύπο του αρχείου @el
definition: Συνδέει μια εκδήλωση με έναν γενικό τύπο των δεδομένων περιεχομένου, κωδικοποιημένων σε ένα αρχείο ηλεκτρονικού υπολογιστή . @el
toolkit label: τύπος αρχείου @el
toolkit definition: Ένας γενικός τύπος των δεδομένων περιεχομένου, κωδικοποιημένων σε ένα αρχείο ηλεκτρονικού υπολογιστή . @el
has element type: 4
label: fájltípusa a következő: @hu
definition: Hozzákapcsol egy megjelenési formát egy számítógépes fájlban kódolt adattartalom általános típusához. @hu
toolkit label: fájltípusa: @hu
toolkit definition: Egy számítógépes fájlban kódolt adattartalom általános típusa. @hu
label: tiedostotyyppi @fi
definition: Relaterer en manifestasjon til en generell type datainnhold kodet i en datafil. @no
label: heeft bestandstype @nl
definition: Relateert een manifestatie aan een algemeen type data gecodeerd in een computerbestand. @nl
label: له نوع الملف @ar
definition: يربط بين تجسيدة ونوع عام لمحتوى البيانات المكودة في ملف كمبيوتر. @ar
toolkit label: نوع الملف @ar
toolkit definition: نوع عام لمحتوى البيانات المكودة في ملف كمبيوتر. @ar
label: faili tüüp @et
definition: Seostab kehastuse failis kodeeritud andmesisu üldise tüübiga. @et
toolkit label: faili tüüp @et
toolkit definition: Failis kodeeritud andmesisu üldine tüüp. @et
label: ha come tipo di file @it
definition: Correla una manifestazione a un tipo generale di contenuto di dati codificati in un file per computer. @it
toolkit label: tipo di file @it
toolkit definition: Tipo generale di contenuto di dati codificati in un file per computer. @it
label: datnes tips @lv
definition: Sasaista manifestāciju ar datnē glabāto datu pamattipu. @lv
toolkit label: datnes tips @lv
toolkit definition: Datnē glabāto datu pamattips. @lv
label: 有文件类型 @zh-hans
definition: 将一种载体表现与计算机文件中编码的数据内容的一般类型关联起来。 @zh-hans
toolkit label: 文件类型 @zh-hans
toolkit definition: 计算机文件中编码的数据内容的一般类型 @zh-hans
label: dosya türü ile ilişkilidir @tr
definition: Bir gösterimi, bir bilgisayar dosyasında kodlanan genel bir veri içeriği türüyle ilişkilendirir. @tr
toolkit label: dosya türü @tr
toolkit definition: Bir bilgisayar dosyasında kodlanmış genel bir veri içeriği türü. @tr
label: tiene tipo de archivo @es
definition: Relaciona una manifestación con un tipo general de contenido de datos codificado en un archivo de computadora. @es
has subproperty: P30018

has details of file type
status: Published
type: Property
lexical alias: detailsOfFileType.en
definition: Relates a manifestation to details of a general type of data content that is encoded in a computer file.
domain: C10007
instruction number: 3.19.2.4
toolkit label: details of file type
toolkit definition: Details of a general type of data content that is encoded in a computer file.
toolkit label: detalles del tipo de archivo @es
toolkit definition: Detalles de un tipo general de contenido de datos que está codificado en un archivo informático. @es
sub property of: has details of digital file characteristic
label: har detaljerad information om filtyp @sv
toolkit label: detaljerad information om filtyp @sv
toolkit label: details van bestandstype @nl
toolkit definition: Details van een algemeen type data gecodeerd in een computerbestand. @nl
label: có chi tiết của kiểu tệp @vi
definition: Liên kết biểu thị với chi tiết của loại chung của nội dung dữ liệu được lập mã trong tệp máy tính. @vi
toolkit label: chi tiết của kiểu tệp @vi
toolkit definition: Chi tiết của loại chung của nội dung dữ liệu được lập mã trong tệp máy tính. @vi
label: har detaljer om filtype @da
definition: Relaterer en manifestation til detaljer om en type af dataindhold, som er kodet i en computerfil. @da
toolkit label: detaljer om filtype @da
toolkit definition: Detaljer om en type af dataindhold, som er kodet i en computerfil. @da
label: hat Details zum Dateityp @de
definition: Setzt eine Manifestation in Beziehung zu den Details zu einer allgemeinen Art von Dateninhalt, der in einer Datei kodiert ist. @de
toolkit label: Details zum Dateityp @de
toolkit definition: Details zu einer allgemeinen Art von Dateninhalt, der in einer Datei kodiert ist. @de
label: té com a particularitats de tipus de fitxer @ca
definition: Relaciona una manifestació amb les particularitats d’un tipus general de contingut de les dades que es codifiquen en un fitxer informàtic. @ca
toolkit label: particularitats de tipus de fitxer @ca
toolkit definition: Particularitats d’un tipus general de contingut de les dades que es codifiquen en un fitxer informàtic. @ca
definition: Liittää manifestaation tarkempiin tietoihin tiedostoon koodatun datasisällön yleisestä tyypistä. @fi
toolkit label: tiedostotyypin tarkemmat tiedot @fi
toolkit definition: Tarkemmat tiedot tiedostoon koodatun datasisällön yleisestä tyypistä. @fi
toolkit label: detaljer vedrørende filtype @no
toolkit definition: Detaljer vedrørende en generell type datainnhold som er kodet i en datafil. @no
label: έχει λεπτομέρειες του τύπου του αρχείου @el
definition: Συνδέει μια εκδήλωση με τις λεπτομέρειες ενός γενικού τύπου δεδομένων περιεχομένου κωδικοποιημένων σε ένα αρχείο ηλεκτρονικού υπολογιστή. @el
toolkit label: λεπτομέρειες του τύπου του αρχείου @el
toolkit definition: Λεπτομέρειες ενός γενικού τύπου δεδομένων περιεχομένου κωδικοποιημένων σε ένα αρχείο ηλεκτρονικού υπολογιστή. @el
label: a pour particularités d’un type de fichier @fr
definition: Met une manifestation en relation avec des particularités d’un type général de contenu des données encodées dans un fichier informatique. @fr
toolkit label: particularités d’un type de fichier @fr
toolkit definition: Particularités d’un type général de contenu des données encodées dans un fichier informatique. @fr
has element type: 6
label: fájltípus részletei a következők: @hu
definition: Hozzákapcsol egy megjelenési formát egy számítógépes fájlban kódolt adattartalom általános típusának részleteihez. @hu
toolkit label: fájltípus részletei: @hu
toolkit definition: Egy számítógépes fájlban kódolt adattartalom általános típusának részletei. @hu
label: tiedostotyypin tarkemmat tiedot @fi
label: har detaljer vedrørende filtype @no
definition: Relaterer en manifestasjon til detaljer vedrørende en generell type datainnhold som er kodet i en datafil. @no
label: heeft details van bestandstype @nl
definition: Relateert een manifestatie aan details van een algemeen type data gecodeerd in een computerbestand. @nl
label: له تفاصيل نوع الملف @ar
definition: يربط بين تجسيدة وتفاصيل نوع عام لمحتوى بيانات يتم تكويدها في ملف كمبيوتر. @ar
toolkit label: تفاصيل نوع الملف @ar
toolkit definition: تفاصيل نوع عام لمحتوى بيانات يتم تكويدها في ملف كمبيوتر. @ar
label: faili tüübi täpsustus @et
definition: Seostab kehastuse täpsemate andmetega failis kodeeritud andmesisu üldise tüübi kohta. @et
toolkit label: faili tüübi täpsustus @et
toolkit definition: Täpsemad andmed failis kodeeritud andmesisu üldise tüübi kohta. @et
label: ha come particolari relativi al tipo di file @it
definition: Correla una manifestazione ai particolari relativi a un tipo generale di contenuto di dati codificati in un file per computer. @it
toolkit label: particolari relativi al tipo di file @it
toolkit definition: Particolari relativi a un tipo generale di contenuto di dati codificati in un file per computer. @it
label: detalizēti par datnes tipu @lv
definition: Sasaista manifestāciju ar sīkāku informāciju par datnē iekodēto datu satura tipu. @lv
toolkit label: detalizēti par datnes tipu @lv
toolkit definition: Sīkāka informācija par datnē iekodēto datu satura tipu. @lv
label: 有文件类型细节 @zh-hans
definition: 将一种载体表现与计算机文件中编码的数据内容的一般类型的细节关联起来。 @zh-hans
toolkit label: 文件类型细节 @zh-hans
toolkit definition: 计算机文件中编码的数据内容的一般类型的细节 @zh-hans
label: dosya türünün ayrıntıları ile ilişkilidir @tr
definition: Bir gösterimi, bilgisayar dosyasında kodlanan genel bir veri içeriği türünün ayrıntılarıyla ilişkilendirir. @tr
toolkit label: dosya türü ayrıntıları @tr
toolkit definition: Bir bilgisayar dosyasına kodlanmış veri içeriğinin genel türüne ilişkin ayrıntılar. @tr
label: tiene detalles del tipo de archivo @es

has resolution
status: Published
definition: Relates a manifestation to a clarity or fineness of detail in a digital image, expressed by the measurement of the image in pixels, etc.
type: Property
domain: C10007
sub property of: has digital file characteristic
lexical alias: resolution.en
instruction number: 3.19.5
toolkit label: resolution
toolkit definition: A clarity or fineness of detail in a digital image, expressed by the measurement of the image in pixels, etc.
label: a pour résolution @fr
definition: Met une manifestation en relation avec une netteté ou une finesse de détail d’une image numérique, exprimée par la mesure de l’image en pixels, etc. @fr
toolkit label: résolution @fr
toolkit definition: Netteté ou finesse de détail d’une image numérique, exprimée par la mesure de l’image en pixels, etc. @fr
toolkit label: resolución @es
toolkit definition: Una claridad o finura de detalle en una imagen digital, expresada por la medición de la imagen en píxeles, etc. @es
label: har upplösning @sv
toolkit label: upplösning @sv
toolkit label: resolutie @nl
toolkit definition: Een helderheid of verfijning van de details in een digitaal beeld, uitgedrukt in de afmeting van het beeld in pixels etc. @nl
label: có độ phân giải @vi
definition: Liên kết biểu thị với độ rõ hoặc vẻ đẹp của chi tiết trong hình ảnh số, được thể hiện bằng độ đo của hình ảnh theo pixel, v.v... @vi
toolkit label: độ phân giải @vi
toolkit definition: Độ rõ hoặc vẻ đẹp của chi tiết trong hình ảnh số, được thể hiện bằng độ đo của hình ảnh theo pixel, v.v... @vi
label: har opløsning @da
definition: Relaterer en manifestation til et digitalt billedes skarphed eller finhedsgrad, udtrykt som en måling af pixels i et billede etc. @da
toolkit label: opløsning @da
toolkit definition: Digitalt billedes skarphed eller finhedsgrad, udtrykt som en måling af pixels i et billede etc. @da
label: hat Auflösung @de
definition: Setzt eine Manifestation in Beziehung zu einer Klarheit oder einem Feinheitsgrad der Details in einem digitalen Bild, die/der durch die Abmessung des Bilds in Pixeln und so weiter ausgedrückt wird. @de
toolkit label: Auflösung @de
toolkit definition: Eine Klarheit oder ein Feinheitsgrad der Details in einem digitalen Bild, die/der durch die Abmessung des Bilds in Pixeln und so weiter ausgedrückt wird. @de
label: té com a resolució @ca
definition: Relaciona una manifestació amb una claredat o subtilesa de detall d’una imatge digital, expressada per la mesura de la imatge en píxels, etc. @ca
toolkit label: resolució @ca
toolkit definition: Claredat o subtilesa de detall d’una imatge digital, expressada per la mesura de la imatge en píxels, etc. @ca
definition: Liittää manifestaation digitaalisen kuvan tarkkuuteen, joka ilmaistaan pikseleinä tms. @fi
toolkit label: resoluutio @fi
toolkit definition: Digitaalisen kuvan tarkkuus, joka ilmaistaan pikseleinä. @fi
toolkit label: oppløsning @no
toolkit definition: En grad av klarhet eller detaljnivå for et digitalt bilde, uttrykt som bildestørrelse angitt i piksler etc. @no
label: έχει ανάλυση @el
definition: Συνδέει μια εκδήλωση με μια καθαρότητα ή λεπτότητα των λεπτομερειών σε μια ψηφιακή εικόνα, η οποία εκφράζεται μέσω της μέτρησης της εικόνας σε εικονοστοιχεία κ.λπ. @el
toolkit label: ανάλυση @el
toolkit definition: Μια καθαρότητα ή λεπτότητα των λεπτομερειών σε μια ψηφιακή εικόνα η οποία εκφράζεται μέσω της μέτρησης της εικόνας σε εικονοστοιχεία κ.λπ. @el
label: felbontása a következő: @hu
definition: Hozzákapcsol egy megjelenési formát a részletek élességéhez vagy finomságához egy digitális képen, amely a kép pixelben, stb. megadott mértékében fejeződik ki. @hu
toolkit label: felbontása: @hu
toolkit definition: A részletek élessége vagy finomsága egy digitális képen, amely a kép pixelben, stb. megadott mértékében fejeződik ki. @hu
label: resoluutio @fi
label: har oppløsning @no
definition: Relaterer en manifestasjon til en grad av klarhet eller detaljnivå for et digitalt bilde, uttrykt som bildestørrelse angitt i piksler etc. @no
label: heeft resolutie @nl
definition: Relateert een manifestatie aan een helderheid of verfijning van de details in een digitaal beeld, uitgedrukt in de afmeting van het beeld in pixels etc. @nl
label: له درجة وضوح @ar
definition: يربط بين تجسيدة ووضوح أو جودة التفاصيل في صورة رقمية، تم التعبير عنها بمقاييس الصورة بالبكسل، إلخ. @ar
toolkit label: درجة وضوح @ar
toolkit definition: وضوح أو جودة التفاصيل في صورة رقمية، تم التعبير عنها بمقاييس الصورة بالبكسل، إلخ. @ar
label: eraldusvõime @et
definition: Seostab kehastuse digitaalpildi selguse ja detailitäpsusega, mida väljendatakse tavaliselt pildi pikslite arvuga. @et
toolkit label: eraldusvõime @et
toolkit definition: Digitaalpildi selgus ja detailitäpsus, mida väljendatakse tavaliselt pildi pikslite arvuga. @et
label: ha come risoluzione @it
definition: Correla una manifestazione a una limpidezza o precisione del dettaglio di un'immagine digitale, espressa mediante la misurazione dell'immagine in pixel, etc. @it
toolkit label: risoluzione @it
toolkit definition: Correla una manifestazione a una limpidezza o precisione del dettaglio di un'immagine digitale, espressa mediante la misurazione dell'immagine in pixel, etc. @it
label: izšķirtspēja @lv
definition: Sasaista manifestāciju ar digitālā attēla detaļu smalkuma parametru, ko parasti mēra pikseļu u.tml. skaitā collās. @lv
toolkit label: izšķirtspēja @lv
toolkit definition: Digitālā attēla detaļu smalkuma parametrs, ko parasti mēra pikseļu u.tml. skaitā collās. @lv
has element type: 5
label: 有分辨率 @zh-hans
definition: 将一种载体表现与数字图像中由图像像素等的度量表达的细部清晰度或精细度关联起来。 @zh-hans
toolkit label: 分辨率 @zh-hans
toolkit definition: 数字图像中由图像像素等的度量表达的细部清晰度或精细度 @zh-hans
label: çözünürlük ile ilişkilidir @tr
definition: Bir gösterimi, görüntünün piksel vb. cinsinden ölçülmesiyle ifade edilen, bir dijital görüntüdeki ayrıntının netliği veya duyarlılığı ile ilişkilendirir. @tr
toolkit label: çözünürlük @tr
toolkit definition: Görüntünün piksel gibi birimlerle ölçülmesiyle ifade edilen, bir dijital görüntüdeki ayrıntıların netliği veya hassasiyeti. @tr
label: tiene resolución @es

has type of recording
status: Published
definition: Relates a manifestation to a method used to encode audio content for playback.
type: Property
domain: C10007
sub property of: has sound characteristic
lexical alias: typeOfRecording.en
instruction number: 3.16.2
toolkit label: type of recording
toolkit definition: A method used to encode audio content for playback.
label: a pour type d’enregistrement @fr
definition: Met une manifestation en relation avec une méthode utilisée pour encoder un contenu audio pour la lecture. @fr
toolkit label: type d’enregistrement @fr
toolkit definition: Méthode utilisée pour encoder un contenu audio pour la lecture. @fr
toolkit label: tipo de grabación @es
toolkit definition: Un método utilizado para codificar contenido de audio para su reproducción. @es
label: har inspelningstyp @sv
toolkit label: inspelningstyp @sv
toolkit label: opname type @nl
toolkit definition: Een methode gebruikt om audio content te coderen voor afspelen. @nl
label: có kiểu ghi @vi
definition: Liên kết biểu thị với phương pháp được sử dụng để ghi mã nội dung cho phát lại. @vi
toolkit label: kiểu ghi @vi
toolkit definition: Phương pháp được sử dụng để ghi mã nội dung cho phát lại. @vi
label: har type af indspilning @da
definition: Relaterer en manifestation til en metode, som anvendes til at kode lydindhold til afspilning. @da
toolkit label: type af indspilning @da
toolkit definition: Metode, som anvendes til at kode lydindhold til afspilning. @da
label: hat Art einer Aufnahme @de
definition: Setzt eine Manifestation in Beziehung zu einem Verfahren, das zur Kodierung von Audio-Inhalt für die Wiedergabe verwendet wird. @de
toolkit label: Art einer Aufnahme @de
toolkit definition: Ein Verfahren, das zur Kodierung von Audio-Inhalt für die Wiedergabe verwendet wird. @de
label: té com a tipus d’enregistrament @ca
definition: Relaciona una manifestació amb un mètode usat per codificar el contingut àudio per a la reproducció. @ca
toolkit label: tipus d’enregistrament @ca
toolkit definition: Mètode usat per codificar el contingut àudio per a la reproducció. @ca
definition: Liittää manifestaation menetelmään, jota on käytetty äänen tallentamiseksi äänentoistoa varten. @fi
toolkit label: äänen tallennustapa @fi
toolkit definition: Menetelmä, jota on käytetty äänen tallentamiseksi äänentoistoa varten. @fi
toolkit label: type opptak @no
toolkit definition: En metode som er brukt for å kode lydinnhold for avspilling. @no
label: έχει τύπο της ηχογράφησης @el
definition: Συνδέει μια εκδήλωση με μια μέθοδο που χρησιμοποιείται για την κωδικοποίηση ηχητικού περιεχομένου για αναπαραγωγή. @el
toolkit label: τύπος της ηχογράφησης @el
toolkit definition: Μια μέθοδος που χρησιμοποιείται για την κωδικοποίηση ηχητικού περιεχομένου για αναπαραγωγή. @el
has element type: 4
label: felvételtípusa a következő: @hu
definition: Hozzákapcsol egy megjelenési formát egy módszerhez, amelyet audiótartalom kódolásához használnak visszajátszás céljára. @hu
toolkit label: felvételtípusa: @hu
toolkit definition: Visszajátszásra használt módszer a hangtartalom kódolásához. @hu
label: äänen tallennustapa @fi
label: har type opptak @no
definition: Relaterer en manifestasjon til en metode som er brukt for å kode lydinnhold for avspilling. @no
label: heeft opname type @nl
definition: Relateert een manifestatie aan een methode gebruikt om audio content te coderen voor afspelen. @nl
label: له نوع تسجيل @ar
definition: يربط بين تجسيدة وطريقة مستخدمة في تكويد المحتوى الصوتي المطلوب للتشغيل. @ar
toolkit label: نوع تسجيل @ar
toolkit definition: طريقة مستخدمة في تكويد المحتوى الصوتي المطلوب للتشغيل. @ar
label: salvestustüüp @et
definition: Seostab kehastuse meetodiga, mida on kasutatud helisisu kodeerimiseks taasesituse tarbeks. @et
toolkit label: salvestustüüp @et
toolkit definition: Meetod, mida on kasutatud helisisu kodeerimiseks taasesituse tarbeks. @et
label: ha come tipo di registrazione @it
definition: Correla una manifestazione a un metodo utilizzato per la codifica del contenuto audio per la riproduzione. @it
toolkit label: tipo di registrazione @it
toolkit definition: Metodo utilizzato per la codifica del contenuto audio per la riproduzione. @it
label: ieraksta veids @lv
definition: Sasaista manifestāciju ar metodi, kāda lietota audio satura kodēšanai. @lv
toolkit label: ieraksta veids @lv
toolkit definition: Metode, kāda lietota audio satura kodēšanai. @lv
label: 有录音的类型 @zh-hans
definition: 将一种载体表现与用于编码供回放的音频内容的方法关联起来。 @zh-hans
toolkit label: 录音的类型 @zh-hans
toolkit definition: 用于编码供回放的音频内容的方法 @zh-hans
label: kayıt türü ile ilişkilidir @tr
definition: Bir gösterimi, oynatma için ses içeriğini kodlamada kullanılan bir yöntemle ilişkilendirir. @tr
toolkit label: kaydın türü @tr
toolkit definition: Oynatma için ses içeriğini kodlamada kullanılan bir yöntem. @tr
label: tiene tipo de grabación @es

has tape configuration
status: Published
definition: Relates a manifestation to a number of tracks on an audiotape.
type: Property
domain: C10007
sub property of: has sound characteristic
lexical alias: tapeConfiguration.en
instruction number: 3.16.7
toolkit label: tape configuration
toolkit definition: A number of tracks on an audiotape.
label: a pour configuration de bande magnétique @fr
definition: Met une manifestation en relation avec un nombre de pistes sur une bande audio. @fr
toolkit label: configuration de bande magnétique @fr
toolkit definition: Nombre de pistes sur une bande audio. @fr
toolkit label: configuración de cinta @es
toolkit definition: Varias pistas de una cinta de audio. @es
label: har antal spår @sv
toolkit label: antal spår @sv
toolkit label: bandconfiguratie @nl
toolkit definition: Een aantal sporen op een geluidsband. @nl
label: có cấu hình băng @vi
definition: Liên kết biểu thị với số lượng rãnh trên băng audio. @vi
toolkit label: cấu hình băng @vi
toolkit definition: Số lượng rãnh trên băng audio. @vi
label: har båndkonfiguration @da
definition: Relaterer en manifestation til et antal spor på et lydbånd. @da
toolkit label: båndkonfiguration @da
toolkit definition: Antal spor på et lydbånd. @da
label: hat Bandkonfiguration @de
definition: Setzt eine Manifestation in Beziehung zu einer Anzahl der Spuren auf einem Tonband. @de
toolkit label: Bandkonfiguration @de
toolkit definition: Eine Anzahl der Spuren auf einem Tonband. @de
label: té com a configuració de cinta @ca
definition: Relaciona una manifestació amb un nombre de pistes d’una cinta àudio. @ca
toolkit label: configuració de cinta @ca
toolkit definition: Nombre de pistes d’una cinta àudio. @ca
definition: Liittää manifestaation ääninauhalla olevien ääniraitojen lukumäärään. @fi
toolkit label: ääninauhan raitojen määrä @fi
toolkit definition: Ääninauhalla olevien ääniraitojen lukumäärä. @fi
toolkit label: lydbåndkonfigurasjon @no
toolkit definition: Et antall spor på et lydbånd. @no
label: έχει διαμόρφωση μαγνητικής ταινίας @el
definition: Συνδέει μια εκδήλωση με έναν αριθμό κομματιών σε μια ταινία ήχου. @el
toolkit label: διαμόρφωση μαγνητικής ταινίας @el
toolkit definition: Ένας αριθμός κομματιών σε μια ταινία ήχου. @el
has element type: 5
label: felvevőszalag konfigurációja a következő: @hu
definition: Hozzákapcsol egy megjelenési formát a sávok számához egy audiószalagon. @hu
toolkit label: felvevőszalag konfigurációja: @hu
toolkit definition: A sávok száma egy audiószalagon. @hu
label: ääninauhan raitojen määrä @fi
label: har lydbåndkonfigurasjon @no
definition: Relaterer en manifestasjon til et antall spor på et lydbånd. @no
label: heeft bandconfiguratie @nl
definition: Relateert een manifestatie aan een aantal sporen op een geluidsband. @nl
label: له بنية شريط @ar
definition: يربط بين تجسيدة وعدد المسارات على شريط صوت. @ar
toolkit label: بنية شريط @ar
toolkit definition: عدد المسارات على شريط صوت. @ar
label: helilindi konfiguratsioon @et
definition: Seostab kehastuse helilindi heliradade arvuga. @et
toolkit label: helilindi konfiguratsioon @et
toolkit definition: Helilindi heliradade arv. @et
label: ha come configurazione del nastro @it
definition: Correla una manifestazione a un numero di tracce su un nastro audio. @it
toolkit label: configurazione del nastro @it
toolkit definition: Numero di tracce su un nastro audio. @it
label: audiolentes konfigurācija @lv
definition: Sasaista manifestāciju ar skaņas celiņu skaitu audio lentē. @lv
toolkit label: audiolentes konfigurācija @lv
toolkit definition: Skaņas celiņu skaits audio lentē. @lv
label: 有磁带配置 @zh-hans
definition: 将一种载体表现与录音磁带上的音轨数关联起来。 @zh-hans
toolkit label: 磁带配置 @zh-hans
toolkit definition: 录音磁带上的音轨数 @zh-hans
label: bant yapılandırması ile ilişkilidir @tr
definition: Bir gösterimi, bir ses bandındaki birkaç parça ile ilişkilendirir. @tr
toolkit label: bant konfigürasyonu @tr
toolkit definition: Bir ses bandındaki parça sayısı @tr
label: tiene configuración de cinta @es

has film distributor agent
status: Published
definition: Relates a manifestation to an agent who is responsible for distributing a moving image manifestation to theatres or other distribution channels.
type: Property
domain: C10007
sub property of: has distributor agent
lexical alias: filmDistributorAgent.en
toolkit label: film distributor agent
toolkit definition: An agent who is responsible for distributing a moving image manifestation to theatres or other distribution channels.
label: a pour agent distributeur de cinéma @fr
definition: Met une manifestation en relation avec un agent qui est responsable de la distribution d’une manifestation d’images animées aux salles de cinéma ou aux autres réseaux de distribution. @fr
toolkit label: agent distributeur de cinéma @fr
toolkit definition: Agent qui est responsable de la distribution d’une manifestation d’images animées aux salles de cinéma ou aux autres réseaux de distribution. @fr
toolkit label: agente distribuidor de películas @es
toolkit definition: Un agente que es responsable de distribuir una manifestación de imagen en movimiento a cines u otros canales de distribución. @es
instruction number: 18.5
toolkit label: filmdistributeur-actor @nl
toolkit definition: Een actor die verantwoordelijk is voor de distributie van een bewegend beeld-manifestatie naar theaters of andere distributiekanalen. @nl
label: có nhà phân phối phim @vi
definition: Liên kết biểu thị với tác nhân có liên quan tới phân phối biểu thị hình ảnh động tới nhà hát hoặc kênh phân phối khác. @vi
toolkit label: nhà phân phối phim @vi
toolkit definition: Tác nhân có liên quan tới phân phối biểu thị hình ảnh động tới nhà hát hoặc kênh phân phối khác. @vi
label: har agent, som er filmdistributør @da
definition: Relaterer en manifestation til en agent, som er involveret i distribueringen af en manifestation med levende billeder til biografer eller andre distributionskanaler. @da
toolkit label: agent, som er filmdistributør @da
toolkit definition: Agent, som er involveret i distribueringen af en manifestation med levende billeder til biografer eller andre distributionskanaler. @da
label: hat Filmvertrieb (Akteur) @de
definition: Setzt eine Manifestation in Beziehung zu einem Akteur, der für den Vertrieb einer Bewegtbildmanifestation an Kinos oder andere Vertriebskanäle verantwortlich ist. @de
toolkit label: Filmvertrieb (Akteur) @de
toolkit definition: Ein Akteur, der für den Vertrieb einer Bewegtbildmanifestation an Kinos oder andere Vertriebskanäle verantwortlich ist. @de
label: té com a agent distribuïdor de pel·lícules @ca
definition: Relaciona una manifestació amb un agent que és responsable de la distribució d’una manifestació d’imatge en moviment a cinemes o a altres canals de distribució. @ca
toolkit label: agent distribuïdor de pel·lícules @ca
toolkit definition: Agent que és responsable de la distribució d’una manifestació d’imatge en moviment a cinemes o a altres canals de distribució. @ca
definition: Liittää manifestaation toimijaan, joka on vastuussa elokuvan tms. manifestaation jakamisesta elokuvateattereille tai muille jakelukanaville. @fi
toolkit label: elokuvan jakelija (toimija) @fi
toolkit definition: Toimija, joka on vastuussa elokuvan tms. manifestaation jakamisesta elokuvateattereille tai muille jakelukanaville. @fi
toolkit label: filmdistributør (agent) @no
toolkit definition: En agent som er involvert i å distribuere en manifestasjon i form av levende bilder til kinoer eller andre distribusjonskanaler. @no
label: έχει διανομέα @el
definition: Συνδέει μια εκδήλωση με έναν φορέα που εμπλέκεται στη διανομή μιας εκδήλωσης κινητής εικόνας στα θέατρα ή σε άλλα κανάλια διανομής. @el
toolkit label: διανομέας @el
toolkit definition: Ένας φορέας που εμπλέκεται στη διανομή μιας εκδήλωσης κινητής εικόνας στα θέατρα ή σε άλλα κανάλια διανομής. @el
has element type: 2
label: filmterjesztő ágense a következő: @hu
definition: Hozzákapcsol egy megjelenési formát egy ágenshez, amely egy mozgókép megjelenési formájának terjesztéséért felelős filmszínházak vagy más disztribúciós csatornák számára. @hu
toolkit label: filmterjesztő ágens: @hu
toolkit definition: Egy ágens, amely egy mozgókép megjelenési formájának terjesztéséért felelős filmszínházak vagy más disztribúciós csatornák számára. @hu
alternative label: film distributor
alternative label: elokuvan jakelija @fi
label: elokuvan jakelija (toimija) @fi
label: har filmdistributør (agent) @no
definition: Relaterer en manifestasjon til en agent som er involvert i å distribuere en manifestasjon i form av levende bilder til kinoer eller andre distribusjonskanaler. @no
alternative label: filmdistributør @no
label: heeft filmdistributeur-actor @nl
definition: Relateert een manifestatie aan een actor die verantwoordelijk is voor de distributie van een bewegend beeld-manifestatie naar theaters of andere distributiekanalen. @nl
label: له وكيل موزع أفلام @ar
definition: يربط بين تجسيدة ووكيل مسئول عن توزيع تجسيدة من الصور المتحركة لقاعات العرض أو عبر قنوات توزيع أخرى. @ar
alternative label: موزع أفلام @ar
toolkit label: وكيل موزع أفلام @ar
toolkit definition: وكيل مسئول عن توزيع تجسيدة من الصور المتحركة لقاعات العرض أو عبر قنوات توزيع أخرى. @ar
alternative label: distribuïdor de pel·lícules @ca
label: filmilevitaja (tegija) @et
definition: Seostab kehastuse tegijaga, kes tegeleb liikuvast pildist koosneva kehastuse levitamisega kinodesse või muudesse levikanalitesse. @et
alternative label: filmilevitaja @et
toolkit label: filmilevitaja (tegija) @et
toolkit definition: Tegija, kes tegeleb liikuvast pildist koosneva kehastuse levitamisega kinodesse või muudesse levikanalitesse. @et
alternative label: filmterjesztő: @hu
label: ha come distributore cinematografico agente @it
definition: Correla una manifestazione all'agente coinvolto nella distribuzione di una manifestazione di immagini in movimento alle sale cinematografiche o ad altri canali di distribuzione. @it
alternative label: distributore cinematografico @it
toolkit label: distributore cinematografico agente @it
toolkit definition: Agente coinvolto nella distribuzione di una manifestazione di immagini in movimento alle sale cinematografiche o ad altri canali di distribuzione. @it
label: filmas izplatītājs (aģents) @lv
definition: Sasaista manifestāciju ar aģentu, kas iesaistīts filmas manifestācijas izplatīšanā kinoteātriem vai izmantojot citus izplatīšanas kanālus. @lv
toolkit label: filmas izplatītājs (aģents) @lv
toolkit definition: Aģents, kas iesaistīts filmas manifestācijas izplatīšanā kinoteātriem vai izmantojot citus izplatīšanas kanālus. @lv
alternative label: Filmvertrieb @de
alternative label: 电影发行者 @zh-hans
label: 有电影发行者行为者 @zh-hans
toolkit label: 电影发行者行为者 @zh-hans

has film distributor collective agent
status: Published
lexical alias: filmDistributorCollectiveAgent.en
definition: Relates a manifestation to a collective agent who is responsible for distributing a moving image manifestation to theatres or other distribution channels.
toolkit label: film distributor collective agent
toolkit definition: A collective agent who is responsible for distributing a moving image manifestation to theatres or other distribution channels.
type: Property
domain: C10007
has element type: 2
sub property of: has distributor collective agent
sub property of: has film distributor agent
label: elokuvan jakelija (yhteistoimija) @fi
definition: Liittää manifestaation yhteistoimijaan, joka on vastuussa elokuvan tms. manifestaation jakamisesta elokuvateattereille tai muille jakelukanaville. @fi
toolkit label: elokuvan jakelija (yhteistoimija) @fi
toolkit definition: Yhteistoimija, joka on vastuussa elokuvan tms. manifestaation jakamisesta elokuvateattereille tai muille jakelukanaville. @fi
label: har filmdistributør (kollektiv agent) @no
definition: Relaterer en manifestasjon til en kollektiv agent som er involvert i å distribuere en manifestasjon i form av levende bilder til kinoer eller andre distribusjonskanaler. @no
toolkit label: filmdistributør (kollektiv agent) @no
toolkit definition: En kollektiv agent som er involvert i å distribuere en manifestasjon i form av levende bilder til kinoer eller andre distribusjonskanaler. @no
label: a pour agent collectif distributeur de cinéma @fr
definition: Met une manifestation en relation avec un agent collectif qui est responsable de la distribution d’une manifestation d’images animées aux salles de cinéma ou aux autres réseaux de distribution. @fr
toolkit label: agent collectif distributeur de cinéma @fr
toolkit definition: Agent collectif qui est responsable de la distribution d’une manifestation d’images animées aux salles de cinéma ou aux autres réseaux de distribution. @fr
label: heeft filmdistributeur-collectieve actor @nl
definition: Relateert een manifestatie aan een collectieve actor die verantwoordelijk is voor het distribueren van een bewegend beeld-manifestatie naar theaters of andere distributiekanalen. @nl
toolkit label: filmdistributeur-collectieve actor @nl
toolkit definition: Een collectieve actor die verantwoordelijk is voor het distribueren van een bewegend beeld-manifestatie naar theaters of andere distributiekanalen. @nl
label: له وكيل جماعي موزع أفلام @ar
definition: يربط بين تجسيدة ووكيل جماعي مسئول عن توزيع تجسيدة من الصور المتحركة لقاعات العرض أو عبر قنوات توزيع أخرى. @ar
toolkit label: وكيل جماعي موزع أفلام @ar
toolkit definition: وكيل جماعي مسئول عن توزيع تجسيدة من الصور المتحركة لقاعات العرض أو عبر قنوات توزيع أخرى. @ar
label: té com a agent col·lectiu distribuïdor de pel·lícules @ca
definition: Relaciona una manifestació amb un agent col·lectiu que és responsable de la distribució d’una manifestació d’imatge en moviment a cinemes o a altres canals de distribució. @ca
toolkit label: agent col·lectiu distribuïdor de pel·lícules @ca
toolkit definition: Agent col·lectiu que és responsable de la distribució d’una manifestació d’imatge en moviment a cinemes o a altres canals de distribució. @ca
label: har kollektiv agent, som er filmdistributør @da
definition: Relaterer en manifestation til en kollektiv agent, som er involveret i distribueringen af en manifestation med levende billeder til biografer eller andre distributionskanaler. @da
toolkit label: kollektiv agent, som er filmdistributør @da
toolkit definition: Kollektiv agent, som er involveret i distribueringen af en manifestation med levende billeder til biografer eller andre distributionskanaler. @da
label: filmilevitaja (kollektiiv) @et
definition: Seostab kehastuse kollektiiviga, kes tegeleb filmi kehastuse levitamisega kinodesse või muudesse levikanalitesse. @et
toolkit label: filmilevitaja (kollektiiv) @et
toolkit definition: Kollektiiv, kes tegeleb filmi kehastuse levitamisega kinodesse või muudesse levikanalitesse. @et
label: hat Filmvertrieb (Gemeinschaftlicher Akteur) @de
definition: Setzt eine Manifestation in Beziehung zu einem gemeinschaftlichen Akteur, der für den Vertrieb einer Bewegtbildmanifestation an Kinos oder andere Vertriebskanäle verantwortlich ist. @de
toolkit label: Filmvertrieb (Gemeinschaftlicher Akteur) @de
toolkit definition: Ein gemeinschaftlicher Akteur, der für den Vertrieb einer Bewegtbildmanifestation an Kinos oder andere Vertriebskanäle verantwortlich ist. @de
label: filmterjesztő kollektív ágense a következő: @hu
definition: Hozzákapcsol egy megjelenési formát egy kollektív ágenshez, amely egy mozgókép megjelenési formájának terjesztéséért felelős filmszínházak vagy más disztribúciós csatornák számára. @hu
toolkit label: filmterjesztő kollektív ágens: @hu
toolkit definition: Egy kollektív ágens, amely egy mozgókép megjelenési formájának terjesztéséért felelős filmszínházak vagy más disztribúciós csatornák számára. @hu
label: ha come distributore cinematografico agente collettivo @it
definition: Correla una manifestazione all'agente collettivo coinvolto nella distribuzione di una manifestazione di immagini in movimento alle sale cinematografiche o ad altri canali di distribuzione. @it
toolkit label: distributore cinematografico agente collettivo @it
toolkit definition: Agente collettivo coinvolto nella distribuzione di una manifestazione di immagini in movimento alle sale cinematografiche o ad altri canali di distribuzione. @it
label: filmas izplatītājs (grupa) @lv
definition: Sasaista manifestāciju ar grupu, kas iesaistīta filmas manifestācijas izplatīšanā kinoteātriem vai izmantojot citus izplatīšanas kanālus. @lv
toolkit label: filmas izplatītājs (grupa) @lv
toolkit definition: Grupa, kas iesaistīta filmas manifestācijas izplatīšanā kinoteātriem vai izmantojot citus izplatīšanas kanālus. @lv
alternative label: agent collectif distributeur de film @fr
label: 有电影发行者集体行为者 @zh-hans
definition: 将一种载体表现与负责向剧院或其他发行渠道发行动态图像载体表现的一个集体行为者关联起来。 @zh-hans
toolkit label: 电影发行者集体行为者 @zh-hans
toolkit definition: 负责向剧院或其他发行渠道发行动态图像载体表现的一个集体行为者 @zh-hans
label: film dağıtımcısı kolektif temsilcisi ile ilişkilidir @tr
definition: Bir gösterimi, hareketli bir görüntü gösteriminin sinemalara veya diğer dağıtım kanallarına dağıtılmasından sorumlu olan kolektif bir temsilciyle ilişkilendirir. @tr
toolkit label: film dağıtıcısı kolektif temsilcisi @tr
toolkit definition: Sinema salonlarına veya diğer dağıtım kanallarına hareketli bir görüntü gösterimi dağıtmaktan sorumlu kolektif bir temsilci. @tr
label: tiene agente colectivo distribuidor de cine @es
definition: Relaciona una manifestación con un agente colectivo que es responsable de distribuir una manifestación de imágenes en movimiento a salas de cine u otros canales de distribución. @es
toolkit label: agente colectivo distribuidor de cine @es
toolkit definition: Un agente colectivo que es responsable de distribuir una manifestación de imágenes en movimiento a salas de cine u otros canales de distribución. @es
has subproperty: has film distributor corporate body
has subproperty: has film distributor family
has subproperty: P30377

has film distributor corporate body
status: Published
lexical alias: filmDistributorCorporateBody.en
definition: Relates a manifestation to a corporate body who is responsible for distributing a moving image manifestation to theatres or other distribution channels.
toolkit label: film distributor corporate body
toolkit definition: A corporate body who is responsible for distributing a moving image manifestation to theatres or other distribution channels.
type: Property
domain: C10007
has element type: 2
sub property of: has distributor corporate body
sub property of: has film distributor collective agent
label: elokuvan jakelija (yhteisö) @fi
definition: Liittää manifestaation yhteisöön, joka on vastuussa elokuvan tms. manifestaation jakamisesta elokuvateattereille tai muille jakelukanaville. @fi
toolkit label: elokuvan jakelija (yhteisö) @fi
toolkit definition: Yhteisö, joka on vastuussa elokuvan tms. manifestaation jakamisesta elokuvateattereille tai muille jakelukanaville. @fi
label: har filmdistributør (korporasjon) @no
definition: Relaterer en manifestasjon til en korporasjon som er involvert i å distribuere en manifestasjon i form av levende bilder til kinoer eller andre distribusjonskanaler. @no
toolkit label: filmdistributør (korporasjon) @no
toolkit definition: En korporasjon som er involvert i å distribuere en manifestasjon i form av levende bilder til kinoer eller andre distribusjonskanaler. @no
label: a pour collectivité distributrice de cinéma @fr
definition: Met une manifestation en relation avec une collectivité qui est responsable de la distribution d’une manifestation d’images animées aux salles de cinéma ou aux autres réseaux de distribution. @fr
toolkit label: collectivité distributrice de cinéma @fr
toolkit definition: Collectivité qui est responsable de la distribution d’une manifestation d’images animées aux salles de cinéma ou aux autres réseaux de distribution. @fr
label: heeft filmdistributeur-corporatie @nl
definition: Relateert een manifestatie aan een corporatie die verantwoordelijk is voor het distribueren van een bewegend beeld-manifestatie naar theaters of andere distributiekanalen. @nl
toolkit label: filmdistributeur-corporatie @nl
toolkit definition: Een corporatie die verantwoordelijk is voor het distribueren van een bewegend beeld-manifestatie naar theaters of andere distributiekanalen. @nl
label: له هيئة موزع أفلام @ar
definition: يربط بين تجسيدة وهيئة مسئولة عن توزيع تجسيدة من الصور المتحركة لقاعات العرض أو عبر قنوات توزيع أخرى. @ar
toolkit label: هيئة موزع أفلام @ar
toolkit definition: هيئة مسئولة عن توزيع تجسيدة من الصور المتحركة لقاعات العرض أو عبر قنوات توزيع أخرى. @ar
label: té com a entitat corporativa distribuïdora de pel·lícules @ca
definition: Relaciona una manifestació amb una entitat corporativa que és responsable de la distribució d’una manifestació d’imatge en moviment a cinemes o a altres canals de distribució. @ca
toolkit label: entitat corporativa distribuïdora de pel·lícules @ca
toolkit definition: Entitat corporativa que és responsable de la distribució d’una manifestació d’imatge en moviment a cinemes o a altres canals de distribució. @ca
label: har korporation, som er filmdistributør @da
definition: Relaterer en manifestation til en korporation, som er involveret i distribueringen af en manifestation med levende billeder til biografer eller andre distributionskanaler. @da
toolkit label: korporation, som er filmdistributør @da
toolkit definition: Korporation, som er involveret i distribueringen af en manifestation med levende billeder til biografer eller andre distributionskanaler. @da
label: filmilevitaja (asutus) @et
definition: Seostab kehastuse asutusega, kes tegeleb filmi kehastuse levitamisega kinodesse või muudesse levikanalitesse. @et
toolkit label: filmilevitaja (asutus) @et
toolkit definition: Asutus, kes tegeleb filmi kehastuse levitamisega kinodesse või muudesse levikanalitesse. @et
label: hat Filmvertrieb (Körperschaft) @de
definition: Setzt eine Manifestation in Beziehung zu einer Körperschaft, die für den Vertrieb einer Bewegtbildmanifestation an Kinos oder andere Vertriebskanäle verantwortlich ist. @de
toolkit label: Filmvertrieb (Körperschaft) @de
toolkit definition: Eine Körperschaft, die für den Vertrieb einer Bewegtbildmanifestation an Kinos oder andere Vertriebskanäle verantwortlich ist. @de
label: filmterjesztő testülete a következő: @hu
definition: Hozzákapcsol egy megjelenési formát egy testülethez, amely egy mozgókép megjelenési formájának terjesztéséért felelős filmszínházak vagy más disztribúciós csatornák számára. @hu
toolkit label: filmterjesztő testület: @hu
toolkit definition: Egy testület, amely egy mozgókép megjelenési formájának terjesztéséért felelős filmszínházak vagy más disztribúciós csatornák számára. @hu
label: ha come distributore cinematografico ente @it
definition: Correla una manifestazione all'ente coinvolto nella distribuzione di una manifestazione di immagini in movimento alle sale cinematografiche o ad altri canali di distribuzione. @it
toolkit label: distributore cinematografico ente @it
toolkit definition: Ente coinvolto nella distribuzione di una manifestazione di immagini in movimento alle sale cinematografiche o ad altri canali di distribuzione. @it
label: filmas izplatītājs (institūcija) @lv
definition: Sasaista manifestāciju ar institūciju, kas iesaistīta filmas manifestācijas izplatīšanā kinoteātriem vai izmantojot citus izplatīšanas kanālus. @lv
toolkit label: filmas izplatītājs (institūcija) @lv
toolkit definition: Institūcija, kas iesaistīta filmas manifestācijas izplatīšanā kinoteātriem vai izmantojot citus izplatīšanas kanālus. @lv
alternative label: collectivité distributrice de film @fr
label: 有电影发行者团体 @zh-hans
definition: 将一种载体表现与负责通过广播、电视、网络广播或其他传输媒介向受众广播载体表现的一个团体关联起来。 @zh-hans
toolkit label: 电影发行者团体 @zh-hans
toolkit definition: 负责通过广播、电视、网络广播或其他传输媒介向受众广播载体表现的一个团体 @zh-hans
label: film dağıtımcısı tüzel kişisi ile ilişkilidir @tr
definition: Bir gösterimi, sinema salonlarına veya diğer dağıtım kanallarına hareketli bir görüntü gösterimi dağıtmaktan sorumlu olan bir tüzel kişiyle ilişkilendirir. @tr
toolkit label: film dağıtıcısı tüzel kişisi @tr
toolkit definition: Sinema salonlarına veya diğer dağıtım kanallarına hareketli bir görüntü gösterimi dağıtmaktan sorumlu olan bir tüzel kişi. @tr
label: tiene cuerpo corporativo distribuidor de películas @es
definition: Relaciona una manifestación con un cuerpo corporativo que es responsable de distribuir una manifestación de imágenes en movimiento a cines u otros canales de distribución. @es
toolkit label: cuerpo corporativo distribuidor de películas @es
toolkit definition: Un cuerpo corporativo que es responsable de distribuir una manifestación de imágenes en movimiento a cines u otros canales de distribución. @es
has subproperty: P30406

has film distributor family
status: Published
lexical alias: filmDistributorFamily.en
definition: Relates a manifestation to a family who is responsible for distributing a moving image manifestation to theatres or other distribution channels.
toolkit label: film distributor family
toolkit definition: A family who is responsible for distributing a moving image manifestation to theatres or other distribution channels.
type: Property
domain: C10007
has element type: 2
sub property of: has distributor family
sub property of: has film distributor collective agent
label: elokuvan jakelija (suku) @fi
definition: Liittää manifestaation sukuun, joka on vastuussa elokuvan tms. manifestaation jakamisesta elokuvateattereille tai muille jakelukanaville. @fi
toolkit label: elokuvan jakelija (suku) @fi
toolkit definition: Suku, joka on vastuussa elokuvan tms. manifestaation jakamisesta elokuvateattereille tai muille jakelukanaville. @fi
label: har filmdistributør (familie) @no
definition: Relaterer en manifestasjon til en familie som er involvert i å distribuere en manifestasjon i form av levende bilder til kinoer eller andre distribusjonskanaler. @no
toolkit label: filmdistributør (familie) @no
toolkit definition: En familie som er involvert i å distribuere en manifestasjon i form av levende bilder til kinoer eller andre distribusjonskanaler. @no
label: a pour famille distributrice de cinéma @fr
definition: Met une manifestation en relation avec une famille qui est responsable de la distribution d’une manifestation d’images animées aux salles de cinéma ou aux autres réseaux de distribution. @fr
toolkit label: famille distributrice de cinéma @fr
toolkit definition: Famille qui est responsable de la distribution d’une manifestation d’images animées aux salles de cinéma ou aux autres réseaux de distribution. @fr
label: heeft filmdistributeur-familie @nl
definition: Relateert een manifestatie aan een familie die verantwoordelijk is voor het distribueren van een bewegend beeld-manifestatie naar theaters of andere distributiekanalen. @nl
toolkit label: filmdistributeur-familie @nl
toolkit definition: Een familie die verantwoordelijk is voor het distribueren van een bewegend beeld-manifestatie naar theaters of andere distributiekanalen. @nl
label: له عائلة موزع أفلام @ar
definition: يربط بين تجسيدة وعائلة مسئولة عن توزيع تجسيدة من الصور المتحركة لقاعات العرض أو عبر قنوات توزيع أخرى. @ar
toolkit label: عائلة موزع أفلام @ar
toolkit definition: عائلة مسئولة عن توزيع تجسيدة من الصور المتحركة لقاعات العرض أو عبر قنوات توزيع أخرى. @ar
label: té com a família distribuïdora de pel·lícules @ca
definition: Relaciona una manifestació amb una família que és responsable de la distribució d’una manifestació d’imatge en moviment a cinemes o a altres canals de distribució. @ca
toolkit label: família distribuïdora de pel·lícules @ca
toolkit definition: Família que és responsable de la distribució d’una manifestació d’imatge en moviment a cinemes o a altres canals de distribució. @ca
label: har familie, som er filmdistributør @da
definition: Relaterer en manifestation til en familie, som er involveret i distribueringen af en manifestation med levende billeder til biografer eller andre distributionskanaler. @da
toolkit label: familie, som er filmdistributør @da
toolkit definition: Familie, som er involveret i distribueringen af en manifestation med levende billeder til biografer eller andre distributionskanaler. @da
label: filmilevitaja (perekond) @et
definition: Seostab kehastuse perekonnaga, kes tegeleb filmi kehastuse levitamisega kinodesse või muudesse levikanalitesse. @et
toolkit label: filmilevitaja (perekond) @et
toolkit definition: Perekond, kes tegeleb filmi kehastuse levitamisega kinodesse või muudesse levikanalitesse. @et
label: hat Filmvertrieb (Familie) @de
definition: Setzt eine Manifestation in Beziehung zu einer Familie, die für den Vertrieb einer Bewegtbildmanifestation an Kinos oder andere Vertriebskanäle verantwortlich ist. @de
toolkit label: Filmvertrieb (Familie) @de
toolkit definition: Eine Familie, die für den Vertrieb einer Bewegtbildmanifestation an Kinos oder andere Vertriebskanäle verantwortlich ist. @de
label: filmterjesztő családja a következő: @hu
definition: Hozzákapcsol egy megjelenési formát egy családhoz, amely egy mozgókép megjelenési formájának terjesztéséért felelős filmszínházak vagy más disztribúciós csatornák számára. @hu
toolkit label: filmterjesztő család: @hu
toolkit definition: Egy család, amely egy mozgókép megjelenési formájának terjesztéséért felelős filmszínházak vagy más disztribúciós csatornák számára. @hu
label: ha come distributore cinematografico famiglia @it
definition: Correla una manifestazione alla famiglia coinvolta nella distribuzione di una manifestazione di immagini in movimento alle sale cinematografiche o ad altri canali di distribuzione. @it
toolkit label: distributore cinematografico famiglia @it
toolkit definition: Famiglia coinvolta nella distribuzione di una manifestazione di immagini in movimento alle sale cinematografiche o ad altri canali di distribuzione. @it
label: filmas izplatītājs (dzimta/ģimene) @lv
definition: Sasaista manifestāciju ar dzimtu/ģimeni, kas iesaistīta filmas manifestācijas izplatīšanā kinoteātriem vai izmantojot citus izplatīšanas kanālus. @lv
toolkit label: filmas izplatītājs (dzimta/ģimene) @lv
toolkit definition: Dzimta/ģimene, kas iesaistīta filmas manifestācijas izplatīšanā kinoteātriem vai izmantojot citus izplatīšanas kanālus. @lv
alternative label: famille distributrice de film @fr
label: 有电影发行者家族 @zh-hans
definition: 将一种载体表现与负责向剧院或其他发行渠道发行动态图像载体表现的一个家族关联起来。 @zh-hans
toolkit label: 电影发行者家族 @zh-hans
toolkit definition: 负责向剧院或其他发行渠道发行动态图像载体表现的一个家族 @zh-hans
label: film dağıtımcısı ailesi ile ilişkilidir @tr
definition: Bir gösterimi, tiyatrolar veya başka dağıtım kanalları için hareketli gösterimin dağıtımından sorumlu olan aileyle ilişkilendirir. @tr
toolkit label: film dağıtıcısı ailesi @tr
toolkit definition: Tiyatrolara veya başka dağıtım kanalları için hareketli gösterimin dağıtımından sorumlu olan aile. @tr
label: tiene familia distribuidora fílmica @es
definition: Relaciona una manifestación con una familia que es responsable de distribuir imágenes en movimiento a cines u otros canales. @es
toolkit label: familia distribuidora fílmica @es
toolkit definition: Una familia que es responsable de distribuir imágenes en movimiento a cines u otros canales. @es
has subproperty: P30435

has film distributor person
status: Published
lexical alias: filmDistributorPerson.en
definition: Relates a manifestation to a person who is responsible for distributing a moving image manifestation to theatres or other distribution channels.
toolkit label: film distributor person
toolkit definition: A person who is responsible for distributing a moving image manifestation to theatres or other distribution channels.
type: Property
domain: C10007
has element type: 2
sub property of: has distributor person
sub property of: has film distributor agent
label: elokuvan jakelija (henkilö) @fi
definition: Liittää manifestaation henkilöön, joka on vastuussa elokuvan tms. manifestaation jakamisesta elokuvateattereille tai muille jakelukanaville. @fi
toolkit label: elokuvan jakelija (henkilö) @fi
toolkit definition: Henkilö, joka on vastuussa elokuvan tms. manifestaation jakamisesta elokuvateattereille tai muille jakelukanaville. @fi
label: har filmdistributør (person) @no
definition: Relaterer en manifestasjon til en person som er involvert i å distribuere en manifestasjon i form av levende bilder til kinoer eller andre distribusjonskanaler. @no
toolkit label: filmdistributør (person) @no
toolkit definition: En person som er involvert i å distribuere en manifestasjon i form av levende bilder til kinoer eller andre distribusjonskanaler. @no
label: a pour personne distributrice de cinéma @fr
definition: Met une manifestation en relation avec une personne qui est responsable de la distribution d’une manifestation d’images animées aux salles de cinéma ou aux autres réseaux de distribution. @fr
toolkit label: personne distributrice de cinéma @fr
toolkit definition: Personne qui est responsable de la distribution d’une manifestation d’images animées aux salles de cinéma ou aux autres réseaux de distribution. @fr
label: heeft filmdistributeur-persoon @nl
definition: Relateert een manifestatie aan een persoon die verantwoordelijk is voor de distributie van een bewegend beeld-manifestatie naar theaters of andere distributiekanalen. @nl
toolkit label: filmdistributeur-persoon @nl
toolkit definition: Een persoon die verantwoordelijk is voor de distributie van een bewegend beeld-manifestatie naar theaters of andere distributiekanalen. @nl
label: له شخص موزع أفلام @ar
definition: يربط بين تجسيدة وشخص مسئول عن توزيع تجسيدة من الصور المتحركة لقاعات العرض أو عبر قنوات توزيع أخرى. @ar
toolkit label: شخص موزع أفلام @ar
toolkit definition: شخص مسئول عن توزيع تجسيدة من الصور المتحركة لقاعات العرض أو عبر قنوات توزيع أخرى. @ar
label: té com a persona distribuïdora de pel·lícules @ca
definition: Relaciona una manifestació amb una persona que és responsable de la distribució d’una manifestació d’imatge en moviment a cinemes o a altres canals de distribució. @ca
toolkit label: persona distribuïdora de pel·lícules @ca
toolkit definition: Persona que és responsable de la distribució d’una manifestació d’imatge en moviment a cinemes o a altres canals de distribució. @ca
label: har person, som er filmdistributør @da
definition: Relaterer en manifestation til en person, som er involveret i distribueringen af en manifestation med levende billeder til biografer eller andre distributionskanaler. @da
toolkit label: person, som er filmdistributør @da
toolkit definition: Person, som er involveret i distribueringen af en manifestation med levende billeder til biografer eller andre distributionskanaler. @da
label: filmilevitaja (isik) @et
definition: Seostab kehastuse isikuga, kes tegeleb filmi kehastuse levitamisega kinodesse või muudesse levikanalitesse. @et
toolkit label: filmilevitaja (isik) @et
toolkit definition: Isik, kes tegeleb filmi kehastuse levitamisega kinodesse või muudesse levikanalitesse. @et
label: hat Filmvertrieb (Person) @de
definition: Setzt eine Manifestation in Beziehung zu einer Person, die für den Vertrieb einer Bewegtbildmanifestation an Kinos oder andere Vertriebskanäle verantwortlich ist. @de
toolkit label: Filmvertrieb (Person) @de
toolkit definition: Eine Person, die für den Vertrieb einer Bewegtbildmanifestation an Kinos oder andere Vertriebskanäle verantwortlich ist. @de
label: filmterjesztő személye a következő: @hu
definition: Hozzákapcsol egy megjelenési formát egy személyhez, aki egy mozgókép megjelenési formájának terjesztéséért felelős filmszínházak vagy más disztribúciós csatornák számára. @hu
toolkit label: filmterjesztő személy: @hu
toolkit definition: Egy személy, aki egy mozgókép megjelenési formájának terjesztéséért felelős filmszínházak vagy más disztribúciós csatornák számára. @hu
label: ha come distributore cinematografico persona @it
definition: Correla una manifestazione alla persona coinvolta nella distribuzione di una manifestazione di immagini in movimento alle sale cinematografiche o ad altri canali di distribuzione. @it
toolkit label: distributore cinematografico persona @it
toolkit definition: Persona coinvolta nella distribuzione di una manifestazione di immagini in movimento alle sale cinematografiche o ad altri canali di distribuzione. @it
label: filmas izplatītājs (persona) @lv
definition: Sasaista manifestāciju ar personu, kura iesaistīta filmas manifestācijas izplatīšanā kinoteātriem vai izmantojot citus izplatīšanas kanālus. @lv
toolkit label: filmas izplatītājs (persona) @lv
toolkit definition: Persona, kura iesaistīta filmas manifestācijas izplatīšanā kinoteātriem vai izmantojot citus izplatīšanas kanālus. @lv
alternative label: personne distributrice de film @fr
label: 有电影发行者个人 @zh-hans
definition: 将一种载体表现与负责向剧院或其他发行渠道发行动态图像载体表现的一个个人关联起来。 @zh-hans
toolkit label: 电影发行者个人 @zh-hans
toolkit definition: 负责向剧院或其他发行渠道发行动态图像载体表现的一个个人 @zh-hans
label: film dağıtımcısı kişisi ile ilişkilidir @tr
definition: Bir gösterimi, hareketli görüntü gösteriminin tiyatrolara veya diğer dağıtım kanallarına dağıtımından sorumlu olan bir kişiyle ilişkilendirir. @tr
toolkit label: film dağıtıcısı @tr
toolkit definition: Hareketli bir görüntü gösteriminin tiyatrolara veya diğer dağıtım kanallarına dağıtımından sorumlu olan kişi. @tr
label: tiene persona distribuidora de películas @es
definition: Relaciona una manifestación con una persona que se encarga de distribuir una manifestación de imágenes en movimiento a cines u otros canales de distribución. @es
toolkit label: persona distribuidora de películas @es
toolkit definition: Una persona que se encarga de distribuir una manifestación de imágenes en movimiento a cines u otros canales de distribución. @es
has subproperty: P30348

has details of projection characteristic of motion picture film
status: Published
type: Property
lexical alias: detailsOfProjectionCharacteristicOfMotionPictureFilm.en
definition: Relates a manifestation to details of a technical specification relating to the projection of a motion picture film.
domain: C10007
instruction number: 3.17.1.4
toolkit label: details of projection characteristic of motion picture film
toolkit definition: Details of a technical specification relating to the projection of a motion picture film.
toolkit label: detalles de proyección característicos de una película cinematográfica @es
toolkit definition: Detalles de una especificación técnica relativa a la proyección de una película cinematográfica. @es
label: har detaljerad information om projektionskarakteristika för film @sv
toolkit label: detaljerad informatino om projektionskarakteristika för film @sv
toolkit label: details van projectiekenmerken van speelfilm @nl
toolkit definition: Details van een technische specificatie gerelateerd aan de projectie van een speelfilm. @nl
label: có chi tiết của đặc trưng chiếu của phim điện ảnh @vi
definition: Liên kết biểu thị với chi tiết của đặc tính kỹ thuật liên quan tới chiếu phim điện ảnh. @vi
toolkit label: chi tiết của đặc trưng chiếu của phim điện ảnh @vi
toolkit definition: Chi tiết của đặc tính kỹ thuật liên quan tới chiếu phim điện ảnh. @vi
label: har detaljer om projiceringskarakteristika for spillefilm @da
definition: Relaterer en manifestation til detaljer om en teknisk specifikation, som relaterer til projiceringen af en spillefilm. @da
toolkit label: detaljer om projiceringskarakteristika for spillefilm @da
toolkit definition: Detaljer om en teknisk specifikation, som relaterer til projiceringen af en spillefilm. @da
label: hat Details zur Projektionseigenschaft eines Films @de
definition: Setzt eine Manifestation in Beziehung zu den Details zu einer technischen Spezifikation, die sich auf die Projektion eines Films bezieht. @de
toolkit label: Details zur Projektionseigenschaft eines Films @de
toolkit definition: Details zu einer technischen Spezifikation, die sich auf die Projektion eines Films bezieht. @de
label: té com a particularitats de característiques de projecció d’una pel·lícula cinematogràfica @ca
definition: Relaciona una manifestació amb les particularitats d’una especificació tècnica relativa a la projecció d’una pel·lícula cinematogràfica. @ca
toolkit label: particularitats de característiques de projecció d’una pel·lícula cinematogràfica @ca
toolkit definition: Particularitats d’una especificació tècnica relativa a la projecció d’una pel·lícula cinematogràfica. @ca
definition: Liittää manifestaation tarkempiin tietoihin elokuvafilmin projisointia koskevasta teknisestä määrityksestä. @fi
toolkit label: elokuvafilmin projisointiominaisuuksien tarkemmat tiedot @fi
toolkit definition: Tarkemmat tiedot elokuvafilmin projisointia koskevasta teknisestä määrityksestä. @fi
toolkit label: detaljer vedrørende projeksjonsegenskaper for spillefilm @no
toolkit definition: Detaljer vedrørende en teknisk spesifikasjon knyttet til projeksjonen av en spillefilm. @no
label: έχει λεπτομέρειες του χαρακτηριστικού της προβολής της κινηματογραφικής ταινίας @el
definition: Συνδέει μια εκδήλωση με τις λεπτομέρειες μιας τεχνικής προδιαγραφής που συνδέεται με την προβολή μιας κινηματογραφικής ταινίας. @el
toolkit label: λεπτομέρειες του χαρακτηριστικού προβολής της κινηματογραφικής ταινίας @el
toolkit definition: Λεπτομέρειες μιας τεχνικής προδιαγραφής που συνδέεται με την προβολή μιας κινηματογραφικής ταινίας. @el
label: a pour particularités d’une caractéristique de projection d’un film cinématographique @fr
definition: Met une manifestation en relation avec des particularités d’une spécification technique relative à la projection d’un film cinématographique. @fr
toolkit label: particularités d’une caractéristique de projection d’un film cinématographique @fr
toolkit definition: Particularités d’une spécification technique relative à la projection d’un film cinématographique. @fr
has element type: 6
label: filmvetítési jellemzők részletei a következők: @hu
definition: Hozzákapcsol egy megjelenési formát egy mozgófilm vetítéséhez kapcsolódó műszaki specifikáció részleteihez. @hu
toolkit label: filmvetítési jellemzők részletei: @hu
toolkit definition: Egy mozgófilm vetítéséhez kapcsolódó műszaki specifikáció részletei. @hu
label: elokuvafilmin projisointiominaisuuksien tarkemmat tiedot @fi
label: har detaljer vedrørende projeksjonsegenskaper for spillefilm @no
definition: Relaterer en manifestasjon til detaljer vedrørende en teknisk spesifikasjon knyttet til projeksjonen av en spillefilm. @no
label: heeft details van projectiekenmerken van speelfilm @nl
definition: Relateert een manifestatie aan details van een technische specificatie gerelateerd aan de projectie van een speelfilm. @nl
label: له تفاصيل عن خاصية عرض أفلام صور متحركة @ar
definition: يربط بين تجسيدة وتفاصيل خصائص فنية متعلقة بعرض فيلم صور متحركة. @ar
toolkit label: تفاصيل عن سمة عرض أفلام صور متحركة @ar
toolkit definition: تفاصيل خصائص فنية متعلقة بعرض فيلم صور متحركة. @ar
label: kinofilmi projitseerimistunnuse täpsustus @et
definition: Seostab kehastuse täpsemate andmetega tehnilises kirjelduses, mis puudutab kinofilmi projitseerimist. @et
toolkit label: kinofilmi projitseerimistunnuse täpsustus @et
toolkit definition: Täpsemad andmed tehnilises kirjelduses, mis puudutab kinofilmi projitseerimist. @et
label: ha come particolari relativi alla caratteristica di proiezione di pellicola cinematografica @it
definition: Correla una manifestazione ai particolari relativi a una specifica tecnica relativa alla proiezione di una pellicola cinematografica. @it
toolkit label: particolari relativi alla caratteristica di proiezione di pellicola cinematografica @it
toolkit definition: Particolari relativi a una specifica tecnica relativa alla proiezione di una pellicola cinematografica. @it
label: detalizēti par kinofilmas demonstrēšanas raksturlielumu @lv
definition: Sasaista manifestāciju ar sīkāku informāciju par tehnisko specifikāciju kinofilmu demonstrēšanai. @lv
toolkit label: detalizēti par kinofilmas demonstrēšanas raksturlielumu @lv
toolkit definition: Sīkāka informācija par tehnisko specifikāciju kinofilmu demonstrēšanai. @lv
label: 有电影胶卷的投影特征的细节 @zh-hans
definition: 将一种载体表现与和一种电影胶卷的投影有关的技术规格的细节关联起来。 @zh-hans
toolkit label: 电影胶卷的投影特征的细节 @zh-hans
toolkit definition: 和一种电影胶卷的投影有关的技术规格的细节 @zh-hans
label: sinema filminin projeksiyon özelliğinin ayrıntıları ile ilişkilidir @tr
definition: Bir gösterimi, bir sinema filminin gösterimiyle ilgili teknik bir şartnamenin ayrıntılarıyla ilişkilendirir. @tr
toolkit label: sinema filmi projeksiyonunun özelliklerinin ayrıntıları @tr
toolkit definition: Bir sinema filmi projeksiyonuyla ilgili teknik bir özelliğin ayrıntıları. @tr
label: tiene detalles de proyección característicos de una película cinematográfica @es
definition: Relaciona una manifestación con detalles de una especificación técnica relativa a la proyección de una película cinematográfica. @es

has fingerprint
status: Published
sub property of: has identifier for manifestation
type: Property
lexical alias: fingerprint.en
definition: Relates a manifestation to a nomen that is an identifier for manifestation of an early printed resource that consists of a sequence of characters from sources of information specified by an established scheme.
domain: C10007
toolkit label: fingerprint
toolkit definition: A nomen that is an identifier for manifestation of an early printed resource that consists of a sequence of characters from sources of information specified by an established scheme.
has element type: 3
label: sormenjälkitunniste @fi
definition: Liittää manifestaation nomeniin, joka on vanhan painetun aineiston tunniste, joka koostuu jaksosta merkkejä, jotka ovat peräisin vakiintuneen skeeman määrittelemistä tiedonlähteistä. @fi
toolkit label: sormenjälkitunniste @fi
toolkit definition: Nomen, joka on vanhan painetun aineiston tunniste, joka koostuu jaksosta merkkejä, jotka ovat peräisin vakiintuneen skeeman määrittelemistä tiedonlähteistä. @fi
label: har fingeravtrykk @no
definition: Relaterer en manifestasjon til en identifikator for manifestasjon som består av en gruppe tegn fra bestemte steder i en manifestasjon kombinert med en dato for utgivelse eller annet element. @no
toolkit label: fingeravtrykk @no
toolkit definition: En identifikator for manifestasjon som består av en gruppe tegn fra bestemte steder i en manifestasjon kombinert med en dato for utgivelse eller annet element. @no
label: a pour empreinte @fr
definition: Met une manifestation en relation avec un nomen qui est un identifiant de manifestation d’une ressource imprimée ancienne consistant en une séquence de caractères provenant de sources d’information définies par un schéma établi. @fr
toolkit label: empreinte @fr
toolkit definition: Nomen qui est un identifiant de manifestation d’une ressource imprimée ancienne consistant en une séquence de caractères provenant de sources d’information définies par un schéma établi. @fr
label: heeft vingerafdruk @nl
definition: Relateert een manifestatie aan een nomen dat is een identificatie voor manifestatie van een vroege gedrukte resource die bestaat uit een groep tekens van bronnen van informatie zoals gespecificeerd door een gevestigd schema. @nl
toolkit label: vingerafdruk @nl
toolkit definition: Een nomen dat is een identificatie voor manifestatie van een vroege gedrukte resource die bestaat uit een groep tekens van bronnen van informatie zoals gespecificeerd door een gevestigd schema. @nl
label: له بصمة @ar
definition: يربط بين تجسيدة ومعرف تجسيدة الذي يتكون من مجموعة من التمثيلات من أماكن محددة في تجسيدة مقرونة بتاريخ نشر أو أي عنصر آخر. @ar
toolkit label: بصمة @ar
toolkit definition: معرف تجسيدة الذي يتكون من مجموعة من التمثيلات من أماكن محددة في تجسيدة مقرونة بتاريخ نشر أو أي عنصر آخر. @ar
label: té com a empremta @ca
definition: Relaciona una manifestació amb un nomen que és un identificador de manifestació d’un recurs imprès antic que consisteix en una seqüència de caràcters obtinguts de fonts d’informació especificades per un esquema establert. @ca
toolkit label: empremta @ca
toolkit definition: Nomen que és un identificador de manifestació d’un recurs imprès antic que consisteix en una seqüència de caràcters obtinguts de fonts d’informació especificades per un esquema establert. @ca
label: har fingeraftryk @da
definition: Relaterer en manifestation til en identifikator for manifestation, som består af en gruppe skrifttegn fra specificerede lokationer i en manifestation kombineret med en dato for udgivelse eller et andet element. @da
toolkit label: fingeraftryk @da
toolkit definition: Identifikator for manifestation, som består af en gruppe skrifttegn fra specificerede lokationer i en manifestation kombineret med en dato for udgivelse eller et andet element. @da
label: fingerprint @et
definition: Seostab kehastuse varatrükise kehastuse identifikaatoriga, mis on moodustatud kindlaksmääratud andmeallikatest võetud märkidest. @et
toolkit definition: Varatrükise kehastuse identifikaator, mis on moodustatud kindlaksmääratud andmeallikatest võetud märkidest. @et
label: hat Fingerprint @de
definition: Setzt eine Manifestation in Beziehung zu einem Identifikator für Alte Drucke, der aus einer Zeichenfolge besteht, die anhand einer verbindlichen Methode bestimmt wird. @de
toolkit label: Fingerprint @de
toolkit definition: Ein Identifikator für Alte Drucke, der aus einer Zeichenfolge besteht, die anhand einer verbindlichen Methode bestimmt wird. @de
label: ujjlenyomata a következő: @hu
definition: Egy megjelenési formát hozzákapcsol egy megjelenési forma számára szolgáló olyan azonosítóhoz, amely a megjelenési forma speciális helyeiről származó karakterek egy csoportját tartalmazza, kombinálva a kiadvány dátumával vagy más elemmel. @hu
toolkit label: ujjlenyomata: @hu
toolkit definition: Egy azonosító megjelenési forma számára, amely a megjelenési forma speciális helyeiről származó karakterek egy csoportját tartalmazza, kombinálva a kiadvány dátumával vagy más elemmel. @hu
label: ha come impronta @it
definition: Correla una manifestazione a un identificatore per la manifestazione che consiste di un gruppo di caratteri da punti definiti in una manifestazione e che è combinato con una data di pubblicazione o altro elemento. @it
toolkit label: impronta @it
toolkit definition: Identificatore per la manifestazione che consiste di un gruppo di caratteri da punti definiti in una manifestazione e che è combinato con una data di pubblicazione o altro elemento. @it
label: identificējošā zīmju virkne @lv
definition: Sasaista manifestāciju ar nomenu, kas ir sākotnēji drukāta resursa manifestācijas identifikators, kas sastāv no secīgām rakstu zīmēm, kas ņemtas no informācijas avotiem. @lv
toolkit label: identificējošā zīmju virkne @lv
toolkit definition: Sākotnēji drukāta resursa manifestācijas identifikators, kas sastāv no secīgām rakstu zīmēm, kas ņemtas no informācijas avotiem. @lv
label: 有指纹 @zh-hans
definition: 将一种载体表现与作为一种早期出版资源的载体表现的标识符、由根据既定方案指定的信息源中选取的字符的序列组成的一个命名关联起来。 @zh-hans
toolkit label: 指纹 @zh-hans
toolkit definition: 作为一种早期出版资源的载体表现的标识符、由根据既定方案指定的信息源中选取的字符的序列组成的一个命名 @zh-hans
label: parmak izi ile ilişkilidir @tr
definition: Bir gösterimi, yerleşik bir şema tarafından belirtilen bilgi kaynaklarından gelen bir dizi karakterden oluşan erken basılı bir kaynağın örneği için bir tanımlayıcı olan bir isimle ilişkilendirir. @tr
toolkit label: parmak izi @tr
toolkit definition: Yerleşik bir şema tarafından belirlenen bilgi kaynaklarından gelen bir dizi karakterden oluşan erken basılı bir kaynağın örneği için bir gösterim olan bir isim. @tr
label: tiene huella digital @es
definition: Relaciona una manifestación con un nomen que es un identificador de manifestación de un recurso impreso antiguo que consta de una secuencia de caracteres de fuentes de información especificadas por un esquema establecido. @es
toolkit label: huella digital @es
toolkit definition: Un nomen que es un identificador de manifestación de un recurso impreso antiguo que consta de una secuencia de caracteres de fuentes de información especificadas por un esquema establecido. @es
has subproperty: P30296

has first alphanumeric designation of alternative sequence
status: Published
definition: Relates a manifestation to a nomen that is a designation in the form of numbers or alphabetic characters that is used to indicate the first in a concurrent sequence of numbering of the parts or iterations of a manifestation.
type: Property
domain: C10007
lexical alias: firstAlphanumericDesignationOfAlternativeSequence.en
instruction number: 2.6.6
toolkit label: first alphanumeric designation of alternative sequence
toolkit definition: A nomen that is a designation in the form of numbers or alphabetic characters that is used to indicate the first in a concurrent sequence of numbering of the parts or iterations of a manifestation.
label: a pour première désignation alphanumérique d’une autre séquence @fr
definition: Met une manifestation en relation avec un nomen qui est une désignation sous forme de nombres ou de caractères alphabétiques qui sert à indiquer la première partie ou itération dans une séquence concomitante de numérotation des parties ou itérations d’une manifestation. @fr
toolkit label: première désignation alphanumérique d’une autre séquence @fr
toolkit definition: Nomen qui est une désignation sous forme de nombres ou de caractères alphabétiques qui sert à indiquer la première partie ou itération dans une séquence concomitante de numérotation des parties ou itérations d’une manifestation. @fr
toolkit label: primera designación alfanumérica de secuencia alternativa @es
toolkit definition: Un nomen que es una designación en forma de números o caracteres alfabéticos que se utiliza para indicar el primero en una secuencia concurrente de numeración de las partes o iteraciones de una manifestación. @es
label: har alternativ numerisk och/eller alfabetisk beteckning för första numret/delen i svit @sv
toolkit label: alternativ numerisk och/eller alfabetisk beteckning för första numret/delen i svit @sv
toolkit label: eerste alfanumerieke aanduiding van alternatieve volgorde @nl
toolkit definition: Een nomen dat is een aanduiding in de vorm van nummers of alfabetische karakters die gebruikt is om de eerste aan te geven in een opeenvolgende volgorde van nummering van de delen of iteraties van een manifestatie. @nl
label: có định danh con số hoặc chữ lựa chọn của số hoặc phần đầu tiên của chuỗi @vi
definition: Liên kết biểu thị với hệ thống thứ hai hoặc tiếp theo của đánh số được trình bày dưới hình thái con số hoặc chữ trên số hoặc phần đầu tiên của chuỗi đánh số đối với ấn phẩm nhiều kỳ. @vi
toolkit label: định danh con số hoặc chữ lựa chọn của số hoặc phần đầu tiên của chuỗi @vi
toolkit definition: Hệ thống thứ hai hoặc tiếp theo của đánh số được trình bày dưới hình thái con số hoặc chữ trên số hoặc phần đầu tiên của chuỗi đánh số đối với ấn phẩm nhiều kỳ. @vi
label: har første alfanumeriske betegnelse for alternativ rækkefølge @da
definition: Relaterer en manifestation til en betegnelse i form af numre eller skrifttegn, som anvendes til at indikere den første i en fortløbende rækkefølgenummerering af delene eller iterationer af en manifestation. @da
toolkit label: første alfanumeriske betegnelse for alternativ rækkefølge @da
toolkit definition: Betegnelse i form af numre eller skrifttegn, som anvendes til at indikere den første i en fortløbende rækkefølgenummerering af delene eller iterationer af en manifestation. @da
label: hat alternative alphanumerische Bezeichnung der ersten Ausgabe einer fortlaufenden Ressource @de
definition: Setzt eine Manifestation in Beziehung zu einer Bezeichnung in Form von Nummern oder Buchstaben, die verwendet wird, um in einer alternativen Zählfolge der Ausgaben einer Manifestation auf die erste hinzuweisen. @de
toolkit label: Alternative alphanumerische Bezeichnung der ersten Ausgabe einer fortlaufenden Ressource @de
toolkit definition: Eine Bezeichnung in Form von Nummern oder Buchstaben, die verwendet wird, um in einer alternativen Zählfolge der Ausgaben einer Manifestation auf die erste hinzuweisen. @de
label: té com a primera designació alfanumèrica d’una seqüència alternativa @ca
definition: Relaciona una manifestació amb un nomen que és una designació en la forma de números o caràcters alfabètics que s’usa per indicar la primera de les parts o les iteracions en una seqüència de numeració concurrent d’una manifestació. @ca
toolkit label: primera designació alfanumèrica d’una seqüència alternativa @ca
toolkit definition: Nomen que és una designació en la forma de números o caràcters alfabètics que s’usa per indicar la primera de les parts o les iteracions en una seqüència de numeració concurrent d’una manifestació. @ca
definition: Liittää manifestaation nomeniin, joka on numeroista tai kirjaimista muodostuva määrite, joka on manifestaation osien tai iteraatioiden rinnakkaisen numerointijakson ensimmäinen määrite. @fi
toolkit label: vaihtoehtoisen numerointijakson ensimmäinen numero- tai kirjainmäärite @fi
toolkit definition: Nomen, joka on numeroista tai kirjaimista muodostuva määrite, joka on manifestaation osien tai iteraatioiden rinnakkaisen numerointijakson ensimmäinen määrite. @fi
toolkit label: første alfanumeriske betegnelse for alternativ sekvens @no
toolkit definition: En betegnelse i form av numeriske eller alfabetiske tegn som brukes til å indikere den første i en fortløpende sekvens av nummerering av deler eller versjoner av en manifestasjon. @no
label: έχει εναλλακτικό αριθμητικό ή/και αλφαβητικό προσδιορισμό του πρώτου τεύχους ή μέρους της ακολουθίας @el
definition: Συνδέει μια εκδήλωση με ένα δεύτερο ή διαδοχικό σύστημα αρίθμησης που παρουσιάζεται σε αριθμητική ή αλφαβητική μορφή στο πρώτο τεύχος ή μέρος μιας αριθμητικής ακολουθίας για ένα περιοδικό. @el
toolkit label: εναλλακτικός αριθμητικός ή/και αλφαβητικός προσδιορισμός του πρώτου τεύχους ή μέρους της ακολουθίας @el
toolkit definition: Ένα δεύτερο ή διαδοχικό σύστημα αρίθμησης που παρουσιάζεται σε αριθμητική ή αλφαβητική μορφή στο πρώτο τεύχος ή μέρος μιας αριθμητικής ακολουθίας για ένα περιοδικό. @el
label: alternatív sorrendiségének alfanumerikus kezdőjelölése a következő: @hu
definition: Hozzákapcsol egy megjelenési formát egy nomenhez, amelynek megjelölése számok vagy alfabetikus karakterek formájában jelzi az elsőt egy megjelenési forma részeinek vagy iterációinak konkurens számozási sorrendjében. @hu
toolkit label: alternatív sorrendiségének alfanumerikus kezdőjelölése: @hu
toolkit definition: Egy nomen, amelynek megjelölése számok vagy alfabetikus karakterek formájában jelzi az elsőt egy megjelenési forma részeinek vagy iterációinak konkurens számozási sorrendjében. @hu
alternative label: alternative numeric and/or alphabetic designation of first issue or part of sequence
alternative label: numerointijakson ensimmäisen numeron tai osan vaihtoehtoinen numero- tai kirjainmäärite @fi
label: vaihtoehtoisen numerointijakson ensimmäinen numero- tai kirjainmäärite @fi
label: har første alfanumeriske betegnelse for alternativ sekvens @no
definition: Relaterer en manifestasjon til en betegnelse i form av numeriske eller alfabetiske tegn som brukes til å indikere den første i en fortløpende sekvens av nummerering av deler eller versjoner av en manifestasjon. @no
alternative label: alternativ numerisk og/eller alfabetisk betegnelse for første hefte eller del av en sekvens @no
sub property of: has first alphanumeric designation of sequence
alternative label: autre désignation numérique et/ou alphabétique de la première livraison ou partie d’une séquence @fr
label: heeft eerste alfanumerieke aanduiding van alternatieve volgorde @nl
definition: Relateert een manifestatie aan een nomen dat is een aanduiding in de vorm van nummers of alfabetische karakters die gebruikt is om de eerste aan te geven in een opeenvolgende volgorde van nummering van de delen of iteraties van een manifestatie. @nl
label: له تسمية رقمية أولى لتسلسل بديل @ar
definition: يربط بين تجسيدة وتسمية في شكل أرقام أو حروف هجائية مستخدمة لتشير إلى تسلسل الترقيم الأول للأجزاء أو الأعداد لتجسيدة. @ar
alternative label: بديل تسمية رقمي و/أو الهجائية للعدد أو الجزء الأول فى التسلسل. @ar
toolkit label: تسمية رقمية أولى لتسلسل بديل @ar
toolkit definition: تسمية في شكل أرقام أو حروف هجائية مستخدمة لتشير إلى تسلسل الترقيم الأول للأجزاء أو الأعداد لتجسيدة. @ar
alternative label: designació numèrica i/o alfabètica alternativa del primer número o primera part d’una seqüència @ca
alternative label: alternativ numerisk og/eller aflabetisk betegnelse for første nummer eller del af en rækkefølge @da
label: alternatiivse nummerduse esimene tähtnumbriline tähistus @et
definition: Seostab kehastuse numbritest või tähtedest koosneva tähistusega, mis on kehastuse osade või seisude alternatiivse nummerduse esimene tähistus. @et
toolkit label: alternatiivse nummerduse esimene tähtnumbriline tähistus @et
toolkit definition: Numbritest või tähtedest koosnev tähistus, mis on kehastuse osade või seisude alternatiivse nummerduse esimene tähistus. @et
alternative label: egy alternatív sorrendiség első számának vagy részének számmal és/vagy betűkkel megjelenített jelölése: @hu
label: ha come prima designazione alfanumerica di sequenza alternativa @it
definition: Correla una manifestazione a una designazione in forma di numeri o caratteri alfabetici utilizzata per indicare la prima in una sequenza di numerazione concomitante di parti o iterazioni di una manifestazione @it
alternative label: designazione numerica e/o alfabetica alternativa del primo fascicolo o parte della sequenza @it
toolkit label: prima designazione cronologica di sequenza alternativa @it
toolkit definition: Designazione in forma di data o altro arco di tempo, utilizzata per indicare la prima in una sequenza concomitante di numerazione delle parti o iterazioni di una manifestazione. @it
label: secības pirmais burtciparu alternatīvais apzīmējums @lv
definition: Sasaista manifestāciju ar nomenu, kas ir apzīmējums ciparu vai alfabēta burtu veidā, ko izmanto, lai parādītu paralēli eksistējošu manifestācijas daļu vai laidienu numerāciju. @lv
toolkit label: secības pirmais burtciparu alternatīvais apzīmējums @lv
toolkit definition: Apzīmējums ciparu vai alfabēta burtu veidā, ko izmanto, lai parādītu paralēli eksistējošu manifestācijas daļu vai laidienu numerāciju. @lv
alternative label: Alternative alphanumerische Bezeichnung der ersten Ausgabe oder des ersten Teils einer Folge @de
has element type: 3

has first alphanumeric designation of sequence
status: Published
definition: Relates a manifestation to a nomen that is a designation in the form of numbers or alphabetic characters that is used to indicate the first in a sequence of numbering of the parts or iterations of a manifestation.
type: Property
domain: C10007
lexical alias: firstAlphanumericDesignationOfSequence.en
instruction number: 2.6.2
toolkit label: first alphanumeric designation of sequence
toolkit definition: A nomen that is a designation in the form of numbers or alphabetic characters that is used to indicate the first in a sequence of numbering of the parts or iterations of a manifestation.
label: a pour première désignation alphanumérique d’une séquence @fr
definition: Met une manifestation en relation avec un nomen qui est une désignation sous forme de nombres ou de caractères alphabétiques servant à indiquer la première partie ou itération dans une séquence de numérotation des parties ou itérations d’une manifestation. @fr
toolkit label: première désignation alphanumérique d’une séquence @fr
toolkit definition: Nomen qui est une désignation sous forme de nombres ou de caractères alphabétiques servant à indiquer la première partie ou itération dans une séquence de numérotation des parties ou itérations d’une manifestation. @fr
toolkit label: primera designación alfanumérica de secuencia @es
toolkit definition: Un nomen que es una designación en forma de números o caracteres alfabéticos que se utiliza para indicar el primero en una secuencia de numeración de las partes o iteraciones de una manifestación. @es
label: har numerisk och/eller alfabetisk beteckning för första numret/delen i svit @sv
toolkit label: numerisk och/eller alfabetisk beteckning för första numret/delen i svit @sv
toolkit label: eerste alfanumerieke aanduiding van reeks @nl
toolkit definition: Een nomen dat is een aanduiding in de vorm van nummers of alfabetische tekens die is gebruikt om aan te geven de eerste in een reeks van nummering van de delen of iteraties van een manifestatie. @nl
label: có định danh con số hoặc chữ của số hoặc phần đầu tiên của chuỗi @vi
definition: Liên kết biểu thị với định danh dưới hình thái con số và/hoặc chữ được trình bày trên số hoặc phần đầu tiên trong chuỗi đánh số. @vi
toolkit label: định danh con số hoặc chữ của số hoặc phần đầu tiên của chuỗi @vi
toolkit definition: Định danh dưới hình thái con số và/hoặc chữ được trình bày trên số hoặc phần đầu tiên trong chuỗi đánh số. @vi
label: har første alfanumeriske betegnelse af rækkefølge @da
definition: Relaterer en manifestation til en betegnelse i form af numre eller skrifttegn, som anvendes til at indikere den første i en rækkefølgenummerering af delene eller iterationer af en manifestation. @da
toolkit label: første alfanumeriske betegnelse af rækkefølge @da
toolkit definition: Betegnelse i form af numre eller skrifttegn, som anvendes til at indikere den første i en rækkefølgenummerering af delene eller iterationer af en manifestation. @da
label: hat alphanumerische Bezeichnung der ersten Ausgabe einer fortlaufenden Ressource @de
definition: Setzt eine Manifestation in Beziehung zu einer Bezeichnung in Form von Nummern oder Buchstaben, die verwendet wird, um in einer Zählfolge der Ausgaben einer Manifestation auf die erste hinzuweisen. @de
toolkit label: Alphanumerische Bezeichnung der ersten Ausgabe einer fortlaufenden Ressource @de
toolkit definition: Eine Bezeichnung in Form von Nummern oder Buchstaben, die verwendet wird, um in einer Zählfolge der Ausgaben einer Manifestation auf die erste hinzuweisen. @de
label: té com a primera designació alfanumèrica d’una seqüència @ca
definition: Relaciona una manifestació amb un nomen que és una designació en la forma de números o caràcters alfabètics que s’usa per indicar la primera de les parts o les iteracions en una seqüència de numeració d’una manifestació. @ca
toolkit label: primera designació alfanumèrica d’una seqüència @ca
toolkit definition: Nomen que és una designació en la forma de números o caràcters alfabètics que s’usa per indicar la primera de les parts o les iteracions en una seqüència de numeració d’una manifestació. @ca
definition: Liittää manifestaation nomeniin, joka on numeroista tai kirjaimista muodostuva määrite, joka ilmaisee manifestaation osien tai iteraatioiden numerointijakson ensimmäisen määritteen. @fi
toolkit label: numerointijakson ensimmäinen numero- ja/tai kirjainmäärite @fi
toolkit definition: Nomen, joka on numeroista tai kirjaimista muodostuva määrite, joka ilmaisee manifestaation osien tai iteraatioiden numerointijakson ensimmäisen määritteen. @fi
toolkit label: første alfanumeriske betegnelse for sekvens @no
toolkit definition: En betegnelse i form av numeriske eller alfabetiske tegn som brukes til å indikere den første i en sekvens av nummerering av deler eller versjoner av en manifestasjon. @no
label: έχει αριθμητικό ή και αλφαβητικό προσδιορισμό του πρώτου τεύχους ή μέρους της ακολουθίας @el
definition: Συνδέει μια εκδήλωση με έναν προσδιορισμό σε αριθμητική ή/και αλφαβητική μορφή που παρουσιάζεται στο πρώτο τεύχος ή μέρος ενός περιοδικού που εκδίδεται σε μια αριθμητική ακολουθία. @el
toolkit label: αριθμητικός ή/και αλφαβητικός προσδιορισμός του πρώτου τεύχους ή μέρους της ακολουθίας @el
toolkit definition: Ένας προσδιορισμός σε αριθμητική ή/και αλφαβητική μορφή που παρουσιάζεται στο πρώτο τεύχος ή μέρος ενός περιοδικού που εκδίδεται σε μια αριθμητική ακολουθία. @el
label: sorrendiségének alfanumerikus kezdőjelölése a következő: @hu
definition: Hozzákapcsol egy megjelenési formát egy nomenhez, amely megjelölésként számok vagy alfabetikus karakterek formájában jelzi az elsőt egy megjelenési forma részeinek vagy iterációinak számozási sorrendjében. @hu
toolkit label: sorrendiségének alfanumerikus kezdőjelölése: @hu
toolkit definition: Egy nomen, amely megjelölésként számok vagy alfabetikus karakterek formájában jelzi az elsőt egy megjelenési forma részeinek vagy iterációinak számozási sorrendjében. @hu
alternative label: numeric and/or alphabetic designation of first issue or part of sequence
alternative label: numerointijakson ensimmäisen numeron tai osan numero- ja/tai kirjainmäärite @fi
label: numerointijakson ensimmäinen numero- ja/tai kirjainmäärite @fi
label: har første alfanumeriske betegnelse for sekvens @no
definition: Relaterer en manifestasjon til en betegnelse i form av numeriske eller alfabetiske tegn som brukes til å indikere den første i en sekvens av nummerering av deler eller versjoner av en manifestasjon. @no
alternative label: numerisk og/eller alfabetisk betegnelse for første hefte eller del @no
sub property of: has related nomen of manifestation
alternative label: désignation numérique et/ou alphabétique de la première livraison ou partie d’une séquence @fr
label: heeft eerste alfanumerieke aanduiding van reeks @nl
definition: Relateert een manifestatie aan een nomen dat is een aanduiding in de vorm van nummers of alfabetische tekens die is gebruikt om aan te geven de eerste in een reeks van nummering van de delen of iteraties van een manifestatie. @nl
label: له تسمية رقمية أولى لتسلسل @ar
definition: يربط بين تجسيدة وتسمية في شكل أرقام أو حروف هجائية مستخدمة لتشير إلى الترقيم الأول للأعداد أو الأجزاء لتجسيدة. @ar
alternative label: تسمية رقمية و/أو هجائية لعدد أو جزء أول في تسلسل @ar
toolkit label: تسمية رقمية أولى لتسلسل @ar
toolkit definition: تسمية في شكل أرقام أو حروف هجائية مستخدمة لتشير إلى الترقيم الأول للأعداد أو الأجزاء لتجسيدة. @ar
alternative label: designació numèrica i/o alfabètica del primer número o primera part d’una seqüència @ca
alternative label: numerisk og/eller alfabetisk betegnelse for første nummer eller del af rækkefølge @da
label: nummerduse esimene tähtnumbriline tähistus @et
definition: Seostab kehastuse numbritest või tähtedest koosneva tähistusega, mis on kehastuse osade või seisude nummerduse esimene tähistus. @et
toolkit label: nummerduse esimene tähtnumbriline tähistus @et
toolkit definition: Numbritest või tähtedest koosnev tähistus, mis on kehastuse osade või seisude nummerduse esimene tähistus. @et
alternative label: egy sorrendiség első számának vagy részének számmal és/vagy betűvel megjelenített jelölése: @hu
label: ha come prima designazione alfanumerica della sequenza @it
definition: Correla una manifestazione a una designazione in forma di numeri o caratteri alfabetici, utilizzata per indicare la prima in una sequenza di numerazione delle parti o iterazioni di una manifestazione. @it
alternative label: designazione numerica e/o alfabetica del primo fascicolo o parte della sequenza @it
toolkit label: prima designazione alfanumerica della sequenza @it
toolkit definition: Designazione in forma di numeri o caratteri alfabetici, utilizzata per indicare la prima in una sequenza di numerazione delle parti o iterazioni di una manifestazione. @it
label: secības pirmais burtciparu apzīmējums @lv
definition: Sasaista manifestāciju ar nomenu, kas ir apzīmējums ciparu vai alfabēta burtu veidā, ko izmanto, lai parādītu manifestācijas daļu vai laidienu numerāciju. @lv
toolkit label: secības pirmais burtciparu apzīmējums @lv
toolkit definition: Apzīmējums ciparu vai alfabēta burtu veidā, ko izmanto, lai parādītu manifestācijas daļu vai laidienu numerāciju. @lv
alternative label: Alphanumerische Bezeichnung der ersten Ausgabe oder des ersten Teils einer Folge @de
has element type: 3

has first chronological designation of alternative sequence
status: Published
definition: Relates a manifestation toa nomen that is a designation in the form of a date or other timespan that is used to indicate the first in a concurrent sequence of numbering of the parts or iterations of a manifestation.
type: Property
domain: C10007
lexical alias: firstChronologicalDesignationOfAlternativeSequence.en
instruction number: 2.6.7
toolkit label: first chronological designation of alternative sequence
toolkit definition: A nomen that is a designation in the form of a date or other timespan that is used to indicate the first in a concurrent sequence of numbering of the parts or iterations of a manifestation.
label: a pour première désignation chronologique d’une autre séquence @fr
definition: Met une manifestation en relation avec un nomen qui est une désignation sous forme de date ou d’un autre laps de temps qui sert à indiquer la première partie ou itération dans une séquence de numérotation concomitante des parties ou itérations d’une manifestation. @fr
toolkit label: première désignation chronologique d’une autre séquence @fr
toolkit definition: Nomen qui est une désignation sous forme de date ou d’un autre laps de temps qui sert à indiquer la première partie ou itération dans une séquence de numérotation concomitante des parties ou itérations d’une manifestation. @fr
toolkit label: primera designación cronológica de secuencia alternativa @es
toolkit definition: Un nomen que es una designación en forma de fecha u otro período de tiempo que se utiliza para indicar el primero en una secuencia concurrente de numeración de las partes o iteraciones de una manifestación. @es
scope note: A designation includes a year; year and month; month, day, and year. A chronological designation of alternative sequence may include a date in a different calendar.
toolkit label: eerste chronologische aanduiding van alternatieve reeks @nl
toolkit definition: Een nomen dat is een aanduiding in de vorm van een datum of andere tijdspanne die gebruikt is om de eerste aan te geven in een opeenvolgende volgorde van nummering van de delen of iteraties van een manifestatie. @nl
label: có định danh biên niên lựa chọn của số hoặc phần đầu tiên của chuỗi @vi
definition: Liên kết biểu thị với hệ thống thứ hai hoặc tiếp theo của đánh số được trình bày dưới hình thái ngày trên số hoặc phần đầu tiên của chuỗi đánh số đối với ấn phẩm nhiều kỳ. @vi
scope note: Đinh danhbao gồm năm; năm và tháng; tháng, ngày, và năm. Định danh biên niên lựa chọn có thể bao gồm ngày trong lịch khác. @vi
toolkit label: định danh biên niên lựa chọn của số hoặc phần đầu tiên của chuỗi @vi
toolkit definition: Hệ thống thứ hai hoặc tiếp theo của đánh số được trình bày dưới hình thái ngày trên số hoặc phần đầu tiên của chuỗi đánh số đối với ấn phẩm nhiều kỳ. @vi
scope note: Een aanduiding omvat een jaar; jaar en maand; maand, dag en jaar. Een chronologische aanduiding van alternatieve volgorde kan een datum omvatten in een andere jaartelling. @nl
label: har første kronologisk betegnelse for alternativ rækkefølge @da
definition: Relaterer en manifestation til en betegnelse i form af en dato eller anden tidsperiode, som anvendes til at indikere den første i en fortløbende rækkefølgenummerering af delene eller iterationer af en manifestation. @da
scope note: Betegnelse omfatter et år; år og måned; måned, dag og år. En alternativ kronologisk betegnelse kan omfatte en dato i en anden kalender. @da
toolkit label: har første kronologisk betegnelse for alternativ rækkefølge @da
toolkit definition: Betegnelse i form af en dato eller anden tidsperiode, som anvendes til at indikere den første i en fortløbende rækkefølgenummerering af delene eller iterationer af en manifestation. @da
label: hat alternative chronologische Bezeichnung der ersten Ausgabe einer fortlaufenden Ressource @de
definition: Setzt eine Manifestation in Beziehung zu einer Bezeichnung in Form eines Datums oder eines anderen Zeitraums, die verwendet wird, um in einer alternativen Zählfolge der Ausgaben einer Manifestation auf die erste hinzuweisen. @de
scope note: Darunter fällt ein Jahr; ein Monat und ein Jahr; ein Tag, ein Monat und ein Jahr. Zu einer alternativen chronologischen Bezeichnung einer fortlaufenden Ressource kann auch ein Datum nach einem anderen Kalender gehören. @de
toolkit label: Alternative chronologische Bezeichnung der ersten Ausgabe einer fortlaufenden Ressource @de
toolkit definition: Eine Bezeichnung in Form eines Datums oder eines anderen Zeitraums, die verwendet wird, um in einer alternativen Zählfolge der Ausgaben einer Manifestation auf die erste hinzuweisen. @de
label: té com a primera designació cronològica d’una seqüència alternativa @ca
definition: Relaciona una manifestació amb un nomen que és una designació en la forma d’una data o de qualsevol altre interval de temps que s’usa per indicar la primera de les parts o les iteracions en una seqüència de numeració concurrent d’una manifestació. @ca
scope note: Una designació inclou un any; any i mes; dia, mes i any. Una designació cronològica d’una seqüència alternativa pot incloure una data en un calendari diferent. @ca
toolkit label: primera designació cronològica d’una seqüència alternativa @ca
toolkit definition: Nomen que és una designació en la forma d’una data o de qualsevol altre interval de temps que s’usa per indicar la primera de les parts o les iteracions en una seqüència de numeració concurrent d’una manifestació. @ca
definition: Liittää manifestaation nomeniin, joka on päivämäärästä tai muusta ajanjaksosta muodostuva määrite, joka on manifestaation osien tai iteraatioiden rinnakkaisen numerointijakson ensimmäinen määrite. @fi
toolkit label: vaihtoehtoisen numerointijakson ensimmäinen aikamäärite @fi
toolkit definition: Nomen, joka on päivämäärästä tai muusta ajanjaksosta muodostuva määrite, joka on manifestaation osien tai iteraatioiden rinnakkaisen numerointijakson ensimmäinen määrite. @fi
toolkit label: første kronologiske betegnelse for alternativ sekvens @no
toolkit definition: En betegnelse i form av en dato eller et annet tidsrom som brukes til å indikere den første i en fortløpende sekvens av nummerering av deler eller versjoner av en manifestasjon. @no
label: έχει εναλλακτικό χρονολογικό προσδιορισμό του πρώτου τεύχους ή μέρους της ακολουθίας @el
definition: Συνδέει μια εκδήλωση με ένα δεύτερο ή διαδοχικό σύστημα αρίθμησης που παρουσιάζεται στη μορφή μιας χρονολογίας στο πρώτο τεύχος ή μέρος μιας αριθμητικής ακολουθίας για ένα περιοδικό. @el
scope note: Ο προσδιορισμός περιλαμβάνει ένα έτος; έτος και μήνα; μήνα, ημέρα και έτος. Ένας εναλλακτικός χρονολογικός προσδιορισμός μπορεί να περιλαμβάνει μια χρονολογία σε ένα διαφορετικό ημερολόγιο. @el
toolkit label: εναλλακτικός χρονολογικός προσδιορισμός του πρώτου τεύχους ή μέρους της ακολουθίας @el
toolkit definition: Ένα δεύτερο ή διαδοχικό σύστημα αρίθμησης που παρουσιάζεται στη μορφή μιας χρονολογίας στο πρώτο τεύχος ή μέρος μιας αριθμητικής ακολουθίας για ένα περιοδικό. @el
scope note: Des exemples de désignation comprennent : année ; année et mois ; jour, mois et année. Une désignation chronologique d’une autre séquence peut inclure une date exprimée selon un calendrier différent. @fr
label: alternatív sorrendiségének kronológiai kezdőjelölése a következő: @hu
definition: Hozzákapcsol egy megjelenési formát egy nomenhez, amelynek megjelölése dátum vagy más időtartam formájában jelzi az elsőséget egy megjelenési forma részeinek vagy iterációinak konkurens számozási sorrendjében. @hu
scope note: Jelölés lehet év; év és hónap; hónap, nap és év. Az alternatív sorrendiség kronológiai jelölése tartalmazhat dátumot egy másik naptárból is. @hu
alternative label: alternative chronological designation of first issue or part of sequence
scope note: Määrite sisältää vuoden; vuoden ja kuukauden; kuukauden, päivän ja vuoden. Vaihtoehtoinen aikamääre voi sisältää toisen kalenterin mukaisen ajankohdan. @fi
alternative label: numerointijakson ensimmäisen numeron tai osan vaihtoehtoinen aikamäärite @fi
label: vaihtoehtoisen numerointijakson ensimmäinen aikamäärite @fi
label: har første kronologiske betegnelse for alternativ sekvens @no
definition: Relaterer en manifestasjon til en betegnelse i form av en dato eller et annet tidsrom som brukes til å indikere den første i en fortløpende sekvens av nummerering av deler eller versjoner av en manifestasjon. @no
alternative label: alternativ kronologisk betegnelse for første hefte eller del av en sekvens @no
sub property of: has first chronological designation of sequence
alternative label: autre désignation chronologique de la première livraison ou partie d’une séquence @fr
label: heeft eerste chronologische aanduiding van alternatieve reeks @nl
definition: Relateert een manifestatie aan een nomen dat is een aanduiding in de vorm van een datum of andere tijdspanne die gebruikt is om de eerste aan te geven in een opeenvolgende volgorde van nummering van de delen of iteraties van een manifestatie. @nl
label: له تسمية زمنية أولى لتسلسل بديل @ar
definition: يربط بين تجسيدة وتسمية في شكل تاريخ أو أي فترة زمنية مستخدمة لتشير إلى التسلسل الرقمي الأول لجزء أو لعدد من تجسيدة. @ar
scope note: تشمل التسمية : السنة؛ السنة والشهر؛ الشهر واليوم والسنة. تسمية زمنية لتسلسل بديل يمكن أن تشتمل على تاريخ في تقويم مختلف. @ar
alternative label: بديل تسمية زمنية للعدد الأول أو الجزء الأول من التسلسل @ar
toolkit label: تسمية زمنية أولى لتسلسل بديل @ar
toolkit definition: تسمية في شكل تاريخ أو أي فترة زمنية مستخدمة لتشير إلى التسلسل الرقمي الأول لجزء أو لعدد من تجسيدة. @ar
alternative label: designació cronològica alternativa del primer número o primera part d’una seqüència @ca
alternative label: alternativ kronologisk betegnelse for første nummer eller del af en rækkefølge @da
label: alternatiivse nummerduse esimene kronoloogiline tähistus @et
definition: Seostab kehastuse daatumist või muust ajavahemikust koosneva tähistusega, mis on kehastuse osade või seisude alternatiivse nummerduse esimene tähistus. @et
scope note: Tähistus koosneb aastaarvust, aastaarvust ja kuust või kuupäevast, kuust ja aastaarvust. Alternatiivseks kronoloogiliseks tähistuseks võib olla mõne teise kalendri daatum. @et
toolkit label: alternatiivse nummerduse esimene kronoloogiline tähistus @et
toolkit definition: Daatumist või muust ajavahemikust koosnev tähistus, mis on kehastuse osade või seisude alternatiivse nummerduse esimene tähistus. @et
alternative label: egy alternatív kronológiai sorrendiség első számának vagy részének jelölése: @hu
toolkit label: alternatív sorrendiségének kronológiai kezdőjelölése: @hu
toolkit definition: Egy nomen, amelynek megjelölése dátum vagy más időtartam formájában jelzi az elsőséget egy megjelenési forma részeinek vagy iterációinak konkurens számozási sorrendjében. @hu

has first chronological designation of sequence
status: Published
definition: Relates a manifestation to a nomen that is a designation in the form of a date or other timespan that is used to indicate the first in a sequence of numbering of the parts or iterations of a manifestation.
type: Property
domain: C10007
lexical alias: firstChronologicalDesignationOfSequence.en
instruction number: 2.6.3
toolkit label: first chronological designation of sequence
toolkit definition: A nomen that is a designation in the form of a date or other timespan that is used to indicate the first in a sequence of numbering of the parts or iterations of a manifestation.
label: a pour première désignation chronologique d’une séquence @fr
definition: Met une manifestation en relation avec un nomen qui est une désignation sous forme de date ou d’un autre laps de temps servant à indiquer la première partie ou itération dans une séquence de numérotation des parties ou itérations d’une manifestation. @fr
toolkit label: première désignation chronologique d’une séquence @fr
toolkit definition: Nomen qui est une désignation sous forme de date ou d’un autre laps de temps servant à indiquer la première partie ou itération dans une séquence de numérotation des parties ou itérations d’une manifestation. @fr
toolkit label: primera designación cronológica de secuencia @es
toolkit definition: Un nomen que es una designación en forma de fecha u otro período de tiempo que se utiliza para indicar el primero en una secuencia de numeración de las partes o iteraciones de una manifestación. @es
scope note: A designation includes a year; year and month; month, day, and year.
toolkit label: eerste chronologische aanduiding van reeks @nl
toolkit definition: Een nomen dat is een aanduiding in de vorm van een datum of andere tijdspanne die gebruikt is om de eerste aan te geven in een opeenvolgende volgorde van nummering van de delen of iteraties van een manifestatie. @nl
label: có định danh biên niên của số hoặc phần đầu tiên của chuỗi @vi
definition: Liên kết biểu thị với định danh dưới hình thái ngày được trình bày trên số hoặc phần đầu tiên trong chuỗi đánh số. @vi
scope note: Định danh bao gồm năm; năm và tháng; tháng, ngày, và năm. @vi
toolkit label: định danh biên niên của số hoặc phần đầu tiên của chuỗi @vi
toolkit definition: Định danh dưới hình thái ngày được trình bày trên số hoặc phần đầu tiên trong chuỗi đánh số. @vi
scope note: Een aanduiding omvat een jaar; jaar en maand; maand, dag en jaar. @nl
label: har første kronologiske betegnelse af rækkefølge @da
definition: Relaterer en manifestation til en betegnelse i form af en dato eller anden tidsperiode, som anvendes til at indikere den første i en rækkefølgenummerering af delene eller iterationer af en manifestation. @da
scope note: Betegnelsen omfatter et år; år og måned; måned, dag og år. @da
toolkit label: første kronologiske betegnelse af rækkefølge @da
toolkit definition: Betegnelse i form af en dato eller anden tidsperiode, som anvendes til at indikere den første i en rækkefølgenummerering af delene eller iterationer af en manifestation. @da
label: hat chronologische Bezeichnung der ersten Ausgabe einer fortlaufenden Ressource @de
definition: Setzt eine Manifestation in Beziehung zu einer Bezeichnung in Form eines Datums oder eines anderen Zeitraums, die verwendet wird, um in einer Zählfolge der Ausgaben einer Manifestation auf die erste hinzuweisen. @de
scope note: Darunter fällt ein Jahr; ein Monat und ein Jahr; ein Tag, ein Monat und ein Jahr. @de
toolkit label: Chronologische Bezeichnung der ersten Ausgabe einer fortlaufenden Ressource @de
toolkit definition: Eine Bezeichnung in Form eines Datums oder eines anderen Zeitraums, die verwendet wird, um in einer Zählfolge der Ausgaben einer Manifestation auf die erste hinzuweisen. @de
label: té com a primera designació cronològica d’una seqüència @ca
definition: Relaciona una manifestació amb un nomen que és una designació en forma d’una data o de qualsevol altre interval de temps que s’usa per indicar la primera de les parts o les iteracions en una seqüència de numeració d’una manifestació. @ca
scope note: Una designació inclou un any; any i mes; dia, mes i any. @ca
toolkit label: primera designació cronològica d’una seqüència @ca
toolkit definition: Nomen que és una designació en forma d’una data o de qualsevol altre interval de temps que s’usa per indicar la primera de les parts o les iteracions en una seqüència de numeració d’una manifestació. @ca
definition: Liittää manifestaation nomeniin, joka on päivämäärästä tai muusta ajanjaksosta muodostuva määrite, joka ilmaisee manifestaation osien tai iteraatioiden numerointijakson ensimmäisen määritteen. @fi
toolkit label: numerointijakson ensimmäinen aikamäärite @fi
toolkit definition: Nomen, joka on päivämäärästä tai muusta ajanjaksosta muodostuva määrite, joka ilmaisee manifestaation osien tai iteraatioiden numerointijakson ensimmäisen määritteen. @fi
toolkit label: første kronologiske betegnelse for sekvens @no
toolkit definition: En betegnelse i form av en dato eller et annet tidsrom som brukes til å indikere den første i en sekvens av nummerering av deler eller versjoner av en manifestasjon. @no
label: έχει χρονολογικό προσδιορισμό του πρώτου τεύχους ή μέρους της ακολουθίας @el
definition: Συνδέει μια εκδήλωση με έναν προσδιορισμό στη μορφή χρονολογίας που παρουσιάζεται στο πρώτο τεύχος ή μέρος ενός περιοδικού που εκδίδεται σε μια αριθμητική ακολουθία. @el
scope note: Ο προσδιορισμός περιλαμβάνει ένα έτος; έτος και μήνα; μήνα, ημέρα και έτος. @el
toolkit label: χρονολογικός προσδιορισμός του πρώτου τεύχους ή μέρους της ακολουθίας @el
toolkit definition: Ένας προσδιορισμός στη μορφή χρονολογίας που παρουσιάζεται στο πρώτο τεύχος ή μέρος ενός περιοδικού που εκδίδεται σε μια αριθμητική ακολουθία. @el
scope note: Des exemples de désignation comprennent : année ; année et mois ; jour, mois et année. @fr
label: sorrendiségének kronológiai kezdőjelölése a következő: @hu
definition: Hozzákapcsol egy megjelenési formát egy nomenhez, amely megjelölésként dátum vagy más időtartam formájában jelzi az elsőt egy megjelenési forma részeinek vagy iterációinak számozási sorrendjében. @hu
scope note: Jelölés lehet év; év és hónap; hónap, nap és év. @hu
alternative label: chronological designation of first issue or part of sequence
scope note: Määrite sisältää vuoden; vuoden ja kuukauden; kuukauden, päivän ja vuoden. @fi
alternative label: numerointijakson ensimmäisen osan tai numeron aikamäärite @fi
label: numerointijakson ensimmäinen aikamäärite @fi
label: har første kronologiske betegnelse for sekvens @no
definition: Relaterer en manifestasjon til en betegnelse i form av en dato eller et annet tidsrom som brukes til å indikere den første i en sekvens av nummerering av deler eller versjoner av en manifestasjon. @no
scope note: En betegnelse inkluderer et år; år og måned; måned, dag og år. @no
alternative label: kronologisk betegnelse for første hefte eller del av en sekvens @no
sub property of: has related nomen of manifestation
alternative label: désignation chronologique de la première livraison ou partie d’une séquence @fr
label: heeft eerste chronologische aanduiding van reeks @nl
definition: Relateert een manifestatie aan een nomen dat is een aanduiding in de vorm van een datum of andere tijdspanne die gebruikt is om de eerste aan te geven in een opeenvolgende volgorde van nummering van de delen of iteraties van een manifestatie. @nl
label: له تسمية زمنية أولى لتسلسل @ar
definition: يربط بين تجسيدة وتسمية في شكل تاريخ أو أي فترة زمنية أخرى مستخدمة لتشير إلى التسلسل الرقمي الأول للأجزاء أو للأعداد لتجسيدة. @ar
scope note: تشمل التسمية : السنة؛ السنة والشهر؛ الشهر واليوم والسنة. @ar
alternative label: تسمية زمنية لإصدارة أولى أو جزء أول من تسلسل @ar
toolkit label: تسمية زمنية أولى لتسلسل @ar
toolkit definition: تسمية في شكل تاريخ أو أي فترة زمنية أخرى مستخدمة لتشير إلى التسلسل الرقمي الأول للأجزاء أو للأعداد لتجسيدة. @ar
alternative label: designació cronològica d’un primer número o primera part d’una seqüència @ca
alternative label: kronologisk betegnelse for første nummer eller del af rækkefølge @da
label: nummerduse esimene kronoloogiline tähistus @et
definition: Seostab kehastuse daatumist või muust ajavahemikust koosneva tähistusega, mis on kehastuse osade või seisude nummerduse esimene tähistus. @et
scope note: Tähistus koosneb aastaarvust, aastaarvust ja kuust või kuupäevast, kuust ja aastaarvust. @et
toolkit label: nummerduse esimene kronoloogiline tähistus @et
toolkit definition: Daatumist või muust ajavahemikust koosnev tähistus, mis on kehastuse osade või seisude nummerduse esimene tähistus. @et
alternative label: egy kronológiai sorrendiség első számának vagy részének jelölése: @hu
toolkit label: sorrendiségének kronológiai kezdőjelölése: @hu

has font point size
status: Published
lexical alias: fontPointSize.en
definition: Relates a manifestation to a point size of the type used to represent the characters and symbols in a manifestation.
toolkit label: font point size
toolkit definition: A point size of the type used to represent the characters and symbols in a manifestation.
type: Property
domain: C10007
label: kirjasimen pistekoko @fi
definition: Liittää manifestaation manifestaatiossa esiintyvien merkkien ja symbolien pistekokoon. @fi
toolkit label: kirjasimen pistekoko @fi
toolkit definition: Manifestaatiossa esiintyvien merkkien ja symbolien pistekoko. @fi
label: har skriftpunktstørrelse @no
definition: Relaterer en manifestasjon til en punktstørrelse for typen som brukes for å representere tegnene og symbolene i en manifestasjon. @no
toolkit label: skriftpunktstørrelse @no
toolkit definition: En punktstørrelse for typen som brukes for å representere tegnene og symbolene i en manifestasjon. @no
label: a pour taille de police de caractères en points @fr
definition: Met une manifestation en relation avec une taille en points des caractères utilisés pour représenter les signes et les symboles dans une manifestation. @fr
toolkit label: taille de police de caractères en points @fr
toolkit definition: Taille en points des caractères utilisés pour représenter les signes et les symboles dans une manifestation. @fr
label: heeft puntgrootte font @nl
definition: Relateert een manifestatie aan een puntgrootte van het lettertype gebruikt om karakters en symbolen in een manifestatie weer te geven. @nl
toolkit label: puntgrootte font @nl
toolkit definition: Een puntgrootte van het lettertype gebruikt om karakters en symbolen in een manifestatie weer te geven. @nl
label: له حجم خط @ar
definition: يربط بين تجسيدة وحجم الخط المستخدم في طباعة التمثيلات والرموز في تجسيدة. @ar
toolkit label: حجم خط @ar
toolkit definition: حجم الخط المستخدم في طباعة التمثيلات والرموز في تجسيدة. @ar
label: té com a mida de font en punts @ca
definition: Relaciona una manifestació amb una mida en punts del tipus usat per representar els caràcters i els símbols d’una manifestació. @ca
toolkit label: mida de font en punts @ca
toolkit definition: Mida en punts del tipus usat per representar els caràcters i els símbols d’una manifestació. @ca
label: har skrifttypes punktstørrelse @da
definition: Relaterer en manifestation til en størrelse på den skrifttype, som anvendes til at repræsentere tegn og symboler i en manifestation. @da
toolkit label: skrifttypes punktstørrelse @da
toolkit definition: Størrelse på den skrifttype, som anvendes til at repræsentere tegn og symboler i en manifestation. @da
label: kirja punktisuurus @et
definition: Seostab kehastuse kehastuses sisalduvate kirjamärkide ja sümbolite esitamiseks kasutatud šrifti punktisuurusega. @et
toolkit label: kirja punktisuurus @et
toolkit definition: Kehastuses sisalduvate kirjamärkide ja sümbolite esitamiseks kasutatud šrifti punktisuurus. @et
label: hat Punktgröße der Schrift @de
definition: Setzt eine Manifestation in Beziehung zu einer Punktgröße der Schrift, die zur Darstellung der Zeichen und Symbole in einer Manifestation verwendet wird. @de
toolkit label: Punktgröße der Schrift @de
toolkit definition: Eine Punktgröße der Schrift, die zur Darstellung der Zeichen und Symbole in einer Manifestation verwendet wird. @de
label: betűmérete a következő: @hu
definition: Hozzákapcsol egy megjelenési formát egy típus pontméretéhez, amelyet egy megjelenési forma karaktereinek és szimbólumainak ábrázolására használnak. @hu
toolkit label: betűmérete: @hu
toolkit definition: Egy típus pontmérete, amelyet egy megjelenési forma karaktereinek és szimbólumainak ábrázolására használnak. @hu
label: ha come dimensioni del carattere @it
definition: Correla una manifestazione alle dimensioni del carattere tipografico usato per rappresentare i caratteri e i simboli in una manifestazione. @it
toolkit label: dimensioni del carattere @it
toolkit definition: Dimensioni del carattere tipografico usato per rappresentare i caratteri e i simboli in una manifestazione. @it
label: fonta punkta lielums @lv
definition: Sasaista manifestāciju ar punkta lielumu ko izmanto, lai attēlotu rakstzīmes un simbolus manifestācijā. @lv
toolkit label: fonta punkta lielums @lv
toolkit definition: Punkta lielums ko izmanto, lai attēlotu rakstzīmes un simbolus manifestācijā. @lv
has element type: 6
label: 有字体点大小 @zh-hans
definition: 将一种载体表现与在一种载体表现中用于表示字符和符号的字型的点大小关联起来。 @zh-hans
toolkit label: 字体点大小 @zh-hans
toolkit definition: 在一种载体表现中用于表示字符和符号的字型的点大小 @zh-hans
label: yazı tipi punto boyutu ile ilişkilidir @tr
definition: Bir gösterimi, gösterimdeki karakterleri ve sembolleri temsil etmek için kullanılan yazının punto boyutuyla ilişkilendirir. @tr
toolkit label: yazı tipi punto boyutu @tr
toolkit definition: Bir gösterimdeki karakterleri ve sembolleri temsil etmek için kullanılan yazının punto büyüklüğü. @tr
label: tiene tamaño de fuente en puntos @es
definition: Relaciona una manifestación con un tamaño en puntos del tipo utilizado para representar los caracteres y símbolos de una manifestación. @es
toolkit label: tamaño de fuente en puntos @es
toolkit definition: Un tamaño en puntos del tipo utilizado para representar los caracteres y símbolos de una manifestación. @es
has subproperty: P30306

has generation
status: Published
definition: Relates a manifestation to a relationship between an original carrier and a carrier of a reproduction that is made from the original.
type: Property
domain: C10007
lexical alias: generation.en
toolkit label: generation
toolkit definition: A relationship between an original carrier and a carrier of a reproduction that is made from the original.
label: a pour génération @fr
definition: Met une manifestation en relation avec une relation entre un support matériel original et un support matériel d’une reproduction faite à partir de l’original. @fr
toolkit label: génération @fr
toolkit definition: Relation entre un support matériel original et un support matériel d’une reproduction faite à partir de l’original. @fr
toolkit label: generación @es
toolkit definition: Una relación entre un portador original y un portador de una reproducción que se hace a partir del original. @es
label: har generation @sv
toolkit label: generatie @nl
toolkit definition: Een relatie tussen een originele drager en een drager van een reproductie dat is gemaakt van het origineel. @nl
label: có thế hệ @vi
definition: Liên kết biểu thị với mối quan hệ giữa vật mang tin nguyên gốc và vật mang tin của phiên bản được tạo ra từ nguyên gốc. @vi
toolkit label: thế hệ @vi
toolkit definition: Mối quan hệ giữa vật mang tin nguyên gốc và vật mang tin của phiên bản được tạo ra từ nguyên gốc. @vi
definition: Relaterer en manifestation til et forhold mellem en oprindelig bærer og bæreren af en reproduktion, baseret på originalen. @da
toolkit definition: Forhold mellem en oprindelig bærer og bæreren af en reproduktion, baseret på originalen. @da
label: hat Kopiengeneration @de
definition: Setzt eine Manifestation in Beziehung zu einer Beziehung zwischen einem Originaldatenträger und einem Datenträger einer Reproduktion, die vom Original erstellt wird. @de
toolkit label: Kopiengeneration @de
toolkit definition: Eine Beziehung zwischen einem Originaldatenträger und dem Datenträger einer Reproduktion, die vom Original erstellt wird. @de
label: té com a generació @ca
definition: Relaciona una manifestació amb una relació entre un suport físic original i un suport físic d’una reproducció que es fa a partir de l’original. @ca
toolkit label: generació @ca
toolkit definition: Relació entre un suport físic original i un suport físic d’una reproducció que es fa a partir de l’original. @ca
definition: Liittää manifestaation alkuperäisen tallenteen ja siitä tuotetun jäljenteen tallenteen väliseen suhteeseen. @fi
toolkit label: sukupolvi @fi
toolkit definition: Alkuperäisen tallenteen ja siitä tuotetun jäljenteen tallenteen välinen suhde. @fi
toolkit label: generasjon @no
toolkit definition: Et forhold mellom en originalbærer og bæreren av en reproduksjon basert på originalen. @no
label: έχει παραγωγή @el
definition: Συνδέει μια εκδήλωση με μια σχέση μεταξύ ενός αρχικού φορέα αποθήκευσης και του φορέα αποθήκευσης μιας αναπαραγωγής που έχει δημιουργηθεί από το πρωτότυπο. @el
toolkit label: παραγωγή @el
toolkit definition: Μια σχέση μεταξύ ενός αρχικού φορέα αποθήκευσης και του φορέα αποθήκευσης μιας αναπαραγωγής που έχει δημιουργηθεί από το πρωτότυπο. @el
has element type: 4
label: generációja a következő: @hu
definition: Hozzákapcsol egy megjelenési formát egy eredeti hordozó és az eredetiből készült másolat hordozója közötti viszonyhoz. @hu
toolkit label: generációja: @hu
toolkit definition: Egy eredeti hordozó és az eredetiből készült másolat hordozója közötti viszony. @hu
instruction number: 3.1
label: sukupolvi @fi
label: har generasjon @no
definition: Relaterer en manifestasjon til et forhold mellom en originalbærer og bæreren av en reproduksjon basert på originalen. @no
label: heeft generatie @nl
definition: Relateert een manifestatie aan een relatie tussen een originele drager en een drager van een reproductie dat is gemaakt van het origineel. @nl
label: له توليد @ar
definition: يربط بين تجسيدة وعلاقة بين حامل أصلي والحامل الخاص بإعادة الإنتاج المصنوع من الأصل. @ar
toolkit label: توليد @ar
toolkit definition: علاقة بين حامل أصلي والحامل الخاص بإعادة الإنتاج المصنوع من الأصل. @ar
label: koopiapõlvkond @et
definition: Seostab kehastuse originaali kandja ja originaalist tehtud reproduktsiooni kandja suhtega. @et
toolkit label: koopiapõlvkond @et
toolkit definition: Originaali kandja ja originaalist tehtud reproduktsiooni kandja suhe. @et
label: ha come generazione @it
definition: Correla una manifestazione a una relazione tra un supporto originale e il supporto di una riproduzione creata dall'originale. @it
toolkit label: generazione @it
toolkit definition: Relazione tra un supporto originale e il supporto di una riproduzione creata dall'originale. @it
label: paaudze @lv
definition: Sasaista manifestāciju ar attiecību starp oriģināla nesēju un reprodukcijas nesēju, kas veidots no oriģināla. @lv
toolkit label: paaudze @lv
toolkit definition: Attiecība starp oriģināla nesēju un reprodukcijas nesēju, kas veidots no oriģināla. @lv
label: 有代 @zh-hans
definition: 将一种载体表现与原始载体和原件复制品的载体之间的关系关联起来。 @zh-hans
toolkit label: 代 @zh-hans
toolkit definition: 原始载体和原件复制品的载体之间的关系 @zh-hans
label: nesil ile ilişkilidir @tr
definition: Bir gösterimi, orijinal bir taşıyıcı ile orijinalden yapılan yeniden üretmenin taşıyıcısı arasındaki ilişki ile ilişkilendirir. @tr
toolkit label: nesil @tr
toolkit definition: Orijinal taşıyıcı ile orijinalden yapılmış bir kopyanın taşıyıcısı arasındaki ilişki. @tr
label: tiene generación @es
definition: Relaciona una manifestación con una relación entre un portador original y un portador de una reproducción que se hace a partir del original. @es
has subproperty: a pour génération d’enregistrement audio
has subproperty: a pour génération de ressource numérique
has subproperty: a pour génération de microforme

has details of generation
status: Published
type: Property
lexical alias: detailsOfGeneration.en
definition: Relates a manifestation to details of a relationship between an original carrier and a carrier of a reproduction made from an original.
domain: C10007
instruction number: 3.10.1.4
toolkit label: details of generation
toolkit definition: Details of a relationship between an original carrier and a carrier of a reproduction made from an original.
toolkit label: detalles de generacion @es
toolkit definition: Detalles de una relación entre un portador original y un portador de una reproducción hecha a partir de un original. @es
label: har detaljerad information om generation @sv
toolkit label: detaljerad information om generation @sv
toolkit label: details van generatie @nl
toolkit definition: Details van een relatie tussen een originele drager en de drager van een reproductie gemaakt van het origineel. @nl
label: có chi tiết của thế hệ @vi
definition: Liên kết biểu thị với chi tiết của mối quan hệ giữa vật mang tin nguyên gốc và vật mang tin của phiên bản được tạo ra từ nguyên gốc. @vi
toolkit label: chi tiết của thế hệ @vi
toolkit definition: Chi tiết của mối quan hệ giữa vật mang tin nguyên gốc và vật mang tin của phiên bản được tạo ra từ nguyên gốc. @vi
label: har detaljer om generation @da
definition: Relaterer en manifestation til detaljer om forholdet mellem en oprindelig bærer og bæreren af en reproduktion, baseret på originalen. @da
toolkit label: detaljer om generation @da
toolkit definition: Detaljer om forholdet mellem en oprindelig bærer og bæreren af en reproduktion, baseret på originalen. @da
label: hat Details zur Kopiengeneration @de
definition: Setzt eine Manifestation in Beziehung zu den Details zu einer Beziehung zwischen einem Originaldatenträger und einem Datenträger einer Reproduktion, die vom Original erstellt wird. @de
toolkit label: Details zur Kopiengeneration @de
toolkit definition: Details zu einer Beziehung zwischen einem Originaldatenträger und einem Datenträger einer Reproduktion, die vom Original erstellt wird. @de
label: té com a particularitats de generació @ca
definition: Relaciona una manifestació amb les particularitats d’una relació entre un suport físic original i el suport físic d’una reproducció feta a partir d’un original. @ca
toolkit label: particularitats de generació @ca
toolkit definition: Particularitats d’una relació entre un suport físic original i el suport físic d’una reproducció feta a partir d’un original. @ca
definition: Liittää manifestaation tarkempiin tietoihin alkuperäisen tallenteen ja siitä tuotetun jäljenteen tallenteen välisestä suhteesta. @fi
toolkit label: sukupolven tarkemmat tiedot @fi
toolkit definition: Tarkemmat tiedot alkuperäisen tallenteen ja siitä tuotetun jäljenteen välisestä suhteesta. @fi
toolkit label: detaljer vedrørende generasjon @no
toolkit definition: Detaljer vedrørende et forhold mellom en originalbærer og en bærer av en reproduksjon basert på originalen. @no
label: έχει λεπτομέρειες της παραγωγής @el
definition: Συνδέει μια εκδήλωση με τις λεπτομέρειες μιας σχέσης μεταξύ ενός πρωτότυπου φορέα αποθήκευσης και ενός φορέα αποθήκευσης μιας αναπαραγωγής που δημιουργήθηκε από το πρωτότυπο. @el
toolkit label: λεπτομέρειες της παραγωγής @el
toolkit definition: Λεπτομέρειες μιας σχέσης μεταξύ ενός πρωτότυπου φορέα αποθήκευσης και ενός φορέα αποθήκευσης μιας αναπαραγωγής που δημιουργήθηκε από το πρωτότυπο. @el
label: a pour particularités d’une génération @fr
definition: Met une manifestation en relation avec des particularités d’une relation entre un support matériel original et un support matériel d’une reproduction faite à partir d’un original. @fr
toolkit label: particularités d’une génération @fr
toolkit definition: Particularités d’une relation entre un support matériel original et un support matériel d’une reproduction faite à partir d’un original. @fr
has element type: 6
label: generáció részletei a következők: @hu
definition: Hozzákapcsol egy megjelenési formát egy eredeti hordozó és az eredetiből készült másolat hordozója közötti viszony részleteihez. @hu
toolkit label: generáció részletei: @hu
toolkit definition: Egy eredeti hordozó és az eredetiből készült másolat hordozója közötti viszony részletei. @hu
label: sukupolven tarkemmat tiedot @fi
label: har detaljer vedrørende generasjon @no
definition: Relaterer en manifestasjon til detaljer vedrørende et forhold mellom en originalbærer og en bærer av en reproduksjon basert på originalen. @no
label: heeft details van generatie @nl
definition: Relateert een manifestatie aan details van een relatie tussen een originele drager en de drager van een reproductie gemaakt van het origineel. @nl
label: له تفاصيل إيجاد @ar
definition: يربط بين تجسيدة وتفاصيل علاقة بين حامل أصلي وحامل لمادة أعيد انتاجها من الأصل. @ar
toolkit label: تفاصيل إيجاد @ar
toolkit definition: تفاصيل علاقة بين حامل أصلي وحامل لمادة أعيد انتاجها من الأصل. @ar
label: koopiapõlvkonna täpsustus @et
definition: Seostab kehastuse täpsemate andmetega originaali kandja ja originaalist tehtud reproduktsiooni kandja suhte kohta. @et
toolkit label: koopiapõlvkonna täpsustus @et
toolkit definition: Täpsemad andmed originaali kandja ja originaalist tehtud reproduktsiooni kandja suhte kohta. @et
label: ha come particolari relativi alla generazione @it
definition: Correla una manifestazione ai particolari relativi a una relazione tra un supporto originale e un supporto di una riproduzione creata dall'originale. @it
toolkit label: particolari relativi alla generazione @it
toolkit definition: Particolari relativi a una relazione tra un supporto originale e un supporto di una riproduzione creata dall'originale. @it
label: detalizēti par paaudzi @lv
definition: Sasaista manifestāciju ar sīkāku informāciju par attiecībām starp oriģināla nesēju un reprodukcijas nesēju, kas veidots no oriģināla. @lv
toolkit label: detalizēti par paaudzi @lv
toolkit definition: Sīkāka informācija par attiecībām starp oriģināla nesēju un reprodukcijas nesēju, kas veidots no oriģināla. @lv
label: 有代的细节 @zh-hans
definition: 将一种载体表现与原始载体和原件复制品的载体之间的关系的细节关联起来。 @zh-hans
toolkit label: 代的细节 @zh-hans
toolkit definition: 原始载体和原件复制品的载体之间的关系的细节 @zh-hans
label: üretim ayrıntıları ile ilişkilidir @tr
definition: Bir gösterimi, orijinal taşıyıcı ile bir orijinalden yapılmış bir yeniden üretimin taşıyıcısı arasındaki ilişkinin ayrıntılarıyla ilişkilendirir. @tr
toolkit label: üretim ayrıntıları @tr
toolkit definition: Bir orijinal taşıyıcı ile orijinalden yapılmış bir kopya taşıyıcısı arasındaki ilişkinin ayrıntıları. @tr
label: tiene detalles de generacion @es
definition: Relaciona una manifestación con detalles de una relación entre un portador original y un portador de una reproducción hecha a partir de un original. @es

a pour génération d’enregistrement audio
status: Deprecated
type: Property
domain: C10007
sub property of: has generation
lexical alias: generationOfAudioRecording.en
toolkit label: generation of audio recording (Deprecated)
definition: Met une manifestation en relation avec la relation entre un support matériel original d’un enregistrement audio et le support matériel d’une reproduction faite à partir de l’original (par exemple, une matrice de duplication de bande, un disque-épreuve). @fr
toolkit label: génération d’enregistrement audio @fr
toolkit definition: La relation entre un support matériel original d’un enregistrement audio et le support matériel d’une reproduction faite à partir de l’original (par exemple, une matrice de duplication de bande, un disque-épreuve). @fr
toolkit label: generación de la grabación sonora @es
toolkit definition: La relación entre un soporte de audio original y el soporte de una reproducción hecha del original (por ej., cinta maestra de duplicación, una impresión de prueba). @es
instruction number: 3/10/2002

a pour génération de ressource numérique
status: Deprecated
type: Property
domain: C10007
sub property of: has generation
lexical alias: generationOfDigitalResource.en
toolkit label: generation of digital resource (Deprecated)
definition: Met une manifestation en relation avec la relation entre un support matériel original d’une ressource numérique et le support matériel d’une reproduction faite à partir de l’original (par exemple, une matrice de dérivation). @fr
toolkit label: génération de ressource numérique @fr
toolkit definition: La relation entre un support matériel original d’une ressource numérique et le support matériel d’une reproduction faite à partir de l’original (par exemple, une matrice de dérivation). @fr
toolkit label: generación del recurso digital @es
toolkit definition: La relación entre el soporte original de un recurso digital y el soporte de una reproducción del original (por ej., máster derivado). @es
instruction number: 3/10/2003

a pour génération de microforme
status: Deprecated
type: Property
domain: C10007
sub property of: has generation
lexical alias: generationOfMicroform.en
toolkit label: generation of microform (Deprecated)
definition: Met une manifestation en relation avec la relation entre un support matériel original d’une ressource sur microforme et le support matériel d’une reproduction faite à partir de l’original (par exemple, matrice). @fr
toolkit label: génération de microforme @fr
toolkit definition: La relation entre un support matériel original d’une ressource sur microforme et le support matériel d’une reproduction faite à partir de l’original (par exemple, matrice). @fr
toolkit label: generación de la microforma @es
toolkit definition: La relación entre el soporte original de una microforma y el soporte de una reproducción hecha del original (por ej., un máster de impresión). @es
instruction number: 3/10/2004

a pour génération de film cinématographique
status: Deprecated
type: Property
domain: C10007
sub property of: has generation
lexical alias: generationOfMotionPictureFilm.en
toolkit label: generation of motion picture film (Deprecated)
definition: Met une manifestation en relation avec la relation entre un support matériel original d’une ressource filmique et le support matériel d’une reproduction faite à partir de l’original (par exemple, une copie de référence). @fr
toolkit label: génération de film cinématographique @fr
toolkit definition: La relation entre un support matériel original d’une ressource filmique et le support matériel d’une reproduction faite à partir de l’original (par exemple, une copie de référence). @fr
toolkit label: generación de la película cinematográfica @es
toolkit definition: La relación entre un soporte original de una película cinematográfica como recurso y el soporte de la reproducción hecha del original (por ej., impreso de referencia). @es
instruction number: 3/10/2005

a pour génération de bande vidéo
status: Deprecated
type: Property
domain: C10007
sub property of: has generation
lexical alias: generationOfVideotape.en
toolkit label: generation of videotape (Deprecated)
definition: Met une manifestation en relation avec la relation entre un support matériel original d’une ressource sur bande vidéo et le support matériel d’une reproduction faite à partir de l’original (par exemple, une copie de présentation). @fr
toolkit label: génération de bande vidéo @fr
toolkit definition: La relation entre un support matériel original d’une ressource sur bande vidéo et le support matériel d’une reproduction faite à partir de l’original (par exemple, une copie de présentation). @fr
toolkit label: generación de la videocinta @es
toolkit definition: La relación entre un soporte original de un recurso en videocinta y el soporte de una reproducción hecha del original (por ej., copia de exhibición). @es
instruction number: 3/10/2006

has groove pitch
status: Published
lexical alias: groovePitch.en
definition: Relates a manifestation to a groove pitch of an analog cylinder.
toolkit label: groove pitch
toolkit definition: A groove pitch of an analog cylinder.
type: Property
domain: C10007
has element type: 4
sub property of: has groove characteristic
label: urajako @fi
definition: Liittää manifestaation analogisen äänilieriön urajakoon. @fi
toolkit label: urajako @fi
toolkit definition: Analogisen äänilieriön urajako. @fi
label: har rillevidde @no
definition: Relaterer en manifestasjon til en rillevidde for en analog sylinder. @no
toolkit label: rillevidde @no
toolkit definition: En rillevidde for en analog sylinder. @no
label: a pour pas de sillonnage @fr
definition: Met une manifestation en relation avec un pas de sillonnage d’un cylindre analogique. @fr
toolkit label: pas de sillonnage @fr
toolkit definition: Pas de sillonnage d’un cylindre analogique. @fr
label: heeft groefpitch @nl
definition: Relateert een manifestatie aan een groefpitch van een analoge cilinder. @nl
toolkit label: groefpitch @nl
toolkit definition: Een groefpitch van een analoge cilinder. @nl
label: له مسار أسطوانة @ar
definition: يربط بين تجسيدة ومسارات مفحورة على اسطوانة تناظرية. @ar
toolkit label: مسار أسطوانة @ar
toolkit definition: مسارات مفحورة على اسطوانة تناظرية. @ar
label: té com a pas de solc @ca
definition: Relaciona una manifestació amb un pas del solc d’un cilindre analògic. @ca
toolkit label: pas de solc @ca
toolkit definition: Pas del solc d’un cilindre analògic. @ca
label: har rilledybde @da
definition: Relaterer en manifestation til en rilledybde på en analog cylinder. @da
toolkit label: rilledybde @da
toolkit definition: Rilledybde på en analog cylinder. @da
label: vao samm @et
definition: Seostab kehastuse analoogtrumli vao sammuga. @et
toolkit label: vao samm @et
toolkit definition: Analoogtrumli vao samm. @et
label: hat Rillenabstand @de
definition: Setzt eine Manifestation in Beziehung zu einem Abstand zwischen den Rillen eines Phonographenzylinders. @de
toolkit label: Rillenabstand @de
toolkit definition: Ein Abstand zwischen den Rillen eines Phonographenzylinders. @de
label: barázdamagassága a következő: @hu
definition: Hozzákapcsol egy megjelenési formát egy analóg henger barázdamagasságához. @hu
toolkit label: barázdamagassága: @hu
toolkit definition: Egy analóg henger barázdamagassága. @hu
label: ha come passo del solco @it
definition: Correla una manifestazione a un passo del solco di un cilindro analogico. @it
toolkit label: passo del solco @it
toolkit definition: Passo del solco di un cilindro analogico. @it
label: rievu blīvums @lv
definition: Sasaista manifestāciju ar analogā cilindra rievu blīvumu. @lv
toolkit label: rievu blīvums @lv
toolkit definition: Analogā cilindra rievu blīvums. @lv
label: 有槽纹间距 @zh-hans
definition: 将一种载体表现与模拟筒的纹槽间距关联起来。 @zh-hans
toolkit label: 槽纹间距 @zh-hans
toolkit definition: 模拟筒的纹槽间距 @zh-hans
alternative label: pas de sillon @fr
label: oluk aralığı ile ilişkilidir @tr
definition: Bir gösterimi, analog bir silindirin kanal aralığı ile ilişkilendirir. @tr
toolkit label: kanal aralığı @tr
toolkit definition: Analog bir silindirin oluk aralığı. @tr
label: tiene paso de ranura @es
definition: Relaciona una manifestación con el paso de una ranura de un cilindro analógico. @es
toolkit label: paso de ranura @es
toolkit definition: El paso de una ranura de un cilindro analógico. @es
has subproperty: P30307

has groove width
status: Published
lexical alias: grooveWidth.en
definition: Relates a manifestation to a groove width of an analog disc.
toolkit label: groove width
toolkit definition: A groove width of an analog disc.
type: Property
domain: C10007
has element type: 4
sub property of: has groove characteristic
label: uran leveys @fi
definition: Liittää manifestaation analogisen levyn uran leveyteen. @fi
toolkit label: uran leveys @fi
toolkit definition: Analogisen levyn uran leveys. @fi
label: har rillebredde @no
definition: Relaterer en manifestasjon til en rillebredde for en analog plate. @no
toolkit label: rillebredde @no
toolkit definition: En rillebredde for en analog plate. @no
label: a pour largeur de sillon @fr
definition: Met une manifestation en relation avec une largeur de sillon d’un disque analogique. @fr
toolkit label: largeur de sillon @fr
toolkit definition: Largeur de sillon d’un disque analogique. @fr
label: heeft groefwijdte @nl
definition: Relateert een manifestatie aan een groefwijdte van een analoge disk. @nl
toolkit label: groefwijdte @nl
toolkit definition: Een groefwijdte van een analoge disk. @nl
label: له عرض مسار قرص @ar
definition: يربط بين تجسيدة وعرض المسار لقرص تناظري. @ar
toolkit label: عرض مسار قرص @ar
toolkit definition: عرض المسار لقرص تناظري. @ar
label: té com a amplada de solc @ca
definition: Relaciona una manifestació amb una amplada del solc d’un disc analògic. @ca
toolkit label: amplada de solc @ca
toolkit definition: Amplada del solc d’un disc analògic. @ca
definition: Relaterer en manifestation til en rillebredde på en analog disk. @da
toolkit definition: Rillebredde på en analog disk. @da
label: vao laius @et
definition: Seostab kehastuse analoogplaadi vao laiusega. @et
toolkit label: vao laius @et
toolkit definition: Analoogplaadi vao laius. @et
label: hat Rillenbreite @de
definition: Setzt eine Manifestation in Beziehung zu einer Breite der Rillen auf einer Schallplatte. @de
toolkit label: Rillenbreite @de
toolkit definition: Eine Breite der Rillen auf einer Schallplatte. @de
label: barázdaszélessége a következő: @hu
definition: Hozzákapcsol egy megjelenési formát egy analóg lemez barázdaszélességéhez. @hu
toolkit label: barázdaszélessége: @hu
toolkit definition: Egy analóg lemez barázdaszélessége. @hu
label: ha come ampiezza del solco @it
definition: Correla una manifestazione a un'ampiezza del solco di un disco analogico. @it
toolkit label: ampiezza del solco @it
toolkit definition: Ampiezza del solco di un disco analogico. @it
label: rievas platums @lv
definition: Sasaista manifestāciju ar analogā diska rievas platumu. @lv
toolkit label: rievas platums @lv
toolkit definition: Analogā diska rievas platums. @lv
label: 有槽纹宽度 @zh-hans
definition: 将一种载体表现与模拟盘的槽纹宽度关联起来。 @zh-hans
toolkit label: 槽纹宽度 @zh-hans
toolkit definition: 模拟盘的槽纹宽度 @zh-hans
label: oluk genişliği ile ilişkilidir @tr
definition: Bir gösterimi, bir analog diskin oluk genişliği ile ilişkilendirir. @tr
toolkit label: kanal genişliği @tr
toolkit definition: Analog bir diskin oluk genişliği. @tr
label: tiene ancho de ranura @es
definition: Relaciona una manifestación con el ancho de una ranura de un disco analógico. @es
toolkit label: ancho de ranura @es
toolkit definition: El ancho de una ranura de un disco analógico. @es
has subproperty: P30308

has frequency (Deprecated)
status: Deprecated
definition: Relates a manifestation to an interval at which an issue or part of a serial or an update to an integrating resource is issued. (Deprecated)
type: Property
domain: C10007
lexical alias: frequency.en
instruction number: 2.14
toolkit label: frequency (Deprecated)
toolkit definition: An interval at which an issue or part of a serial or an update to an integrating resource is issued. (Deprecated)
label: a pour périodicité @fr
definition: Met une manifestation en relation avec un intervalle de temps suivant lequel une livraison ou partie d’une publication en série ou une mise à jour d’une ressource intégratrice est publiée. @fr
toolkit label: périodicité @fr
toolkit definition: Intervalle de temps suivant lequel une livraison ou partie d’une publication en série ou une mise à jour d’une ressource intégratrice est publiée. @fr
toolkit label: frecuencia @es
toolkit definition: El intervalo en el cual se editan las entregas o partes de una publicación seriada o las actualizaciones de un recurso integrado. @es
label: har utgivningsfrekvens @sv
toolkit label: utgivningsfrekvens @sv
toolkit label: frequentie @nl
toolkit definition: Een interval waarmee een aflevering of deel van een seriële publicatie of een update van een integrerende resource wordt uitgebracht. @nl
label: có tần số @vi
definition: Liên kết biểu thị với khoảng thời gian mà số hoặc phần của ấn phẩm nhiều kỳ hoặc cập nhật của tài nguyên tích hợp, được công bố. @vi
toolkit label: tần số @vi
toolkit definition: Khoảng thời gian mà số hoặc phần của ấn phẩm nhiều kỳ hoặc cập nhật của tài nguyên tích hợp, được công bố. @vi
label: har frekvens @da
definition: Relaterer en manifestation til et interval, ved hvilke en series numre eller dele udgives eller det interval der er mellem opdateringer af en integrerende ressource. @da
toolkit label: frekvens @da
toolkit definition: Interval, ved hvilke en series numre eller dele udgives eller det interval der er mellem opdateringer af en integrerende ressource. @da
label: hat Erscheinungsfrequenz @de
definition: Setzt eine Manifestation mit einem Intervall, in dem die Ausgaben oder die Teile einer fortlaufenden Ressource oder die Aktualisierungen einer integrierenden Ressource erscheinen, in Beziehung. @de
toolkit label: Erscheinungsfrequenz @de
toolkit definition: Ein Intervall, in dem die Ausgaben oder die Teile einer fortlaufenden Ressource oder die Aktualisierungen einer integrierenden Ressource erscheinen. @de
label: té com a periodicitat @ca
definition: Relaciona una manifestació amb un interval en el qual es publica un número o una part d’una publicació en sèrie o una actualització d’un recurs integrant. @ca
toolkit label: periodicitat @ca
toolkit definition: Interval en el qual es publica un número o una part d’una publicació en sèrie o una actualització d’un recurs integrant. @ca
label: ilmestymis- tai päivittymistiheys @fi
definition: Liittää manifestaation ilmestymistiheyteen, joka ilmaisee, millaisin aikavälein sarja-aineiston numerot tai osat ilmestyvät tai päivittyvän aineiston päivitykset tapahtuvat. @fi
toolkit label: ilmestymis- tai päivittymistiheys @fi
toolkit definition: Ilmestymistiheys ilmaisee, millaisin aikavälein sarja-aineiston numerot tai osat ilmestyvät tai päivittyvän aineiston päivitykset tapahtuvat. @fi
toolkit definition: Et intervall for utgivelse av hefter eller deler av et periodikum eller oppdateringer til en integrerende ressurs. @no
label: έχει συχνότητα @el
definition: Συνδέει μια εκδήλωση με ένα διάστημα στο οποίο ένα τεύχος ή μέρος ενός περιοδικού ή μια ενημέρωση ενός ενσωματωμένου πόρου ή πόρου διαρκούς ενημέρωσης/ανανέωσης εκδίδεται. @el
toolkit label: συχνότητα @el
toolkit definition: Ένα διάστημα στο οποίο ένα τεύχος ή μέρος ενός περιοδικού ή μια ενημέρωση ενός ενσωματωμένου πόρου ή πόρου διαρκούς ενημέρωσης/ανανέωσης εκδίδεται. @el
has element type: 4
label: van gyakorisága @hu
definition: Egy megjelenési formát hozzákapcsol egy intervallumhoz, amelyben egy periodika egy számát vagy részét vagy egy integráló forrás frissítését megjelentetik. @hu
toolkit label: gyakoriság @hu
toolkit definition: Egy időtartam vagy intervallum, amelyben egy periodika egy száma vagy egy része vagy egy integráló forrás frissítése kiadásra kerül. @hu
has subproperty: P30168

has place of manufacture
status: Published
definition: Relates a manifestation to a place that is associated with the printing, duplicating, casting, or other method of manufacturing of a published manifestation.
type: Property
domain: C10007
lexical alias: placeOfManufacture.en
instruction number: 2.10.2
toolkit label: place of manufacture
toolkit definition: A place that is associated with the printing, duplicating, casting, or other method of manufacturing of a published manifestation.
label: a pour lieu de fabrication @fr
definition: Met une manifestation en relation avec un lieu qui est associé à l’impression, à la reproduction, au moulage ou à toute autre méthode de fabrication d’une manifestation publiée. @fr
toolkit label: lieu de fabrication @fr
toolkit definition: Lieu qui est associé à l’impression, à la reproduction, au moulage ou à toute autre méthode de fabrication d’une manifestation publiée. @fr
toolkit label: lugar de fabricación @es
toolkit definition: Un lugar asociado con la impresión, duplicación, fundición u otro método de fabricación de una manifestación publicada. @es
label: har tillverkningsort @sv
toolkit label: tillverkningsort @sv
toolkit label: plaats van vervaardiging @nl
toolkit definition: Een plaats die geassocieerd is met het drukken, vermeerderen, gieten of andere methode van het vervaardigen van een gepubliceerde manifestatie. @nl
label: có địa điểm chế tạo @vi
definition: Liên kết biểu thị với địa điểm liên quan tới in, nhân bản, đúc, v.v..., biểu thị dưới hình thái xuất bản. @vi
toolkit label: địa điểm chế tạo @vi
toolkit definition: Địa điểm liên quan tới in, nhân bản, đúc, v.v..., biểu thị dưới hình thái xuất bản. @vi
label: har fremstillingssted @da
definition: Relaterer en manifestation til et sted forbundet med trykning, duplikering, støbning etc. af en publiceret manifestation. @da
toolkit label: fremstillingssted @da
toolkit definition: Sted forbundet med trykning, duplikering, støbning etc. af en publiceret manifestation. @da
label: hat Herstellungsort @de
definition: Setzt eine Manifestation in Beziehung zu einem Geografikum, das mit dem Druck, der Vervielfältigung, dem Guss oder einer anderen Herstellungsmethode einer veröffentlichten Manifestation in Verbindung steht. @de
toolkit label: Herstellungsort @de
toolkit definition: Ein Geografikum, das mit dem Druck, der Vervielfältigung, dem Guss oder einer anderen Herstellungsmethode einer veröffentlichten Manifestation in Verbindung steht. @de
label: té com a lloc de fabricació @ca
definition: Relaciona una manifestació amb un lloc que s’associa amb la impressió, la reproducció, el modelat o un altre mètode de fabricació d’una manifestació publicada. @ca
toolkit label: lloc de fabricació @ca
toolkit definition: Lloc que s’associa amb la impressió, la reproducció, el modelat o un altre mètode de fabricació d’una manifestació publicada. @ca
definition: Liittää manifestaation paikkaan, joka liittyy julkaistun manifestaation painamiseen, monistamiseen, kirjasinten valamiseen tai muuhun valmistustapaan. @fi
toolkit label: valmistuspaikka @fi
toolkit definition: Paikka, joka liittyy julkaistun manifestaation painamiseen, monistamiseen, kirjasinten valamiseen tai muuhun valmistustapaan. @fi
toolkit label: framstillingssted @no
toolkit definition: Et sted som forbindes med trykking, mangfoldiggjøring, etc. av en publisert manifestasjon. @no
label: έχει τόπο κατασκευής @el
definition: Συνδέει μια εκδήλωση με έναν τόπο που συνδέεται με την εκτύπωση, την αντιγραφή, τη χύτευση κ.λπ. μιας εκδήλωσης σε μια δημοσιευμένη μορφή. @el
toolkit label: τόπος κατασκευής @el
toolkit definition: Ένας τόπος που συνδέεται με την εκτύπωση, την αντιγραφή, τη χύτευση κ.λπ. μιας εκδήλωσης σε μια δημοσιευμένη μορφή. @el
sub property of: has place of manifestation
has element type: 3
label: gyártás helye a következő: @hu
definition: Hozzákapcsol egy megjelenési formát egy helyhez, amely egy kiadott megjelenési forma nyomtatásához, sokszorosításához, öntéséhez vagy más módú gyártásához kapcsolódik. @hu
toolkit label: gyártás helye: @hu
toolkit definition: Egy hely, amely egy kiadott megjelenési forma nyomtatásához, sokszorosításához, öntéséhez vagy más módú gyártásához kapcsolódik. @hu
label: valmistuspaikka @fi
label: har framstillingssted @no
definition: Relaterer en manifestasjon til et sted som forbindes med trykking, mangfoldiggjøring, etc. av en publisert manifestasjon. @no
label: heeft plaats van vervaardiging @nl
definition: Relateert een manifestatie aan een plaats die geassocieerd is met het drukken, vermeerderen, gieten of andere methode van het vervaardigen van een gepubliceerde manifestatie. @nl
label: له مكان تصنيع @ar
definition: يربط بين تجسيدة ومكان مرتبط بطبع، أو نسخ، أو بث، إلخ. تجسيدة منشورة. @ar
toolkit label: مكان تصنيع @ar
toolkit definition: مكان مرتبط بطبع، أو نسخ، أو بث، إلخ. تجسيدة منشورة. @ar
label: valmistamiskoht @et
definition: Seostab kehastuse kohaga, mis on seotud avaldatud kehastuse trükkimisega, paljundamisega, valamisega vms. @et
toolkit label: valmistamiskoht @et
toolkit definition: Koht, mis on seotud avaldatud kehastuse trükkimisega, paljundamisega, valamisega vms. @et
label: ha come luogo di manifattura @it
definition: Correla una manifestazione a un luogo associato alla stampa, duplicazione, fusione, etc. di una manifestazione pubblicata. @it
toolkit label: luogo di manifattura @it
toolkit definition: Luogo associato alla stampa, duplicazione, fusione, etc. di una manifestazione pubblicata. @it
label: ražošanas vieta @lv
definition: Sasaista manifestāciju ar vietu, kas saistīta ar publicētās manifestācijas iespiešanu, pavairošanu, iesiešanu u.tml. @lv
toolkit label: ražošanas vieta @lv
toolkit definition: Vieta, kas saistīta ar publicētās manifestācijas iespiešanu, pavairošanu, iesiešanu u.tml. @lv
label: 有生产地 @zh-hans
definition: 将一种载体表现与和一种出版载体表现的印刷、复制、铸造或其他生产方法有关的一个地点关联起来。 @zh-hans
toolkit label: 生产地 @zh-hans
toolkit definition: 和一种出版载体表现的印刷、复制、铸造或其他生产方法有关的一个地点 @zh-hans
label: üretim yeri ile ilişkilidir @tr
definition: Bir gösterimi, yayınlanmış bir gösterimin basılması, çoğaltılması, dökümü veya başka bir üretim yöntemiyle ilişkili bir yerle ilişkilendirir. @tr
toolkit label: üretim yeri @tr
toolkit definition: Yayınlanmış bir gösterimin basımı, çoğaltılması, dökümü veya diğer üretim yöntemleriyle bağlantılı olan bir yer. @tr
label: tiene lugar de fabricación @es

has date of manufacture
status: Published
definition: Relates a manifestation to a timespan during which a published manifestation is printed, duplicated, cast, or otherwise manufactured.
type: Property
domain: C10007
lexical alias: dateOfManufacture.en
instruction number: 2.10.6
toolkit label: date of manufacture
toolkit definition: A timespan during which a published manifestation is printed, duplicated, cast, or otherwise manufactured.
label: a pour date de fabrication @fr
definition: Met une manifestation en relation avec un laps de temps pendant lequel une manifestation publiée est imprimée, reproduite, moulée ou fabriquée d’une autre manière. @fr
toolkit label: date de fabrication @fr
toolkit definition: Laps de temps pendant lequel une manifestation publiée est imprimée, reproduite, moulée ou fabriquée d’une autre manière. @fr
toolkit label: fecha de fabricación @es
toolkit definition: Un espacio de tiempo durante el cual una manifestación publicada es impresa, duplicada, fundida, o de otra manera producida. @es
label: har tillverkningstid @sv
toolkit label: tillverkningstid @sv
toolkit label: datum van vervaardiging @nl
toolkit definition: Een tijdspanne gedurende waarvan een gepubliceerde manifestatie is gedrukt, gedupliceerd, gegoten of anderszins vervaardigd. @nl
label: có ngày chế tạo @vi
definition: Liên kết biểu thị với ngày liên quan tới tin, nhân bản, đúc, v.v..., của biểu thị dưới hình thái xuất bản. @vi
toolkit label: ngày chế tạo @vi
toolkit definition: Ngày liên quan tới tin, nhân bản, đúc, v.v..., của biểu thị dưới hình thái xuất bản. @vi
label: har dato for fremstilling @da
definition: Relaterer en manifestation til en tidsperiode knyttet til trykning, duplikering, støbning etc. af en publiceret manifestation. @da
toolkit label: dato for fremstilling @da
toolkit definition: Tidsperiode knyttet til trykning, duplikering, støbning etc. af en publiceret manifestation. @da
label: ist Herstellungsdatum @de
definition: Setzt eine Manifestation in Beziehung zu einem Zeitraum, in dem eine veröffentlichte Manifestation gedruckt, vervielfältigt, gegossen oder anderweitig hergestellt wird. @de
toolkit label: Herstellungsdatum von @de
toolkit definition: Ein Zeitraum, in dem eine veröffentlichte Manifestation gedruckt, vervielfältigt, gegossen oder anderweitig hergestellt wird. @de
label: té com a data de fabricació @ca
definition: Relaciona una manifestació amb un interval de temps durant el qual una manifestació publicada s’imprimeix, es duplica, es modela o es fabrica d’una altra manera. @ca
toolkit label: data de fabricació @ca
toolkit definition: Interval de temps durant el qual una manifestació publicada s’imprimeix, es duplica, es modela o es fabrica d’una altra manera. @ca
definition: Liittää manifestaation julkaistun manifestaation painamiseen, monistamiseen, kirjasinten valamiseen tai muuhun valmistamiseen liittyvään ajanjaksoon. @fi
toolkit label: valmistusaika @fi
toolkit definition: Julkaistun manifestaation painamiseen, monistamiseen, kirjasinten valamiseen tai muuhun valmistamiseen liittyvä ajanjakso. @fi
toolkit label: tidsrom for framstilling @no
toolkit definition: Et tidsrom som forbindes med trykking, mangfoldiggjøring, etc. av en utgitt manifestasjon. @no
label: έχει χρονολογία της κατασκευής @el
definition: Συνδέει μια εκδήλωση με μια χρονολογία που συνδέεται με την εκτύπωση, την αντιγραφή, τη χύτευση κ.λπ. μιας εκδήλωσης σε μια δημοσιευμένη μορφή. @el
toolkit label: χρονολογία της κατασκευής @el
toolkit definition: Mια χρονολογία που συνδέεται με την εκτύπωση, την αντιγραφή, τη χύτευση κ.λπ. μιας εκδήλωσης σε μια δημοσιευμένη μορφή. @el
sub property of: has date of manifestation
has element type: 3
label: gyártás időpontja a következő: @hu
definition: Hozzákapcsol egy megjelenési formát egy időtartamhoz, amely alatt egy kiadott megjelenési formát nyomtattak, sokszorosítottak, öntöttek vagy egyéb módon gyártotak. @hu
toolkit label: gyártás időpontja: @hu
toolkit definition: Egy időtartam, amely alatt egy kiadott megjelenési formát nyomtattak, sokszorosítottak, öntöttek vagy egyéb módon gyártotak. @hu
label: valmistusaika @fi
label: har tidsrom for framstilling @no
definition: Relaterer en manifestasjon til et tidsrom som forbindes med trykking, mangfoldiggjøring, etc. av en utgitt manifestasjon. @no
label: heeft datum van vervaardiging @nl
definition: Relateert een manifestatie aan een tijdspanne gedurende waarvan een gepubliceerde manifestatie is gedrukt, gedupliceerd, gegoten of anderszins vervaardigd. @nl
label: له تاريخ تصنيع @ar
definition: يربط بين تجسيدة وفترة زمنية مرتبطة بوقت الطباعة، أو النسخ، أو سبك، إلخ. لتجسيدة منشورة. @ar
toolkit label: تاريخ تصنيع @ar
toolkit definition: فترة زمنية مرتبطة بوقت الطباعة، أو النسخ، أو سبك، إلخ. لتجسيدة منشورة. @ar
label: valmistamisaeg @et
definition: Seostab kehastuse ajavahemikuga, mis on seotud avaldatud kehastuse trükkimisega, paljundamisega, valamisega vms. @et
toolkit label: valmistamisaeg @et
toolkit definition: Ajavahemik, mis on seotud avaldatud kehastuse trükkimisega, paljundamisega, valamisega vms. @et
label: ha come data di manifattura @it
definition: Correla una manifestazione a un arco di tempo associato alla stampa, duplicazione, fusione, etc., di una manifestazione pubblicata. @it
toolkit label: data di manifattura @it
toolkit definition: Arco di tempo associato alla stampa, duplicazione, fusione, etc., di una manifestazione pubblicata. @it
label: ražošanas datējums @lv
definition: Sasaista manifestāciju ar laikposmu, kas ir saistīts ar publicētas manifestācijas iespiešanu, tiražēšanu, u.tml. @lv
toolkit label: ražošanas datējums @lv
toolkit definition: Laikposms, kas ir saistīts ar publicētas manifestācijas iespiešanu, tiražēšanu, u.tml. @lv
label: 有生产日期 @zh-hans
definition: 将一种载体表现与出版载体表现的印刷、复制、铸造或其他生产方式的时间段关联起来。 @zh-hans
toolkit label: 生产日期 @zh-hans
toolkit definition: 出版载体表现的印刷、复制、铸造或其他生产方式的时间段 @zh-hans
label: imalat tarihi ile ilişkilidir @tr
definition: Bir gösterimi, yayınlanan bir gösterimin yazdırıldığı, çoğaltıldığı, döküldüğü, döküldüğü veya başka bir şekilde üretildiği bir zaman aralığıyla ilişkilendirir. @tr
toolkit label: üretim tarihi @tr
toolkit definition: Yayınlanan bir gösterimin basıldığı, çoğaltıldığı, döküldüğü veya başka bir şekilde üretildiği bir zaman aralığı. @tr
label: tiene fecha de fabricación @es

has manufacture statement
status: Published
definition: Relates a manifestation to a statement that identifies a place of manufacture, a manufacturer, or a date of manufacture of a published manifestation.
type: Property
domain: C10007
lexical alias: manufactureStatement.en
scope note: A manufacture statement includes a statement about the printing, duplicating, casting, or other method of manufacturing of a published manifestation.
toolkit label: manufacture statement
toolkit definition: A statement that identifies a place of manufacture, a manufacturer, or a date of manufacture of a published manifestation.
label: a pour mention de fabrication @fr
definition: Met une manifestation en relation avec une mention qui identifie un lieu de fabrication, un fabricant ou une date de fabrication d’une manifestation publiée. @fr
scope note: Une mention de fabrication comprend une mention relative à l’impression, à la reproduction, au moulage ou à toute autre méthode de fabrication d’une manifestation publiée. @fr
toolkit label: mention de fabrication @fr
toolkit definition: Mention qui identifie un lieu de fabrication, un fabricant ou une date de fabrication d’une manifestation publiée. @fr
toolkit label: declaración de fabricación @es
toolkit definition: Una declaración que identifica un lugar de fabricación, un fabricante o una fecha de fabricación de una manifestación publicada. @es
label: har tillverkningsuppgift @sv
toolkit label: tillverkningsuppgift @sv
toolkit label: vervaardigingsvermelding @nl
toolkit definition: Een vermelding die een plaats van vervaardiging, een vervaardiger of datum van vervaardiging identificeert van een gepubliceerde manifestatie. @nl
label: có thông tin chế tạo @vi
definition: Liên kết biểu thị với thông tin nhận dạng địa điểm hoặc các địa điểm chế tạo, nhà chế tạo hoặc các nhà chế tạo, và ngày hoặc các ngày chế tạo của biểu thị dưới hình thái xuất bản. @vi
scope note: Thông tin chế tạo bao gồm thông tin liên quan tới in, nhân sao, đúc, v.v..., của biểu thị dưới hình thái xuất bản. @vi
toolkit label: thông tin chế tạo @vi
toolkit definition: Thông tin nhận dạng địa điểm hoặc các địa điểm chế tạo, nhà chế tạo hoặc các nhà chế tạo, và ngày hoặc các ngày chế tạo của biểu thị dưới hình thái xuất bản. @vi
scope note: Een vervaardigingsvermelding omvat een vermelding met betrekking tot het drukken, reproduceren, gieten of andere methode van het vervaardigen van een gepubliceerde manifestatie. @nl
label: har fremstillingsoplysning @da
definition: Relaterer en manifestation til en oplysning, som identificerer fremstillingssted- eller steder, producent eller producenter, og dato- eller datoer for fremstilling af en publiceret manifestation. @da
scope note: Fremstillingsoplysning omfatter en oplysning, som relaterer til trykning, duplikering, casting etc. af en publiceret manifestation. @da
toolkit label: fremstillingsoplysning @da
toolkit definition: Oplysning, som identificerer fremstillingssted, producent eller producenter, og dato- eller datoer for fremstilling af en publiceret manifestation. @da
label: hat Herstellungsangabe @de
definition: Setzt eine Manifestation in Beziehung zu einer Angabe, die einen Herstellungsort, einen Hersteller oder ein Herstellungsdatum einer veröffentlichten Manifestation identifiziert. @de
scope note: Darunter fallen Angaben zum Druck, zur Vervielfältigung, zum Guss oder einer anderen Herstellungsmethode einer veröffentlichten Manifestation. @de
toolkit label: Herstellungsangabe @de
toolkit definition: Eine Angabe, die einen Herstellungsort, einen Hersteller oder ein Herstellungsdatum einer veröffentlichten Manifestation identifiziert. @de
label: té com a menció de fabricació @ca
definition: Relaciona una manifestació amb una menció que identifica un lloc de fabricació, un fabricant o una data de fabricació d’una manifestació publicada. @ca
scope note: Una menció de fabricació inclou una menció sobre la impressió, la reproducció, el modelat o un altre mètode de fabricació d’una manifestació publicada. @ca
toolkit label: menció de fabricació @ca
toolkit definition: Menció que identifica un lloc de fabricació, un fabricant o una data de fabricació d’una manifestació publicada. @ca
definition: Liittää manifestaation merkintöön, joka identifioi julkaistun manifestaation valmistuspaikan, valmistajan tai valmistusajan. @fi
toolkit label: valmistusmerkintö @fi
toolkit definition: Merkintö, joka identifioi julkaistun manifestaation valmistuspaikan, valmistajan tai valmistusajan. @fi
toolkit label: framstillingsangivelse @no
toolkit definition: En angivelse som identifiserer et sted eller steder for framstilling, tilvirker eller tilvirkere og dato eller datoer for framstilling av en publisert manifestasjon. @no
label: έχει μνεία κατασκευής @el
definition: Συνδέει μια εκδήλωση με μια μνεία που ταυτίζει έναν τόπο ή τόπους κατασκευής, έναν κατασκευαστή ή κατασκευαστές και μια χρονολογία ή χρονολογίες κατασκευής μιας εκδήλωσης σε μια δημοσιευμένη μορφή. @el
scope note: Οι μνείες κατασκευής περιλαμβάνουν μνείες σχετικές με την εκτύπωση, την αντιγραφή, τη χύτευση κ.λπ. μιας εκδήλωσης σε μια δημοσιευμένη μορφή. @el
toolkit label: μνεία κατασκευής @el
toolkit definition: Μια μνεία που ταυτίζει έναν τόπο ή τόπους κατασκευής, έναν κατασκευαστή ή κατασκευαστές και μια χρονολογία ή χρονολογίες κατασκευής μιας εκδήλωσης σε μια δημοσιευμένη μορφή. @el
has element type: 6
label: gyártási közlése a következő: @hu
definition: Hozzákapcsol egy megjelenési formát egy közléshez, amely azonosítja egy kiadott megjelenési forma gyártási helyét, gyártóját és a gyártás időpontját. @hu
scope note: gyártási közlése: @hu
toolkit label: Egy közlés, amely azonosítja egy kiadott megjelenési forma gyártási helyét, gyártóját és a gyártás időpontját. @hu
toolkit definition: A gyártási közlések olyan közléseket tartalmaznak, amelyek egy kiadott megjelenési forma nyomtatására, sokszorosítására, öntésére, stb. vonatkoznak. @hu
scope note: Valmistusmerkintö sisältää julkaistun manifestaation painamiseen, monistamiseen, kirjasinten valamiseen tms. liittyvän merkinnön. @fi
instruction number: 2.1
label: valmistusmerkintö @fi
label: har framstillingsangivelse @no
definition: Relaterer en manifestasjon til en angivelse som identifiserer et sted eller steder for framstilling, tilvirker eller tilvirkere og dato eller datoer for framstilling av en publisert manifestasjon. @no
scope note: En framstillingsangivelse inkluderer angivelse knyttet til trykking, kopiering, rollebesettelse etc. for en publisert manifestasjon. @no
label: heeft vervaardigingsvermelding @nl
definition: Relateert een manifestatie aan een vermelding die een plaats van vervaardiging, een vervaardiger of een datum van vervaardiging identificeert van een gepubliceerde manifestatie. @nl
label: له بيان تصنيع @ar
definition: يربط بين تجسيدة وبيان يحدد مكان أو أماكن تصنيع، ومصنع أو مصنعون، وتاريخ أو تواريخ تصنيع خاص بتجسيدة منشورة. @ar
scope note: يشمل بيان الصناعة البيان المرتبط بالطباعة، أو النسخ، أو الصب، إلخ. لتجسيدة منشورة. @ar
toolkit label: بيان تصنيع @ar
toolkit definition: بيان يحدد مكان أو أماكن تصنيع، ومصنع أو مصنعون، وتاريخ أو تواريخ تصنيع خاص بتجسيدة منشورة. @ar
label: valmistamisandmed @et
definition: Seostab kehastuse andmetega, mis identifitseerivad avaldatud kehastuse valmistamiskoha(d), valmistaja(d) ja valmistamisaja(d). @et
scope note: Valmistamisandmed hõlmavad andmeid, mis on seotud avaldatud kehastuse trükkimisega, paljundamisega, valamisega vms. @et
toolkit label: valmistamisandmed @et
toolkit definition: Andmed, mis identifitseerivad avaldatud kehastuse valmistamiskoha(d), valmistaja(d) ja valmistamisaja(d). @et
label: ha come formulazione di manifattura @it
definition: Correla una manifestazione a una formulazione che identifica il luogo o i luoghi di manifattura, la manifattura o le manifatture e la data o le date di manifattura di una manifestazione pubblicata. @it
scope note: Una formulazione di manifattura comprende una formulazione relativa alla stampa, duplicazione, fusione, etc., di una manifestazione pubblicata. @it
toolkit label: formulazione di manifattura @it
toolkit definition: Formulazione che identifica il luogo o i luoghi di manifattura, la manifattura o le manifatture e la data o le date di manifattura di una manifestazione pubblicata. @it

has production method
status: Published
definition: Relates a manifestation to a process that is used to produce a manifestation.
type: Property
domain: C10007
lexical alias: productionMethod.en
instruction number: 3.9
toolkit label: production method
toolkit definition: A process that is used to produce a manifestation.
label: a pour méthode de production @fr
definition: Met une manifestation en relation avec un procédé qui est utilisé pour produire une manifestation. @fr
toolkit label: méthode de production @fr
toolkit definition: Procédé qui est utilisé pour produire une manifestation. @fr
toolkit label: método de producción @es
toolkit definition: Un proceso que se utiliza para producir una manifestación. @es
label: har produktionsmetod @sv
toolkit label: produktionsmetod @sv
toolkit label: productiemethode @nl
toolkit definition: Een procedé dat is gebruikt om een manifestatie te produceren. @nl
label: có phương pháp sản xuất @vi
definition: Liên kết biểu thị với quy trình được sử dụng để sản xuất biểu thị. @vi
toolkit label: phương pháp sản xuất @vi
toolkit definition: Quy trình được sử dụng để sản xuất biểu thị. @vi
label: har produktionsmetode @da
definition: Relaterer en manifestation til en proces, som bruges til at producere en manifestation. @da
toolkit label: produktionsmetode @da
toolkit definition: Proces, som bruges til at producere en manifestation. @da
label: hat Entstehungsmethode @de
definition: Setzt eine Manifestation in Beziehung zu einem Verfahren, das angewendet wird, um eine Manifestation zu erzeugen. @de
toolkit label: Entstehungsmethode @de
toolkit definition: Ein Verfahren, das angewendet wird, um eine Manifestation zu erzeugen. @de
label: té com a mètode de producció @ca
definition: Relaciona una manifestació amb un procés que s’usa per produir una manifestació. @ca
toolkit label: mètode de producció @ca
toolkit definition: Procés que s’usa per produir una manifestació. @ca
definition: Liittää manifestaation manifestaation tuottamisessa käytettävään menetelmään. @fi
toolkit label: valmistusmenetelmä @fi
toolkit definition: Manifestaation tuottamisessa käytettävä menetelmä. @fi
toolkit label: produksjonsmetode @no
toolkit definition: En prosess brukt for å produsere en manifestasjon. @no
label: έχει μέθοδο παραγωγής @el
definition: Συνδέει μια εκδήλωση με μια διαδικασία που χρησιμοποιείται για την παραγωγή μιας εκδήλωσης. @el
toolkit label: μέθοδος παραγωγής @el
toolkit definition: Μια διαδικασία που χρησιμοποιείται για την παραγωγή μιας εκδήλωσης. @el
has element type: 4
label: előállítási módszere a következő: @hu
definition: Hozzákapcsol egy megjelenési formát egy eljáráshoz, amelyet egy megjelenési forma előállítására használnak. @hu
toolkit label: előállítási módszere: @hu
toolkit definition: Egy eljárás, amelyet egy megjelenési forma előállítására használnak. @hu
label: valmistusmenetelmä @fi
label: har produksjonsmetode @no
definition: Relaterer en manifestasjon til en prosess brukt for å produsere en manifestasjon. @no
label: heeft productiemethode @nl
definition: Relateert een manifestatie aan een procedé dat is gebruikt om een manifestatie te produceren. @nl
label: له طريقة إنتاج @ar
definition: يربط بين تجسيدة وعملية مستخدمة في إنتاج تجسيدة. @ar
toolkit label: طريقة إنتاج @ar
toolkit definition: عملية مستخدمة في إنتاج تجسيدة. @ar
label: valmistamisviis @et
definition: Seostab kehastuse kehastuse valmistamiseks kasutatud protsessiga. @et
toolkit label: valmistamisviis @et
toolkit definition: Kehastuse valmistamiseks kasutatud protsess. @et
label: ha come metodo di produzione @it
definition: Correla una manifestazione a un processo utilizzato nella produzione di una manifestazione. @it
toolkit label: metodo di produzione @it
toolkit definition: Processo utilizzato nella produzione di una manifestazione. @it
label: izgatavošanas metode @lv
definition: Sasaista manifestāciju ar manifestācijas izgatavošanas procesu. @lv
toolkit label: izgatavošanas metode @lv
toolkit definition: Manifestācijas izgatavošanas process. @lv
label: 有制作方法 @zh-hans
definition: 将一种载体表现与用于制作一种载体表现的一个过程关联起来。 @zh-hans
toolkit label: 制作方法 @zh-hans
toolkit definition: 用于制作一种载体表现的一个过程 @zh-hans
label: yapım yöntemi ile ilişkilidir @tr
definition: Bir gösterimi, gösterimi üretmek için kullanılan bir süreçle ilişkilendirir. @tr
toolkit label: üretim yöntemi @tr
toolkit definition: Bir gösterim üretmek için kullanılan bir süreç. @tr
label: tiene método de producción @es
definition: Relaciona una manifestación con un proceso que se utiliza para producir una manifestación. @es

has parallel place of manufacture
status: Published
definition: Relates a manifestation to a place of manufacture in another language or script.
type: Property
domain: C10007
lexical alias: parallelPlaceOfManufacture.en
instruction number: 2.10.3
toolkit label: parallel place of manufacture
toolkit definition: A place of manufacture in another language or script.
label: a pour forme parallèle d’un lieu de fabrication @fr
definition: Met une manifestation en relation avec un lieu de fabrication dans une autre langue ou écriture. @fr
toolkit label: forme parallèle d’un lieu de fabrication @fr
toolkit definition: Lieu de fabrication dans une autre langue ou écriture. @fr
toolkit label: lugar de fabricación paralelo @es
toolkit definition: Un lugar de fabricación en otra lengua o escritura. @es
label: har parallell tillverkningsort @sv
toolkit label: parallell tillverkningsort @sv
toolkit label: parallelle plaats van vervaardiging @nl
toolkit definition: Een plaats van vervaardiging in een andere taal of schrift. @nl
label: có địa điểm chế tạo song song @vi
definition: Liên kết biểu thị với địa điểm chế tạo trong ngôn ngữ hoặc hệ thống viết khác với được ghi trong yếu tố địa điểm chế tạo. @vi
toolkit label: địa điểm chế tạo song song @vi
toolkit definition: Địa điểm chế tạo trong ngôn ngữ hoặc hệ thống viết khác với được ghi trong yếu tố địa điểm chế tạo. @vi
label: har parallelt fremstillingssted @da
definition: Relaterer en manifestation til et fremstillingssted på et andet sprog eller skriftsystem. @da
toolkit label: parallelt fremstillingssted @da
toolkit definition: Fremstillingssted på et andet sprog eller skriftsystem. @da
label: hat parallelen Herstellungsort @de
definition: Setzt eine Manifestation in Beziehung zu einem Herstellungsort in einer anderen Sprache oder einer anderen Schrift. @de
toolkit label: Paralleler Herstellungsort @de
toolkit definition: Ein Herstellungsort in einer anderen Sprache oder einer anderen Schrift. @de
label: té com a lloc paral·lel de fabricació @ca
definition: Relaciona una manifestació amb un lloc de fabricació en una altra llengua o escriptura. @ca
toolkit label: lloc paral·lel de fabricació @ca
toolkit definition: Lloc de fabricació en una altra llengua o escriptura. @ca
definition: Liittää manifestaation valmistuspaikkaan toisella kielellä ja/tai kirjoitusjärjestelmällä. @fi
toolkit label: rinnakkainen valmistuspaikka @fi
toolkit definition: Valmistuspaikka toisella kielellä ja/tai kirjoitusjärjestelmällä. @fi
toolkit label: parallelt framstillingssted @no
toolkit definition: Et framstillingssted på et annet språk eller i et annet skriftsystem. @no
label: έχει παράλληλο τόπο κατασκευής @el
definition: Συνδέει μια εκδήλωση με έναν τόπο κατασκευής σε μια γλώσσα ή γραφή που διαφέρει από εκείνη με την οποία καταχωρίστηκε στο στοιχείο του τόπου κατασκευής. @el
toolkit label: παράλληλος τόπος κατασκευής @el
toolkit definition: Ένας τόπος κατασκευής σε μια γλώσσα ή γραφή που διαφέρει από εκείνη με την οποία καταχωρίστηκε στο στοιχείο του τόπου κατασκευής. @el
sub property of: has place of manufacture
has element type: 3
label: párhuzamos gyártási helye a következő: @hu
definition: Hozzákapcsol egy megjelenési formát egy gyártási helyhez más nyelven vagy írásrendszerben. @hu
toolkit label: párhuzamos gyártási helye: @hu
toolkit definition: Gyártási hely más nyelven vagy írásrendszerben. @hu
label: rinnakkainen valmistuspaikka @fi
label: har parallelt framstillingssted @no
definition: Relaterer en manifestasjon til et framstillingssted på et annet språk eller i et annet skriftsystem. @no
label: heeft parallelle plaats van vervaardiging @nl
definition: Relateert een manifestatie aan een plaats van vervaardiging in een andere taal of schrift. @nl
label: له مكان تصنيع موازي @ar
definition: يربط بين تجسيدة ومكان تصنيع تجسيدة في لغة أخرى أو نظام آخر للحروف. @ar
toolkit label: مكان تصنيع موازي @ar
toolkit definition: مكان تصنيع تجسيدة في لغة أخرى أو نظام آخر للحروف. @ar
label: valmistamiskoha rööpandmed @et
definition: Seostab kehastuse valmistamiskohaga teises keeles või kirjasüsteemis. @et
toolkit label: valmistamiskoha rööpandmed @et
toolkit definition: Valmistamiskoht teises keeles või kirjasüsteemis. @et
label: ha come luogo di manifattura parallelo @it
definition: Correla una manifestazione a un luogo di manifattura, in una lingua o scrittura diversa. @it
toolkit label: luogo di manifattura parallelo @it
toolkit definition: Luogo di manifattura in una lingua o scrittura diversa. @it
label: paralēlā ražošanas vieta @lv
definition: Sasaista manifestāciju ar ražošanas vietu citā valodā un vai rakstībā. @lv
toolkit label: paralēlā ražošanas vieta @lv
toolkit definition: Ražošanas vieta citā valodā un vai rakstībā. @lv
label: 有并列生产地 @zh-hans
definition: 将一种载体表现与用另一种语言或文字的生产地关联起来。 @zh-hans
toolkit label: 并列生产地 @zh-hans
toolkit definition: 用另一种语言或文字的生产地 @zh-hans
label: paralel üretim yeri ile ilişkilidir @tr
definition: Bir gösterimi, başka bir dil veya alfabedeki bir üretim yeri ile ilişkilendirir. @tr
toolkit label: paralel üretim yeri @tr
toolkit definition: Başka bir dil veya yazıda imalat yeri. @tr
label: tiene un lugar de fabricación paralelo @es

has name of manufacturer
status: Published
definition: Relates a manifestation to a nomen that is a name of an agent who is responsible for printing, duplicating, casting, or other method of manufacturing a published manifestation.
type: Property
domain: C10007
lexical alias: nameOfManufacturer.en
instruction number: 2.10.4
toolkit label: name of manufacturer
toolkit definition: A nomen that is a name of an agent who is responsible for printing, duplicating, casting, or other method of manufacturing a published manifestation.
label: a pour nom de fabricant @fr
definition: Met une manifestation en relation avec un nomen qui est un nom d’un agent responsable de l’impression, de la reproduction, du moulage ou de toute autre méthode de fabrication d’une manifestation publiée. @fr
toolkit label: nom de fabricant @fr
toolkit definition: Nomen qui est un nom d’un agent responsable de l’impression, de la reproduction, du moulage ou de toute autre méthode de fabrication d’une manifestation publiée. @fr
toolkit label: nombre del fabricante @es
toolkit definition: Un nomen que es el nombre de un agente responsable de imprimir, duplicar, moldear u otro método de fabricación de una manifestación publicada. @es
label: har tillverkarnamn @sv
toolkit label: tillverkarnamn @sv
toolkit label: naam van vervaardiger @nl
toolkit definition: Een nomen dat is een naam van een actor die verantwoordelijk is voor het drukken, dupliceren, gieten of andere methode van vervaardigen van een gepubliceerde manifestatie. @nl
label: có tên nhà chế tạo @vi
definition: Liên kết biểu thị với tên của tác nhân có trách nhiệm về in, nhân bản, đíc, v.v..., biểu thị dưới hình thái xuất bản. @vi
toolkit label: tên nhà chế tạo @vi
toolkit definition: Tên của tác nhân có trách nhiệm về in, nhân bản, đíc, v.v..., biểu thị dưới hình thái xuất bản. @vi
label: har navn på producent @da
definition: Relaterer en manifestation til et navn på en agent, som er ansvarlig for trykning, duplikering, støbning etc. af en publiceret manifestation. @da
toolkit label: navn på producent @da
toolkit definition: Navn på en agent, som er ansvarlig for trykning, duplikering, støbning etc. af en publiceret manifestation. @da
label: hat Herstellername @de
definition: Setzt eine Manifestation in Beziehung zum Namen eines Akteurs, der für den Druck, die Vervielfältigung, den Guss oder eine andere Herstellungsmethode einer veröffentlichten Manifestation verantwortlich ist. @de
toolkit label: Herstellername @de
toolkit definition: Ein Name eines Akteurs, der für den Druck, die Vervielfältigung, den Guss oder eine andere Herstellungsmethode einer veröffentlichten Manifestation verantwortlich ist. @de
label: té com a nom de fabricant @ca
definition: Relaciona una manifestació amb un nomen que és un nom d’un agent que és responsable de la impressió, la reproducció, el modelat o un altre mètode de fabricació d’una manifestació publicada. @ca
toolkit definition: Nomen que és un nom d’un agent que és responsable de la impressió, la reproducció, el modelat o un altre mètode de fabricació d’una manifestació publicada. @ca
definition: Liittää manifestaation nomeniin, joka on julkaistun manifestaation painamisesta, monistamisesta, kirjasinten valamisesta tai muusta valmistustavasta vastuussa olevan toimijan nimi. @fi
toolkit label: valmistajan nimi @fi
toolkit definition: Nomen, joka on julkaistun manifestaation painamisesta, monistamisesta, kirjasinten valamisesta tai muusta vamistustavasta vastuussa olevan toimijan nimi. @fi
toolkit label: navn på tilvirker @no
toolkit definition: Et navn på en agent som er ansvarlig for å trykke, mangfoldiggjøre, rollebesette etc. en publisert manifestasjon. @no
label: έχει όνομα κατασκευαστή @el
definition: Συνδέει μια εκδήλωση με ένα όνομα ενός φορέα υπεύθυνου για την εκτύπωση, την αντιγραφή, τη χύτευση κ.λπ. μιας εκδήλωσης σε μια δημοσιευμένη μορφή. @el
toolkit label: όνομα κατασκευαστή @el
toolkit definition: Ένα όνομα ενός φορέα υπεύθυνου για την εκτύπωση, την αντιγραφή, τη χύτευση κ.λπ. μιας εκδήλωσης σε μια δημοσιευμένη μορφή. @el
sub property of: has name of agent of manifestation
alternative label: manufacturer's name
has element type: 3
label: gyártó neve a következő: @hu
definition: Hozzákapcsol egy megjelenési formát egy nomenhez, amely egy kiadott megjelenési forma nyomtatásáért, sokszorosításáért, öntéséért vagy egyéb gyártási módszeréért felelős ágens neve. @hu
toolkit label: gyártó neve: @hu
toolkit definition: Egy nomen, amely egy kiadott megjelenési forma nyomtatásáért, sokszorosításáért, öntéséért vagy egyéb gyártási módszeréért felelős ágens neve. @hu
label: valmistajan nimi @fi
label: har navn på tilvirker @no
definition: Relaterer en manifestasjon til et navn på en agent som er ansvarlig for å trykke, mangfoldiggjøre, rollebesette etc. en publisert manifestasjon. @no
alternative label: tilvirkerens navn @no
label: heeft naam van vervaardiger @nl
definition: Relateert een manifestatie aan een nomen dat is een naam van een actor die verantwoordelijk is voor het drukken, dupliceren, gieten of andere methode van vervaardigen van een gepubliceerde manifestatie. @nl
label: له اسم صانع @ar
definition: يربط بين تجسيدة واسم وكيل مسئول عن طباعة، أو نسخ، أو صب، إلخ. تجسيدة منشورة. @ar
alternative label: اسم صانع @ar
toolkit label: اسم صانع @ar
toolkit definition: اسم وكيل مسئول عن طباعة، أو نسخ، أو صب، إلخ. تجسيدة منشورة. @ar
alternative label: producents navn @da
label: valmistaja nimi @et
definition: Seostab kehastuse avaldatud kehastuse trükkimise, paljundamise, valamise vms eest vastutava tegija nimega. @et
toolkit label: valmistaja nimi @et
toolkit definition: Avaldatud kehastuse trükkimise, paljundamise, valamise vms eest vastutava tegija nimi. @et
alternative label: gyártója neve: @hu
label: ha come nome della manifattura @it
definition: Correla una manifestazione a un nome di un agente responsabile della stampa, duplicazione, fusione, etc. di una manifestazione pubblicata. @it
toolkit label: nome della manifattura @it
toolkit definition: Nome di un agente responsabile della stampa, duplicazione, fusione, etc. di una manifestazione pubblicata. @it
label: ražotāja vārds/nosaukums @lv
definition: Sasaista manifestāciju ar nomenu, kas ir vārds/nosaukums aģentam, kas ir atbildīgs par publicētās manifestācijas iespiešanu, pavairošanu, iesiešanu u.tml. @lv
toolkit label: ražotāja vārds/nosaukums @lv
toolkit definition: Vārds/nosaukums aģentam, kas ir atbildīgs par publicētās manifestācijas iespiešanu, pavairošanu, iesiešanu u.tml. @lv
alternative label: 生产者名称 @zh-hans
label: 有生产者名称 @zh-hans
definition: 将一种载体表现与作为负责印刷、复制、铸造或其他方法生产一种出版载体表现的一个行为者之名称的一个命名关联起来。 @zh-hans
toolkit label: 生产者名称 @zh-hans
toolkit definition: 作为负责印刷、复制、铸造或其他方法生产一种出版载体表现的一个行为者之名称的一个命名 @zh-hans

has sound characteristic
status: Published
definition: Relates a manifestation to a technical specification relating to the encoding of sound in a manifestation.
type: Property
domain: C10007
lexical alias: soundCharacteristic.en
instruction number: 3.16
toolkit label: sound characteristic
toolkit definition: A technical specification relating to the encoding of sound in a manifestation.
label: a pour caractéristique sonore @fr
definition: Met une manifestation en relation avec une spécification technique relative à l’encodage du son dans une manifestation. @fr
toolkit label: caractéristique sonore @fr
toolkit definition: Spécification technique relative à l’encodage du son dans une manifestation. @fr
toolkit label: característica de sonido @es
toolkit definition: Una especificación técnica relativa a la codificación del sonido en una manifestación. @es
label: har ljudkaraktäristiska @sv
toolkit label: ljudkaraktäristiska @sv
toolkit label: kenmerken geluid @nl
toolkit definition: Een technische specificatie gerelateerd aan de codering van geluid in een manifestatie. @nl
label: có đặc trưng âm thanh @vi
definition: Liên kết biểu thị với đặc tính kỹ thuật liên quan tới ghi mã âm thanh trong biểu thị. @vi
toolkit label: đặc trưng âm thanh @vi
toolkit definition: Đặc tính kỹ thuật liên quan tới ghi mã âm thanh trong biểu thị. @vi
label: har lydkarakteristika @da
definition: Relaterer en manifestation til en teknisk specifikation, som relaterer til kodningen af lyd i en manifestation. @da
toolkit label: lydkarakteristika @da
toolkit definition: Teknisk specifikation, som relaterer til kodningen af lyd i en manifestation. @da
label: hat Toneigenschaft @de
definition: Setzt eine Manifestation in Beziehung zu einer technischen Spezifikation, die sich auf die Kodierung des Tons in einer Manifestation bezieht. @de
toolkit label: Toneigenschaft @de
toolkit definition: Eine technische Spezifikation, die sich auf die Kodierung des Tons in einer Manifestation bezieht. @de
label: té com a característica de so @ca
definition: Relaciona una manifestació amb una especificació tècnica relativa a la codificació del so d’una manifestació. @ca
toolkit label: característica de so @ca
toolkit definition: Especificació tècnica relativa a la codificació del so d’una manifestació. @ca
definition: Liittää manifestaation manifestaation sisältämän äänen koodaamisen tekniseen määritykseen. @fi
toolkit label: äänen ominaisuudet @fi
toolkit definition: Manifestaation sisältämän äänen koodaamisen tekninen määritys. @fi
toolkit label: lydegenskaper @no
toolkit definition: En teknisk spesifikasjon knyttet til kodingen av lyd i en manifestasjon. @no
label: έχει χαρακτηριστικό του ήχου @el
definition: Συνδέει μια εκδήλωση με μια τεχνική προδιαγραφή που σχετίζεται με την κωδικοποίηση του ήχου σε μια εκδήλωση. @el
toolkit label: χαρακτηριστικό ήχου @el
toolkit definition: Μια τεχνική προδιαγραφή που σχετίζεται με την κωδικοποίηση του ήχου σε μια εκδήλωση. @el
label: hangjellemzője a következő: @hu
definition: Hozzákapcsol egy megjelenési formát egy műszaki specifikációhoz, amely egy megjelenési formában a hang kódolásához kapcsolódik. @hu
toolkit label: hangjellemzője: @hu
toolkit definition: Egy műszaki specifikáció, amely egy megjelenési formában a hang kódolásához kapcsolódik. @hu
label: äänen ominaisuudet @fi
label: har lydegenskaper @no
definition: Relaterer en manifestasjon til en teknisk spesifikasjon knyttet til kodingen av lyd i en manifestasjon. @no
label: heeft kenmerken geluid @nl
definition: Relateert een manifestatie aan een technische specificatie gerelateerd aan de codering van geluid in een resource. @nl
label: له خاصية صوت @ar
definition: يربط بين تجسيدة وخصائص فنية متعلقة بالتكويد لصوت في تجسيدة. @ar
toolkit label: خاصية صوت @ar
toolkit definition: خصائص فنية متعلقة بالتكويد لصوت في تجسيدة. @ar
label: heli tunnus @et
definition: Seostab kehastuse tehnilise kirjeldusega, mis puudutab kehastuses sisalduva heli kodeeringut. @et
toolkit label: heli tunnus @et
toolkit definition: Tehniline kirjeldus, mis puudutab kehastuses sisalduva heli kodeeringut. @et
label: ha come caratteristica del suono @it
definition: Correla una manifestazione a una specifica tecnica relativa alla codifica del suono in una manifestazione. @it
toolkit label: caratteristica del suono @it
toolkit definition: Specifica tecnica relativa alla codifica del suono in una manifestazione. @it
label: skaņas raksturojums @lv
definition: Sasaista manifestāciju ar tehnisko specifikāciju, kas attiecas uz skaņas kodējumu manifestācijā. @lv
toolkit label: skaņas raksturojums @lv
toolkit definition: Tehniskas specifikācijas, kas attiecas uz skaņas kodējumu manifestācijā. @lv
has element type: 5
label: 有声音特征 @zh-hans
definition: 将一种载体表现与和一种载体表现中的声音的编码有关的一个技术规格关联起来。 @zh-hans
toolkit label: 声音特征 @zh-hans
toolkit definition: 和一种载体表现中的声音的编码有关的一个技术规格 @zh-hans
label: ses özelliği ile ilişkilidir @tr
definition: Bir gösterimi, bir gösterimdeki sesin kodlanmasıyla ilgili teknik bir şartnameyle ilişkilendirir. @tr
toolkit label: ses özelliği @tr
toolkit definition: Bir gösterimde sesin kodlanmasına ilişkin teknik bir şartname. @tr
label: tiene característica de sonido @es
definition: Relaciona una manifestación con una especificación técnica relativa a la codificación del sonido en una manifestación. @es

has details of sound characteristic
status: Published
type: Property
lexical alias: detailsOfSoundCharacteristic.en
definition: Relates a manifestation to details of a technical specification relating to the encoding of sound in a manifestation.
domain: C10007
instruction number: 3.16.1.4
toolkit label: details of sound characteristic
toolkit definition: Details of a technical specification relating to the encoding of sound in a manifestation.
toolkit label: detalles de sonido característico @es
toolkit definition: Detalles de una especificación técnica relativa a la codificación del sonido en una manifestación. @es
label: har detaljerad information om ljudkaraktäristika @sv
toolkit label: detaljerad information om ljudkaraktäristika @sv
toolkit label: details van geluidskenmerken @nl
toolkit definition: Details van een technische specificatie gerelateerd aan de codering van geluid in een resource. @nl
label: có chi tiết của đặc trưng âm thanh @vi
definition: Liên kết biểu thị với chi tiết của đặc tính kỹ thuật liên quan tới ghi mã âm thanh trong biểu thị. @vi
toolkit label: chi tiết của đặc trưng âm thanh @vi
toolkit definition: Chi tiết của đặc tính kỹ thuật liên quan tới ghi mã âm thanh trong biểu thị. @vi
label: har detaljer om lydkarakteristika @da
definition: Relaterer en manifestation til detaljer om en teknisk specifikation, som relaterer til kodning af lyd i en manifestation. @da
toolkit label: detaljer om lydkarakteristika @da
toolkit definition: Detaljer om en teknisk specifikation, som relaterer til kodning af lyd i en manifestation. @da
label: hat Details zur Toneigenschaft @de
definition: Setzt eine Manifestation in Beziehung zu den Details zu einer technischen Spezifikation, die sich auf die Kodierung des Tons in einer Manifestation bezieht. @de
toolkit label: Details zur Toneigenschaft @de
toolkit definition: Details zu einer technischen Spezifikation, die sich auf die Kodierung des Tons in einer Manifestation bezieht. @de
label: té com a particularitats de característiques de so @ca
definition: Relaciona una manifestació amb les particularitats d’una especificació tècnica relativa a la codificació del so d’una manifestació. @ca
toolkit label: particularitats de característiques de so @ca
toolkit definition: Particularitats d’una especificació tècnica relativa a la codificació del so d’una manifestació. @ca
definition: Liittää manifestaation tarkempiin tietoihin manifestaation sisältämän äänen koodaamisen teknisestä määrityksestä. @fi
toolkit label: äänen ominaisuuksien tarkemmat tiedot @fi
toolkit definition: Tarkemmat tiedot manifestaation sisältämän äänen koodaamisen teknisestä määrityksestä. @fi
toolkit label: detaljer vedrørende lydegenskaper @no
toolkit definition: Detaljer vedrørende en teknisk spesifikasjon knyttet til kodingen av lyd i en manifestasjon. @no
label: έχει λεπτομέρειες του χαρακτηριστικού του ήχου @el
definition: Συνδέει μια εκδήλωση με τις λεπτομέρειες μιας τεχνικής προδιαγραφής που συνδέεται με την κωδικοποίηση του ήχου σε μια εκδήλωση. @el
toolkit label: λεπτομέρειες του χαρακτηριστικού του ήχου @el
toolkit definition: Λεπτομέρειες μιας τεχνικής προδιαγραφής που συνδέεται με την κωδικοποίηση του ήχου σε μια εκδήλωση. @el
label: a pour particularités d’une caractéristique sonore @fr
definition: Met une manifestation en relation avec des particularités d’une spécification technique relative à l’encodage du son dans une manifestation. @fr
toolkit label: particularités d’une caractéristique sonore @fr
toolkit definition: Particularités d’une spécification technique relative à l’encodage du son dans une manifestation. @fr
has element type: 6
label: hangjellemzők részletei a következők: @hu
definition: Hozzákapcsol egy megjelenési formát azon műszaki specifikáció részleteihez, amely a hang kódolásához kötődik egy megjelenési formában. @hu
toolkit label: hangjellemzők részletei: @hu
toolkit definition: Azon műszaki specifikáció részletei, amely a hang kódolásához kötődik egy megjelenési formában. @hu
label: äänen ominaisuuksien tarkemmat tiedot @fi
label: har detaljer vedrørende lydegenskaper @no
definition: Relaterer en manifestasjon til detaljer vedrørende en teknisk spesifikasjon knyttet til kodingen av lyd i en manifestasjon. @no
label: heeft details van geluidskenmerken @nl
definition: Relateert een manifestatie aan details van een technische specificatie gerelateerd aan de codering van geluid in een resource. @nl
label: له تفاصيل عن خاصية الصوت @ar
definition: يربط بين تجسيدة وتفاصيل خصائص فنية متعلقة بالتكويد لصوت في تجسيدة. @ar
toolkit label: تفاصيل عن خاصية الصوت @ar
toolkit definition: تفاصيل خصائص فنية متعلقة بالتكويد لصوت في تجسيدة. @ar
label: heli tunnuse täpsustus @et
definition: Seostab kehastuse täpsemate andmetega tehnilises kirjelduses, mis puudutab kehastuses sisalduva heli kodeeringut. @et
toolkit label: heli tunnuse täpsustus @et
toolkit definition: Täpsemad andmed tehnilises kirjelduses, mis puudutab kehastuses sisalduva heli kodeeringut. @et
label: ha come particolari relativi alla caratteristica del suono @it
definition: Correla una manifestazione ai particolari relativi a una specifica tecnica relativa alla codifica del suono in una manifestazione. @it
toolkit label: particolari relativi alla caratteristica del suono @it
toolkit definition: Particolari relativi a una specifica tecnica relativa alla codifica del suono in una manifestazione. @it
label: detalizēti par skaņas raksturojumu @lv
definition: Sasaista manifestāciju ar sīkāku informāciju par tehniskām specifikācijām, kas attiecas uz skaņas kodējumu manifestācijā. @lv
toolkit label: detalizēti par skaņas raksturojumu @lv
toolkit definition: Sīkāka informācija par tehniskām specifikācijām, kas attiecas uz skaņas kodējumu manifestācijā. @lv
label: 有声音特征的细节 @zh-hans
definition: 将一种载体表现与和一种载体表现中的声音的编码有关的一个技术规格的细节关联起来。 @zh-hans
toolkit label: 声音特征的细节 @zh-hans
toolkit definition: 和一种载体表现中的声音的编码有关的一个技术规格的细节 @zh-hans
label: ses özelliğinin ayrıntıları ile ilişkilidir @tr
definition: Bir gösterimi, bir gösterimdeki sesin kodlanmasıyla ilgili teknik bir şartnamenin ayrıntılarıyla ilişkilendirir. @tr
toolkit label: ses özelliğinin ayrıntıları @tr
toolkit definition: Bir gösterimdeki sesin kodlanmasıyla ilgili teknik bir özelliğin ayrıntıları. @tr
label: tiene detalles de sonido característico @es
definition: Relaciona una manifestación con detalles de una especificación técnica relativa a la codificación del sonido en una manifestación. @es

has details of tape configuration
status: Published
type: Property
lexical alias: detailsOfTapeConfiguration.en
definition: Relates a manifestation to details of a number of tracks on an audiotape.
domain: C10007
instruction number: 3.16.7.4
toolkit label: details of tape configuration
toolkit definition: Details of a number of tracks on an audiotape.
toolkit label: detalles de la configuración de la cinta @es
toolkit definition: Detalles de varias pistas en una cinta de audio. @es
sub property of: has details of sound characteristic
label: har detaljerad information om antal spår @sv
toolkit label: detaljerad information om antal spår @sv
toolkit label: details van configuratie geluidsband @nl
toolkit definition: Details van een aantal sporen op een geluidsband. @nl
label: có chi tiết của cấu hình băng @vi
definition: Liên kết biểu thị với chi tiết của số lượng rãnh trên băng audio. @vi
toolkit label: chi tiết của cấu hình băng @vi
toolkit definition: Chi tiết của số lượng rãnh trên băng audio. @vi
label: har detaljer om båndkonfiguration @da
definition: Relaterer en manifestation til detaljer om antal af spor på et lydbånd. @da
toolkit label: detaljer om båndkonfiguration @da
toolkit definition: Detaljer om antal af spor på et lydbånd. @da
label: hat Details zur Bandkonfiguration @de
definition: Setzt eine Manifestation in Beziehung zu den Details zur Anzahl der Spuren auf einem Tonband. @de
toolkit label: Details zur Bandkonfiguration @de
toolkit definition: Details zur Anzahl der Spuren auf einem Tonband. @de
label: té com a particularitats de configuració de cinta @ca
definition: Relaciona una manifestació amb les particularitats d’un nombre de pistes d’una cinta àudio. @ca
toolkit label: particularitats de configuració de cinta @ca
toolkit definition: Particularitats d’un nombre de pistes d’una cinta àudio. @ca
definition: Liittää manifestaation tarkempiin tietoihin ääninauhalla olevien ääniraitojen lukumäärästä. @fi
toolkit label: ääninauhan raitojen määrän tarkemmat tiedot @fi
toolkit definition: Tarkemmat tiedot ääninauhalla olevien ääniraitojen lukumäärästä. @fi
toolkit label: detaljer vedrørende lydbåndkonfigurasjon @no
toolkit definition: Detaljer vedrørende antall spor på et lydbånd. @no
label: έχει λεπτομέρειες της διαμόρφωσης της μαγνητικής ταινίας @el
definition: Συνδέει μια εκδήλωση με τις λεπτομέρειες ενός αριθμού κομματιών σε μια ταινία ήχου. @el
toolkit label: λεπτομέρειες της διαμόρφωσης της μαγνητικής ταινίας @el
toolkit definition: Λεπτομέρειες ενός αριθμού κομματιών σε μια ταινία ήχου. @el
label: a pour particularités d’une configuration de bande magnétique @fr
definition: Met une manifestation en relation avec des particularités d’un nombre de pistes sur une bande audio. @fr
toolkit label: particularités d’une configuration de bande magnétique @fr
toolkit definition: Particularités d’un nombre de pistes sur une bande audio. @fr
has element type: 6
label: hangszalagkonfiguráció részletei a következők: @hu
definition: Hozzákapcsol egy megjelenési formát egy hangszalagon lévő sávok számának részleteihez. @hu
toolkit label: hangszalagkonfiguráció részletei: @hu
toolkit definition: Egy hangszalagon lévő sávok számának részletei. @hu
label: ääninauhan raitojen määrän tarkemmat tiedot @fi
label: har detaljer vedrørende lydbåndkonfigurasjon @no
definition: Relaterer en manifestasjon til detaljer vedrørende antall spor på et lydbånd. @no
label: heeft details van configuratie geluidsband @nl
definition: Relateert een manifestatie aan details van een aantal sporen op een geluidsband. @nl
label: له تفاصيل عن بنية شريط @ar
definition: يربط بين تجسيدة وتفاصيل عدد المسارات على شريط صوت. @ar
toolkit label: تفاصيل عن بنية شريط @ar
toolkit definition: تفاصيل عدد المسارات على شريط صوت. @ar
label: heliriba paigutuse täpsustus @et
definition: Seostab kehastuse täpsemate andmetega helifilmi heliriba paigutuse kohta. @et
toolkit label: heliriba paigutuse täpsustus @et
toolkit definition: Täpsemad andmed helifilmi heliriba paigutuse kohta. @et
label: ha come particolari relativi alla configurazione del nastro @it
definition: Correla una manifestazione ai particolari relativi a un numero di tracce su un nastro audio. @it
toolkit label: particolari relativi alla configurazione del nastro @it
toolkit definition: Particolari relativi a un numero di tracce su un nastro audio. @it
label: detalizēti par lentes konfigurāciju @lv
definition: Sasaista manifestāciju ar sīkāku informāciju par skaņas celiņu skaitu audio lentē. @lv
toolkit label: detalizēti par lentes konfigurāciju @lv
toolkit definition: Sīkāka informācija par skaņas celiņu skaitu audio lentē. @lv
label: 有磁带配置的细节 @zh-hans
definition: 将一种载体表现与录音磁带上的音轨数的细节关联起来。 @zh-hans
toolkit label: 磁带配置的细节 @zh-hans
toolkit definition: 录音磁带上的音轨数的细节 @zh-hans
label: bant yapılandırmasının ayrıntıları ile ilişkilidir @tr
definition: Bir gösterimi, bir ses bandındaki bir dizi parçanın ayrıntılarıyla ilişkilendirir. @tr
toolkit label: teyp yapılandırmasının ayrıntıları @tr
toolkit definition: Bir ses bandındaki bir dizi parçanın ayrıntıları. @tr
label: tiene detalles de la configuración de la cinta @es

has facsimile of manifestation
status: Published
definition: Relates a manifestation to a manifestation that exactly reproduces another manifestation.
type: Property
domain: C10007
sub property of: is reproduced as manifestation
lexical alias: facsimileOfManifestation.en
toolkit label: facsimile of manifestation
toolkit definition: A manifestation that exactly reproduces another manifestation.
label: a pour fac-similé d’une manifestation @fr
definition: Met une manifestation en relation avec une manifestation qui reproduit exactement une autre manifestation. @fr
toolkit label: fac-similé d’une manifestation @fr
toolkit definition: Manifestation qui reproduit exactement une autre manifestation. @fr
toolkit label: facsímil de manifestación @es
toolkit definition: Una manifestación que reproduce exactamente otra manifestación. @es
instruction number: 24.5
toolkit label: facsimile van manifestatie @nl
toolkit definition: Een manifestatie die een andere manifestatie exact reproduceert. @nl
label: có sao chép (biểu thị) @vi
definition: Liên kết biểu thị với biểu thị tạo lại chính xác biểu thị khác. @vi
toolkit label: sao chép (biểu thị) @vi
toolkit definition: Biểu thị tạo lại chính xác biểu thị khác. @vi
label: har faksimile af manifestation @da
definition: Relaterer en manifestation til en manifestation, som nøjagtigt gengiver en anden manifestation. @da
toolkit label: faksimile af manifestation @da
toolkit definition: Manifestation, som nøjagtigt gengiver en anden manifestation. @da
label: hat Faksimile einer Manifestation @de
definition: Setzt eine Manifestation in Beziehung zu einer Manifestation, die eine andere Manifestation exakt reproduziert. @de
toolkit label: Faksimile einer Manifestation @de
toolkit definition: Eine Manifestation, die eine andere Manifestation exakt reproduziert. @de
label: té com a facsímil d’una manifestació @ca
definition: Relaciona una manifestació amb una manifestació que reprodueix exactament una altra manifestació. @ca
toolkit label: facsímil d’una manifestació @ca
toolkit definition: Manifestació que reprodueix exactament una altra manifestació. @ca
definition: Liittää manifestaation manifestaatioon, joka jäljentää tarkalleen toisen manifestaation. @fi
toolkit label: manifestaation näköispainos @fi
toolkit definition: Manifestaatio, joka jäljentää tarkalleen toisen manifestaation. @fi
toolkit label: faksimile av manifestasjon @no
toolkit definition: En manifestasjon som er en tro kopi av en annen manifestasjon. @no
label: έχει ομοιότυπη (εκδήλωση) @el
definition: Συνδέει μια εκδήλωση με μια εκδήλωση που αναπαράγει ακριβώς μια άλλη εκδήλωση. @el
toolkit label: ομοιότυπη (εκδήλωση) @el
toolkit definition: Μια εκδήλωση που αναπαράγει με ακρίβεια μια άλλη εκδήλωση. @el
has element type: 2
label: megjelenési forma hasonmása a következő: @hu
definition: Egy megjelenési formát hozzákapcsol egy olyan megjelenési formához, amely egy másik megjelenési formát pontosan reprodukál. @hu
toolkit label: megjelenési forma hasonmása: @hu
toolkit definition: Egy megjelenési forma, amely pontosan reprodukál egy másik megjelenési formát. @hu
alternative label: facsimile (manifestation)
label: manifestaation näköispainos @fi
label: har faksimile av manifestasjon @no
definition: Relaterer en manifestasjon til en manifestasjon som er en tro kopi av en annen manifestasjon. @no
label: heeft facsimile van manifestatie @nl
definition: Relateert een manifestatie aan een manifestatie die een andere manifestatie exact reproduceert. @nl
alternative label: näköispainos (manifestaatio) @fi
label: له صورة طبق الأصل لتجسيدة @ar
definition: يربط بين تجسيدة وتجسيدة هي إستنساخ تام لتجسيدة أخرى. @ar
toolkit label: صورة طبق الأصل لتجسيدة @ar
toolkit definition: تجسيدة هي إستنساخ تام لتجسيدة أخرى. @ar
label: kehastuse faksiimile @et
definition: Seostab kehastuse kehastusega, mis on teise kehastuse täpne reproduktsioon. @et
toolkit label: kehastuse faksiimile @et
toolkit definition: Kehastus, mis on teise kehastuse täpne reproduktsioon. @et
label: ha come facsimile di manifestazione @it
definition: Correla una manifestazione a una manifestazione che riproduce esattamente un'altra manifestazione. @it
toolkit label: facsimile di manifestazione @it
toolkit definition: Manifestazione che riproduce esattamente un'altra manifestazione. @it
label: manifestācijas faksimils @lv
definition: Sasaista manifestāciju ar manifestāciju, kura precīzi reproducē citu manifestāciju. @lv
toolkit label: manifestācijas faksimils @lv
toolkit definition: Manifestācija, kura precīzi reproducē citu manifestāciju. @lv
alternative label: صورة طبق الأصل (تجسيدة) @ar
alternative label: faksimile (manifestation) @da
alternative label: Faksimile (Manifestation) @de
alternative label: facsímil (manifestació) @ca
alternative label: 摹真复制品（载体表现） @zh-hans
label: 有载体表现的摹真品 @zh-hans
definition: 将一种载体表现与精确复制另一种载体表现的一种载体表现关联起来。 @zh-hans
toolkit label: 载体表现的摹真品 @zh-hans
toolkit definition: 精确复制另一种载体表现的一种载体表现 @zh-hans

has carrier type
status: Published
definition: Relates a manifestation to a categorization reflecting the format of the storage medium and housing of a carrier in combination with the type of intermediation device required to view, play, run, or otherwise access the content of a manifestation.
type: Property
domain: C10007
lexical alias: carrierType.en
instruction number: 3.3
toolkit label: carrier type
toolkit definition: A categorization reflecting the format of the storage medium and housing of a carrier in combination with the type of intermediation device required to view, play, run, or otherwise access the content of a manifestation.
label: a pour type de support matériel @fr
definition: Met une manifestation en relation avec une catégorisation qui indique le format du support de stockage et du contenant d’un support matériel combiné avec le type de dispositif de médiation requis pour visionner, faire fonctionner ou faire défiler le contenu d’une manifestation, ou y accéder d’une autre manière. @fr
toolkit label: type de support matériel @fr
toolkit definition: Catégorisation qui indique le format du support de stockage et du contenant d’un support matériel combiné avec le type de dispositif de médiation requis pour visionner, faire fonctionner ou faire défiler le contenu d’une manifestation, ou y accéder d’une autre manière. @fr
toolkit label: tipo de soporte @es
toolkit definition: Una categorización que refleja el formato del medio de almacenamiento y alojamiento de un soporte en combinación con el tipo de dispositivo de intermediación requerido para visualizar, reproducir, ejecutar o de alguna manera acceder al contenido de una manifestación. @es
label: har bärartyp @sv
toolkit label: bärartyp @sv
toolkit label: type drager @nl
toolkit definition: Een categorisatie die het formaat weergeeft van het opslagmedium en de behuizing van de drager in combinatie met het type apparaat dat benodigd is om de content van een manifestatie in te zien, af te spelen, te starten of anderszins toegang te geven. @nl
label: có loại vật mang tin @vi
definition: Liên kết biểu thị với chia loại phản ánh định dạng của phương tiện lưu giữ và chứa vật mang tin kết hợp với loại của thiết bị trung gian yêu cầu để xem, chơi, chạy, v.v..., nội dung của biểu thị. @vi
toolkit label: loại vật mang tin @vi
toolkit definition: Chia loại phản ánh định dạng của phương tiện lưu giữ và chứa vật mang tin kết hợp với loại của thiết bị trung gian yêu cầu để xem, chơi, chạy, v.v..., nội dung của biểu thị. @vi
label: har bærertype @da
definition: Relaterer en manifestation til en kategorisering der specifikt afspejler lagringsmediet og dets udstyr i kombination med den type af afspilningsudstyr, som kræves for at se, spille, fremvise eller på anden måde give adgang til en manifestations indhold. @da
toolkit label: bærertype @da
toolkit definition: Kategorisering der specifikt afspejler lagringsmediet og dets udstyr i kombination med den type af afspilningsudstyr, som kræves for at se, spille, fremvise eller på anden måde give adgang til en manifestations indhold. @da
label: hat Datenträgertyp @de
definition: Setzt eine Manifestation in Beziehung zu einer Kategorisierung, die das Format des Speichermediums und das Gehäuse eines Datenträgers in Kombination mit der Art des Hilfsmittels widerspiegelt, das benötigt wird, um den Inhalt einer Manifestation anzuschauen, abzuspielen, laufen zu lassen oder anderweitig darauf zuzugreifen. @de
toolkit label: Datenträgertyp @de
toolkit definition: Eine Kategorisierung, die das Format des Speichermediums und das Gehäuse eines Datenträgers in Kombination mit der Art des Hilfsmittels widerspiegelt, das benötigt wird, um den Inhalt einer Manifestation anzuschauen, abzuspielen, laufen zu lassen oder anderweitig darauf zuzugreifen. @de
label: té com a tipus de suport físic @ca
definition: Relaciona una manifestació amb una categorització que reflecteix el format del suport d’emmagatzematge i d’allotjament d’un suport físic en combinació amb el tipus d’aparell de mediació requerit per visionar, reproduir, fer funcionar o accedir d’una altra manera el contingut d’una manifestació. @ca
toolkit label: tipus de suport físic @ca
toolkit definition: Categorització que reflecteix el format del suport d’emmagatzematge i d’allotjament d’un suport físic en combinació amb el tipus d’aparell de mediació requerit per visionar, reproduir, fer funcionar o accedir d’una altra manera el contingut d’una manifestació. @ca
definition: Liittää manifestaation kategorisointiin, joka ilmaisee säilytysvälineen ja tallenteen koteloinnin formaatin yhdessä manifestaation sisällön katsomiseen, toistamiseen, suorittamiseen tai muuhun toimintaan tarvittavan välittävän laitteen tyypin kanssa. @fi
toolkit label: tallennetyyppi @fi
toolkit definition: Kategorisointi, joka ilmaisee säilytysvälineen ja tallenteen koteloinnin formaatin yhdessä manifestaation sisällön katsomiseen, toistamiseen, suorittamiseen tai muuhun toimintaan tarvittavan välittävän laitteen tyypin kanssa. @fi
toolkit definition: En inndeling som gjenspeiler lagringsmediets format og bærerens integrerende beholder, i kombinasjon med typen formidlingsenhet som trengs for å se, spille, kjøre etc. innholdet i manifestasjonen. @no
label: έχει τύπο του φορέα αποθήκευσης @el
definition: Συνδέει μια εκδήλωση με μια κατηγοριοποίηση που αντανακλά το μορφότυπο του μέσου αποθήκευσης και φύλαξης ενός φορέα αποθήκευσης σε συνδυασμό με τον τύπο της ενδιάμεσης συσκευής που απαιτείται για τη θέαση, την αναπαραγωγή, τη ροή κ.λπ. του περιεχομένου μιας εκδήλωσης. @el
toolkit label: τύπος φορέα αποθήκευσης @el
toolkit definition: Μια κατηγοριοποίηση που αντανακλά το μορφότυπο του μέσου αποθήκευσης και φύλαξης ενός φορέα αποθήκευσης σε συνδυασμό με τον τύπο της ενδιάμεσης συσκευής που απαιτείται για τη θέαση, την αναπαραγωγή, τη ροή κ.λπ. του περιεχομένου μιας εκδήλωσης. @el
has element type: 4
label: hordozótípusa a következő: @hu
definition: Hozzákapcsol egy megjelenési formát egy kategorizáláshoz, amely tükrözi a tároló médium formátumát és a hordozó burkolatát a közvetítőkészülék azon típusával kombináltan, amely egy megjelenési forma tartalmának megtekintéséhez, lejátszásához, futtatásához, vagy egyéb módú hozzáférhetőségéhez szükséges. @hu
toolkit label: hordozótípusa: @hu
toolkit definition: Egy kategorizáció, amely tükrözi a tároló médium formátumát és a hordozó burkolatát a közvetítőkészülék azon típusával kombináltan, amely egy megjelenési forma tartalmának megtekintéséhez, lejátszásához, futtatásához, vagy egyéb módú hozzáférhetőségéhez szükséges. @hu
alternative label: type of carrier
alternative label: category of carrier
label: tallennetyyppi @fi
definition: Relaterer en manifestasjon til en inndeling som gjenspeiler lagringsmediets format og bærerens integrerende beholder, i kombinasjon med typen formidlingsenhet som trengs for å se, spille, kjøre etc. innholdet i manifestasjonen. @no
alternative label: type bærer @no
alternative label: kategori av bærer @no
alternative label: catégorie de support matériel @fr
label: heeft type drager @nl
definition: Relateert een manifestatie aan een categorisatie die het formaat weergeeft van het opslagmedium en de behuizing van de drager in combinatie met het type apparaat dat benodigd is om de content van een manifestatie in te zien, af te spelen, te starten of anderszins toegang te geven. @nl
label: له نوع الحامل @ar
definition: يربط بين تجسيدة وفئة تعكس شكل وسيط التخزين ومكان الحامل المصاحب لنوع الجهاز الوسيط المطلوب لعرض، أو تشغيل، أو الوصول إلى محتوى تجسيدة. @ar
alternative label: فئة الحامل @ar
toolkit label: نوع الحامل @ar
toolkit definition: فئة تعكس شكل وسيط التخزين ومكان الحامل المصاحب لنوع الجهاز الوسيط المطلوب لعرض، أو تشغيل، أو الوصول إلى محتوى تجسيدة. @ar
alternative label: kategori af bærer @da
label: kandja tüüp @et
definition: Seostab kehastuse kategooriaga, mis kajastab salvestusmeediumi ja ümbrise vormi koos vahendusseadme tüübiga, mis on vajalik kehastuse sisu vaatamiseks, mängimiseks, käitamiseks vms. @et
toolkit label: kandja tüüp @et
toolkit definition: Kategooria, mis kajastab salvestusmeediumi ja ümbrise vormi koos vahendusseadme tüübiga, mis on vajalik kehastuse sisu vaatamiseks, mängimiseks, käitamiseks vms. @et
label: ha come tipo di supporto @it
definition: Correla una manifestazione a una categorizzazione che indica il formato del mezzo di memorizzazione e la custodia di un supporto in combinazione con il tipo di dispositivo di intermediazione necessario per vedere, riprodurre, attivare, etc. il contenuto di una manifestazione. @it
alternative label: tipo di supporto @it
toolkit label: tipo di supporto @it
toolkit definition: Categorizzazione che indica il formato del mezzo di memorizzazione e la custodia di un supporto in combinazione con il tipo di dispositivo di intermediazione necessario per vedere, riprodurre, attivare, etc. il contenuto di una manifestazione. @it
label: nesēja veids @lv
definition: Sasaista manifestāciju ar kategorizēšanu, kas atspoguļo uzglabāšanas vides formātu un nesēja apvalku kombinācijā ar starpniekierīci, kas nepieciešama, lai apskatītu, atskaņotu, parādītu, u.tml. manifestācijas saturu. @lv
toolkit label: nesēja veids @lv
toolkit definition: Kategorizēšana, kas atspoguļo uzglabāšanas vides formātu un nesēja apvalku kombinācijā ar starpniekierīci, kas nepieciešama, lai apskatītu, atskaņotu, parādītu, u.tml. manifestācijas saturu. @lv
label: 有载体类型 @zh-hans
definition: 将一种载体表现与反映存储媒介格式和载体装置并结合载体表现内容的浏览、播放、运行或其他存取方式等所需中间设备的类型的分类关联起来。 @zh-hans
toolkit label: 载体类型 @zh-hans
toolkit definition: 反映存储媒介格式和载体装置并结合载体表现内容的浏览、播放、运行或其他存取方式等所需中间设备的类型的分类 @zh-hans

has intended audience of manifestation
status: Published
type: Property
lexical alias: intendedAudienceOfManifestation.en
definition: Relates a manifestation to a category of user for which a manifestation is intended.
domain: C10007
toolkit label: intended audience of manifestation
has element type: 5
toolkit definition: A category of user for which a manifestation is intended.
label: manifestaation kohderyhmä @fi
definition: Liittää manifestaation käyttäjäkategoriaan, jolle manifestaatio on suunnattu. @fi
toolkit definition: Käyttäjäkategoria, jolle manifestaatio on suunnattu. @fi
toolkit label: manifestaation kohderyhmä @fi
label: har målgruppe for manifestasjon @no
definition: Relaterer en manifestasjon til en brukerkategori som en manifestasjon er beregnet for. @no
toolkit label: målgruppe for manifestasjon @no
toolkit definition: En brukerkategori som en manifestasjon er beregnet for. @no
label: a pour public cible d’une manifestation @fr
definition: Met une manifestation en relation avec une classe d’utilisateurs à laquelle une manifestation est destinée. @fr
toolkit label: public cible d’une manifestation @fr
toolkit definition: Classe d’utilisateurs à laquelle une manifestation est destinée. @fr
label: heeft beoogd publiek van manifestatie @nl
definition: Relateert een manifestatie aan een categorie gebruiker voor welke een manifestatie bedoeld is. @nl
toolkit label: beoogd publiek van manifestatie @nl
toolkit definition: Een categorie gebruiker voor welke een manifestatie bedoeld is. @nl
label: له بيان بجمهور مستهدف لتجسيدة @ar
definition: يربط بين تجسيدة وفئة مستفيدين مستهدفين من تجسيدة. @ar
toolkit label: بيان بجمهور مستهدف لتجسيدة @ar
toolkit definition: فئة مستفيدين مستهدفين من تجسيدة. @ar
label: té com a destinataris previstos d’una manifestació @ca
definition: Relaciona una manifestació amb una categoria d’usuaris per als quals es destina una manifestació. @ca
toolkit label: destinataris previstos d’una manifestació @ca
toolkit definition: Categoria d’usuaris per als quals es destina una manifestació. @ca
label: har tiltænkt publikum af manifestation @da
definition: Relaterer en manifestation til en brugergruppe, som en manifestation er tiltænkt. @da
toolkit label: tiltænkt publikum af manifestation @da
toolkit definition: Brugergruppe, som en manifestation er tiltænkt. @da
label: kehastuse sihtrühm @et
definition: Seostab kehastuse kasutajarühmaga, kellele kehastus on mõeldud. @et
toolkit label: kehastuse sihtrühm @et
toolkit definition: Kasutajarühm, kellele kehastus on mõeldud. @et
label: hat Zielgruppe einer Manifestation @de
definition: Setzt eine Manifestation in Beziehung zu einer Gruppe von Benutzenden, für die eine Manifestation gedacht ist. @de
toolkit label: Zielgruppe einer Manifestation @de
toolkit definition: Eine Gruppe von Benutzenden, für die eine Manifestation gedacht ist. @de
label: megjelenési forma célközönsége a következő: @hu
definition: Hozzákapcsol egy megjelenési formát egy olyan használói kategóriához, amelynek a megjelenési formát szánják. @hu
toolkit label: megjelenési forma célközönsége @hu
toolkit definition: Egy olyan használói kategória, amelynek a megjelenési formát szánják. @hu
label: ha come destinari presunti di manifestazione. @it
definition: Correla una manifestazione a una categoria di utenti a cui è destinata una manifestazione. @it
toolkit label: destinatari presunti di manifestazione @it
toolkit definition: Categoria di utenti a cui è destinata una manifestazione. @it
label: manifestācijas mērķauditorija @lv
definition: Sasaista manifestāciju ar lietotāju kategoriju, kurai paredzēta manifestācija. @lv
toolkit label: manifestācijas mērķauditorija @lv
toolkit definition: Lietotāju kategorija, kurai paredzēta manifestācija. @lv
label: 有载体表现的目标受众 @zh-hans
definition: 将一种载体表现与一种载体表现计划面向的使用者类别关联起来。 @zh-hans
toolkit label: 载体表现的目标受众 @zh-hans
toolkit definition: 一种载体表现计划面向的使用者类别 @zh-hans
label: gösterimin hedef kitlesi ile ilişkilidir @tr
definition: Bir öğeyi, öğenin amaçlandığı bir kullanıcı kategorisiyle ilişkilendirir. @tr
toolkit label: gösterimin hedef kitlesi ile ilişkilidir @tr
toolkit definition: Bir gösterimin hedeflendiği kullanıcı türü. @tr
label: tiene audiencia prevista de manifestación @es
definition: Relaciona una manifestación con una categoría de usuario para la cual está destinada una manifestación. @es
toolkit label: audiencia prevista de manifestación @es
toolkit definition: Una categoría de usuario para la cual está destinada una manifestación. @es
has subproperty: P30305

has contact information
status: Published
definition: Relates a manifestation to a name, address, or other means of communicating with an agent from which a manifestation may be obtained.
type: Property
domain: C10007
lexical alias: contactInformation.en
instruction number: 4.3
toolkit label: contact information
toolkit definition: A name, address, or other means of communicating with an agent from which a manifestation may be obtained.
label: a pour coordonnées @fr
definition: Met une manifestation en relation avec un nom, une adresse ou un autre moyen de communiquer avec un agent auprès duquel il est possible d’obtenir une manifestation. @fr
toolkit label: coordonnées @fr
toolkit definition: Nom, adresse ou autre moyen de communiquer avec un agent auprès duquel il est possible d’obtenir une manifestation. @fr
toolkit label: información de contacto @es
toolkit definition: Un nombre, dirección u otro medio de comunicación con un agente del cual se puede obtener una manifestación. @es
scope note: An agent includes the distributor, manufacturer, or publisher of a published manifestation, or the archival repository that holds the manifestation.
label: har kontaktinformation @sv
toolkit label: kontaktinformation @sv
toolkit label: contactinformatie @nl
toolkit definition: Een naam, adres of andere manier om te communiceren met een actor waarvan een resource kan worden verkregen. @nl
label: có thông tin liên hệ @vi
definition: Liên kết biểu thị với tên, địa chỉ, v.v..., của tổ chức, v.v..., mà từ đó biểu thị có thể thu được. @vi
scope note: Thông tin liên hệ bao gồm tên, địa chỉ, v.v... của nhà xuất bản, nhà phân phối, v.v... của biểu thị được xuất bản, hoặc của kho lưu trữ chứa biểu hiện đó. @vi
toolkit label: thông tin liên hệ @vi
toolkit definition: Tên, địa chỉ, v.v..., của tổ chức, v.v..., mà từ đó biểu thị có thể thu được. @vi
scope note: Een actor omvat de distributeur, vervaardiger of uitgever van een gepubliceerde manifestatie of het depot dat de manifestatie bezit. @nl
label: har kontaktoplysninger @da
definition: Relaterer en manifestation til et navn, en adresse, etc. på en agent, hvorfra en manifestation kan fremskaffes. @da
scope note: Agent omfatter distributøren, producenten eller udgiveren af en publiceret manifestation eller på det arkiv, som besidder manifestationen. @da
toolkit label: kontaktoplysninger @da
toolkit definition: Navn, adresse, etc. på en agent, hvorfra en manifestation kan fremskaffes. @da
label: hat Kontaktinformationen @de
definition: Setzt eine Manifestation in Beziehung zu einem Namen, einer Adresse oder einem anderen Kommunikationsmittel eines Akteurs, von dem eine Manifestation erworben werden kann. @de
scope note: Darunter fallen Vertriebe, Herstellerinnen/Hersteller oder Verlage einer veröffentlichten Manifestation oder die Kontaktinformationen des Archivrepositorys, das die Manifestation aufbewahrt. @de
toolkit label: Kontaktinformationen @de
toolkit definition: Ein Name, eine Adresse oder ein anderes Kommunikationsmittel eines Akteurs, von dem eine Manifestation erworben werden kann. @de
label: té com a informació de contacte @ca
definition: Relaciona una manifestació amb un nom, adreça o altres mitjans de comunicació d’un agent del qual es pot obtenir una manifestació. @ca
scope note: Un agent inclou el distribuïdor, el fabricant o l’editor d’una manifestació publicada o el dipòsit d’arxiu que conserva la manifestació. @ca
toolkit label: informació de contacte @ca
toolkit definition: Nom, adreça o altres mitjans de comunicació d’un agent del qual es pot obtenir una manifestació. @ca
definition: Liittää manifestaation toimijan nimeen, osoitteeseen tai muuhun kommunikointikeinoon, jonka avulla manifestaation voi saada toimijalta. @fi
toolkit label: yhteystiedot @fi
toolkit definition: Toimijan nimi, osoite tai muu kommunikointikeino, jonka avulla manifestaation voi saada toimijalta. @fi
toolkit label: kontaktinformasjon @no
toolkit definition: Et navn, en adresse etc. til en agent som en manifestasjon kan anskaffes fra. @no
label: έχει πληροφορίες επικοινωνίας @el
definition: Συνδέει μια εκδήλωση με ένα όνομα, διεύθυνση κ.λπ. ενός οργανισμού κ.λπ. από τον οποίο μπορεί να αποκτηθεί μια εκδήλωση. @el
scope note: Οι πληροφορίες επικοινωνίας περιλαμβάνουν ένα όνομα, διεύθυνση κ.λπ. του εκδότη, του διαθέτη κ.λπ. μιας δημοσιευμένης εκδήλωσης ή του αρχειακού αποθετηρίου το οποίο έχει [στην κατοχή του] την εκδήλωση. @el
toolkit label: πληροφορίες επικοινωνίας @el
toolkit definition: Ένα όνομα, διεύθυνση κ.λπ. ενός οργανισμού κ.λπ. από τον οποίο μπορεί να αποκτηθεί μια εκδήλωση. @el
scope note: Un agent comprend le diffuseur ou le distributeur, le fabricant ou l’éditeur d’une manifestation publiée ou le dépôt d’archives qui conserve la manifestation. @fr
has element type: 6
label: kapcsolati információja a következő: @hu
definition: Hozzákapcsol egy megjelenési formát egy ágens nevéhez, címéhez, vagy a vele folytatott kommunikáció egyéb módjához, amely révén egy megjelenési forma elérhető. @hu
scope note: A kapcsolati információ magába foglalja egy kiadott megjelenési forma kiadójának, terjesztőjének stb. nevét, címét stb., ill. az archiváló repozitóriumét, amely a megjelenési formát állományában tartja. @hu
toolkit label: kapcsolati információja: @hu
toolkit definition: Egy ágens neve, címe, vagy a vele folytatott kommunikáció egyéb módja, amely révén egy megjelenési forma elérhető. @hu
scope note: Toimija on julkaistun manifestaation jakelija, valmistaja tai kustantaja tai manifestaatiota säilyttävä arkisto. @fi
label: yhteystiedot @fi
label: har kontaktinformasjon @no
definition: Relaterer en manifestasjon til et navn, en adresse etc. til en agent som en manifestasjon kan anskaffes fra. @no
scope note: En agent inkluderer distributøren, tilvirkeren eller utgiveren av en publisert manifestasjon eller magasinet hvor manifestasjonen befinner seg. @no
label: heeft contactinformatie @nl
definition: Relateert een manifestatie aan een naam, adres of andere manier om te communiceren met een actor waarvan een resource kan worden verkregen. @nl
label: له بيانات اتصال @ar
definition: يربط بين تجسيدة واسم، وعنوان، إلخ. لوكيل يمكن الحصول منه على تجسيدة. @ar
scope note: يشمل الوكيل الموزع والمصنع والناشر لتجسيدة منشورة، أو المستودع الأرشيفي الذي يحتفظ بالتجسيدة. @ar
toolkit label: بيانات اتصال @ar
toolkit definition: اسم، وعنوان، إلخ. لوكيل يمكن الحصول منه على تجسيدة. @ar
label: kontaktinfo @et
definition: Seostab kehastuse tegija nimega, aadressiga vms, mille abil on võimalik kehastust tegijalt saada. @et
scope note: Tegija võib olla levitaja, valmistaja või kirjastaja (avaldatud kehastuse puhul) või kehastust hoidev arhiiv. @et
toolkit label: kontaktinfo @et
toolkit definition: Tegija nimi, aadress vms, mille abil on võimalik kehastust tegijalt saada. @et
label: ha come informazioni di contatto @it
definition: Correla una manifestazione a un nome, indirizzo, etc. di un agente dal quale è possibile ottenere una manifestazione. @it
scope note: Un agente comprende il distributore, la manifattura o l'editore di una manifestazione pubblicata, o l'archivio di deposito che conserva la manifestazione. @it
toolkit label: informazioni di contatto @it
toolkit definition: Nome, indirizzo, etc. di un agente dal quale è possibile ottenere una manifestazione. @it

has related agent of manifestation
status: Published
sub property of: has related RDA entity of manifestation
type: Property
lexical alias: relatedAgentOfManifestation.en
definition: Relates a manifestation to an agent who is associated with a manifestation.
domain: C10007
label: có tác nhân có liên quan (biểu thị) @vi
definition: Liên kết biểu thị với tác nhân liên quan tới biểu thị đang được mô tả. @vi
label: har agent relateret til manifestation @da
definition: Relaterer en manifestation til en agent, som er knyttet til en manifestation. @da
label: té com a agent relacionat amb una manifestació @ca
definition: Relaciona una manifestació amb un agent que s’associa amb una manifestació. @ca
definition: Liittää manifestaation toimijaan, joka liittyy manifestaatioon. @fi
toolkit label: manifestaatioon liittyvä toimija @fi
toolkit definition: Toimija, joka liittyy manifestaatioon. @fi
label: έχει σχετικό φορέα (εκδήλωση) @el
definition: Συνδέει μια εκδήλωση με έναν φορέα που συνδέεται με μια περιγραφόμενη εκδήλωση. @el
label: a pour agent en relation avec une manifestation @fr
definition: Met une manifestation en relation avec un agent qui est associé à une manifestation. @fr
toolkit label: related agent of manifestation
toolkit definition: An agent who is associated with a manifestation.
has element type: 1
sub property of: P00006
label: megjelenési formához kapcsolódó ágens a következő: @hu
definition: Hozzákapcsol egy megjelenési formát egy megjelenési formához kapcsolódó ágenshez. @hu
alternative label: other agent associated with manifestation
label: manifestaatioon liittyvä toimija @fi
label: har agent relatert til manifestasjon @no
definition: Relaterer en manifestasjon til en agent som forbindes med en manifestasjon. @no
toolkit label: agent relatert til manifestasjon @no
toolkit definition: En agent som forbindes med en manifestasjon. @no
toolkit label: agent en relation avec une manifestation @fr
toolkit definition: Agent qui est associé à une manifestation. @fr
label: heeft gerelateerde actor van manifestatie @nl
definition: Relateert een manifestatie aan een actor die geassocieerd is met een manifestatie. @nl
toolkit label: gerelateerde actor van manifestatie @nl
toolkit definition: Een actor die geassocieerd is met een manifestatie. @nl
label: له وكيل مرتبط بتجسيدة @ar
definition: يربط بين تجسيدة ووكيل يرتبط بتجسيدة. @ar
toolkit label: وكيل مرتبط بتجسيدة @ar
toolkit definition: وكيل يرتبط بتجسيدة. @ar
toolkit label: agent relacionat amb una manifestació @ca
toolkit definition: Agent que s’associa amb una manifestació. @ca
toolkit label: agent relateret til manifestation @da
toolkit definition: Agent, som er knyttet til en manifestation. @da
label: kehastusega seotud tegija @et
definition: Seostab kehastuse kehastusega seotud tegijaga. @et
toolkit label: kehastusega seotud tegija @et
toolkit definition: Kehastusega seotud tegija. @et
label: hat mit Manifestation in Beziehung stehenden Akteur @de
definition: Setzt eine Manifestation in Beziehung zu einem Akteur, der mit einer Manifestation in Verbindung steht. @de
toolkit label: mit Manifestation in Beziehung stehender Akteur @de
toolkit definition: Ein Akteur, der mit einer Manifestation in Verbindung steht. @de
toolkit label: megjelenési formához kapcsolódó ágens: @hu
toolkit definition: Egy megjelenési formához kapcsolódó ágens. @hu
label: ha come agente di manifestazione correlato @it
definition: Correla una manifestazione all'agente associato a una manifestazione. @it
toolkit label: agente di manifestazione correlato @it
toolkit definition: Agente associato a una manifestazione. @it
label: ar manifestāciju saistītais aģents @lv
definition: Sasaista manifestāciju ar aģentu, kas saistīts ar manifestāciju. @lv
toolkit label: ar manifestāciju saistītais aģents @lv
toolkit definition: Aģents, kas saistīts ar manifestāciju. @lv
alternative label: manifestaatioon liittyvä muu toimija @fi
alternative label: وكيل آخر مرتبط بتجسيدة @ar
alternative label: Anden agent, som er knyttet til en manifestation @da
alternative label: Sonstiger Akteur, der mit einer Manifestation in Verbindung steht @de
alternative label: altre agent associat amb una manifestació @ca
alternative label: 载体表现的其他关联行为者 @zh-hans
label: 有载体表现的关联行为者 @zh-hans
definition: 将一种载体表现与和一种载体表现有关的一个行为者关联起来。 @zh-hans
toolkit label: 载体表现的关联行为者 @zh-hans
toolkit definition: 和一种载体表现有关的一个行为者 @zh-hans
alternative label: autre agent associé à une manifestation @fr
alternative label: megjelenési formához kapcsolódó egyéb ágens: @hu
toolkit label: gösterimin ilişkili temsilcisi @tr
toolkit definition: Bir gösterim ile bağlantılı olan bir temsilci. @tr
toolkit label: agente de manifestación relacionado @es
toolkit definition: Un agente que está asociado a una manifestación. @es
has subproperty: has contributor agent to aggregate

has related family of manifestation
status: Published
sub property of: has related collective agent of manifestation
type: Property
lexical alias: relatedFamilyOfManifestation.en
definition: Relates a manifestation to a family who is associated with a manifestation.
domain: C10007
label: có gia đình có liên quan (biểu thị) @vi
definition: Liên kết biểu thị với gia đình liên quan tới biểu thị đang được mô tả. @vi
label: har familie relateret til manifestation @da
definition: Relaterer en manifestation til en familie, som er knyttet til en manifestation. @da
label: té com a família relacionada amb una manifestació @ca
definition: Relaciona una manifestació amb una família que s’associa amb una manifestació. @ca
definition: Liittää manifestaation sukuun, joka liittyy manifestaatioon. @fi
toolkit label: manifestaatioon liittyvä suku @fi
toolkit definition: Suku, joka liittyy manifestaatioon. @fi
label: έχει σχετική οικογένεια (εκδήλωση) @el
definition: Συνδέει μια εκδήλωση με μια οικογένεια που συνδέεται με μια περιγραφόμενη εκδήλωση. @el
label: a pour famille en relation avec une manifestation @fr
definition: Met une manifestation en relation avec une famille qui est associée à une manifestation. @fr
toolkit label: related family of manifestation
toolkit definition: A family who is associated with a manifestation.
has element type: 1
sub property of: P00008
label: megjelenési formához kapcsolódó család a következő: @hu
definition: Hozzákapcsol egy megjelenési formát egy megjelenési formához kapcsolódó családhoz. @hu
label: manifestaatioon liittyvä suku @fi
label: har familie relatert til manifestasjon @no
definition: Relaterer en manifestasjon til en familie som forbindes med en manifestasjon. @no
toolkit label: familie relatert til manifestasjon @no
toolkit definition: En familie som forbindes med en manifestasjon. @no
toolkit label: famille en relation avec une manifestation @fr
toolkit definition: Famille qui est associée à une manifestation. @fr
label: heeft gerelateerde familie van manifestatie @nl
definition: Relateert een manifestatie aan een familie die geassocieerd is met een manifestatie. @nl
toolkit label: gerelateerde familie van manifestatie @nl
toolkit definition: Een familie die geassocieerd is met een manifestatie. @nl
label: له عائلة مرتبطة بتجسيدة @ar
definition: يربط بين تجسيدة وعائلة ترتبط بتجسيدة. @ar
toolkit label: عائلة مرتبطة بتجسيدة @ar
toolkit definition: عائلة ترتبط بتجسيدة. @ar
toolkit label: família relacionada amb una manifestació @ca
toolkit definition: Família que s’associa amb una manifestació. @ca
toolkit label: familie relateret til manifestation @da
toolkit definition: Familie, som er knyttet til en manifestation. @da
label: kehastusega seotud perekond @et
definition: Seostab kehastuse kehastusega seotud perekonnaga. @et
toolkit label: kehastusega seotud perekond @et
toolkit definition: Kehastusega seotud perekond. @et
label: hat mit Manifestation in Beziehung stehende Familie @de
definition: Setzt eine Manifestation in Beziehung zu einer Familie, die mit einer Manifestation in Verbindung steht. @de
toolkit label: mit Manifestation in Beziehung stehende Familie @de
toolkit definition: Eine Familie, die mit einer Manifestation in Verbindung steht. @de
toolkit label: megjelenési formához kapcsolódó család: @hu
toolkit definition: Egy megjelenési formához kapcsolódó család. @hu
label: ha come famiglia di manifestazione correlata @it
definition: Correla una manifestazione alla famiglia associata a una manifestazione. @it
toolkit label: famiglia di manifestazione correlata @it
toolkit definition: Famiglia associata a una manifestazione. @it
label: ar manifestāciju saistītā dzimta/ģimene @lv
definition: Sasaista manifestāciju ar dzimtu/ģimeni, kas saistīta ar manifestāciju. @lv
toolkit label: ar manifestāciju saistītā dzimta/ģimene @lv
toolkit definition: Dzimta/ģimene, kas saistīta ar manifestāciju. @lv
label: 有载体表现的关联家族 @zh-hans
definition: 将一种载体表现与和一种载体表现有关的一个家族关联起来。 @zh-hans
toolkit label: 载体表现的关联家族 @zh-hans
toolkit definition: 和一种载体表现有关的一个家族 @zh-hans
label: gösterimin ilgili ailesi ile ilişkilidir @tr
definition: Bir gösterimi, bir gösterimle ilişkili olan bir aile ile ilişkilendirir. @tr
toolkit label: Anlatımla ilişkili aile @tr
toolkit definition: Bir gösterim ile bağlantılı olan bir aile. @tr
label: tiene familia relacionada de manifestación @es
definition: Relaciona una manifestación con una familia que está asociada a una manifestación. @es
toolkit label: familia relacionada de manifestación @es
toolkit definition: Una familia que está asociada a una manifestación. @es
has subproperty: has contributor family to aggregate
has subproperty: has creator family of manifestation
has subproperty: has distributor family
has subproperty: has papermaker family
has subproperty: P30269

has related place of manifestation
status: Published
sub property of: has related RDA entity of manifestation
type: Property
lexical alias: relatedPlaceOfManifestation.en
definition: Relates a manifestation to a place that is associated with a manifestation.
domain: C10007
label: có địa điểm có liên quan (biểu thị) @vi
definition: Liên kết biểu thị với địa điểm liên quan tới biểu thị đang được mô tả. @vi
label: har sted relateret til manifestation @da
definition: Relaterer en manifestation til et sted, som er knyttet til en manifestation. @da
label: té com a lloc relacionat amb una manifestació @ca
definition: Relaciona una manifestació amb un lloc que s’associa amb una manifestació. @ca
definition: Liittää manifestaation paikkaan, joka liittyy manifestaatioon. @fi
toolkit label: manifestaatioon liittyvä paikka @fi
toolkit definition: Paikka, joka liittyy manifestaatioon. @fi
label: έχει σχετικό τόπο (εκδήλωση) @el
definition: Συνδέει μια εκδήλωση με έναν τόπο που συνδέεται με μια περιγραφόμενη εκδήλωση. @el
label: a pour lieu en relation avec une manifestation @fr
definition: Met une manifestation en relation avec un lieu qui est associé à une manifestation. @fr
toolkit label: related place of manifestation
toolkit definition: A place that is associated with a manifestation.
has element type: 1
sub property of: P00010
label: megjelenési forma kapcsolódó helye a következő: @hu
definition: Hozzákapcsol egy megjelenési formát egy helyhez, amelyet egy megjelenési formához társítanak. @hu
label: manifestaatioon liittyvä paikka @fi
label: har sted relatert til manifestasjon @no
definition: Relaterer en manifestasjon til et sted som forbindes med en manifestasjon. @no
toolkit label: sted relatert til manifestasjon @no
toolkit definition: Et sted som forbindes med en manifestasjon. @no
toolkit label: lieu en relation avec une manifestation @fr
toolkit definition: Lieu qui est associé à une manifestation. @fr
label: heeft gerelateerde plaats van manifestatie @nl
definition: Relateert een manifestatie aan een plaats die geassocieerd is met een manifestatie. @nl
toolkit label: gerelateerde plaats van manifestatie @nl
toolkit definition: Een plaats die geassocieerd is met een manifestatie. @nl
label: له مكان مرتبط بتجسيدة @ar
definition: يربط بين تجسيدة ومكان يرتبط بتجسيدة. @ar
toolkit label: مكان مرتبط بتجسيدة @ar
toolkit definition: مكان يرتبط بتجسيدة. @ar
toolkit label: lloc relacionat amb una manifestació @ca
toolkit definition: Lloc que s’associa amb una manifestació. @ca
toolkit label: sted relateret til manifestation @da
toolkit definition: Sted, som er knyttet til en manifestation. @da
label: kehastusega seotud koht @et
definition: Seostab kehastuse kehastusega seotud kohaga. @et
toolkit label: kehastusega seotud koht @et
toolkit definition: Kehastusega seotud koht. @et
label: hat mit Manifestation in Beziehung stehendes Geografikum @de
definition: Setzt eine Manifestation in Beziehung zu einem Geografikum, das mit einer Manifestation in Verbindung steht. @de
toolkit label: mit Manifestation in Beziehung stehendes Geografikum @de
toolkit definition: Ein Geografikum, das mit einer Manifestation in Verbindung steht. @de
toolkit label: megjelenési formával kapcsolatban álló hely @hu
toolkit definition: Egy hely, amelyet egy megjelenési formához társítanak. @hu
label: ha come luogo di manifestazione correlato @it
definition: Correla una manifestazione a un luogo associato a una manifestazione. @it
toolkit label: luogo di manifestazione correlato @it
toolkit definition: Luogo associato a una manifestazione. @it
label: ar manifestāciju saistītā vieta @lv
definition: Sasaista manifestāciju ar vietu, kas saistīta ar manifestāciju. @lv
toolkit label: ar manifestāciju saistītā vieta @lv
toolkit definition: Vieta, kas saistīta ar manifestāciju. @lv
label: 有载体表现的关联地点 @zh-hans
definition: 将一种载体表现与和一种载体表现有关的一个地点关联起来。 @zh-hans
toolkit label: 载体表现的关联地点 @zh-hans
toolkit definition: 和一种载体表现有关的一个地点 @zh-hans
label: gösterimin ilgili yeri ile ilişkilidir @tr
definition: Bir gösterimi, bir gösterimle ilişkili bir yerle ilişkilendirir. @tr
toolkit label: Gösterimle ilişkili yer @tr
toolkit definition: Bir gösterim ile bağlantılı olan bir yer. @tr
label: tiene lugar de manifestación relacionado @es
definition: Relaciona una manifestación con un lugar que está asociado a una manifestación. @es
toolkit label: lugar de manifestación relacionado @es
toolkit definition: Un lugar que está asociado a una manifestación. @es
has subproperty: has place of manifestation
has subproperty: has location of collection
has subproperty: P30272

has related timespan of manifestation
status: Published
sub property of: has related RDA entity of manifestation
type: Property
lexical alias: relatedTimespanOfManifestation.en
definition: Relates a manifestation to a timespan that is associated with a manifestation.
domain: C10007
label: có khoảng thời gian có liên quan (biểu thị) @vi
definition: Liên kết biểu thị với khoảng thời gian liên quan tới biểu thị đang được mô tả. @vi
label: har tidsperiode relateret til manifestation @da
definition: Relaterer en manifestation til en tidsperiode, som er knyttet til en manifestation. @da
label: té com a interval de temps relacionat amb una manifestació @ca
definition: Relaciona una manifestació amb un interval de temps que s’associa amb una manifestació. @ca
definition: Liittää manifestaation ajanjaksoon, joka liittyy manifestaatioon. @fi
toolkit label: manifestaatioon liittyvä ajanjakso @fi
toolkit definition: Ajanjakso, joka liittyy manifestaatioon. @fi
label: έχει σχετικό χρονικό διάστημα (εκδήλωση) @el
definition: Συνδέει μια εκδήλωση με ένα χρονικό διάστημα που συνδέεται με μια περιγραφόμενη εκδήλωση. @el
label: a pour laps de temps en relation avec une manifestation @fr
definition: Met une manifestation en relation avec un laps de temps qui est associé à une manifestation. @fr
toolkit label: related timespan of manifestation
toolkit definition: A timespan that is associated with a manifestation.
has element type: 1
sub property of: P00011
label: megjelenési forma kapcsolódó időtartama a következő: @hu
definition: Egy megjelenési formát hozzákapcsol a megjelenési formához társított időtartamhoz. @hu
label: manifestaatioon liittyvä ajanjakso @fi
label: har tidsrom relatert til manifestasjon @no
definition: Relaterer en manifestasjon til et tidsrom som forbindes med en manifestasjon. @no
toolkit label: tidsrom relatert til manifestasjon @no
toolkit definition: Et tidsrom som forbindes med en manifestasjon. @no
toolkit label: laps de temps en relation avec une manifestation @fr
toolkit definition: Laps de temps qui est associé à une manifestation. @fr
label: heeft gerelateerde tijdspanne van manifestatie @nl
definition: Relateert een manifestatie aan een tijdspanne die geassocieerd is met een manifestatie. @nl
toolkit label: gerelateerde tijdspanne van manifestatie @nl
toolkit definition: Een tijdspanne die geassocieerd is met een manifestatie. @nl
label: له فترة زمنية مرتبطة بتجسيدة @ar
definition: يربط بين تجسيدة وفترة زمنية ترتبط بتجسيدة. @ar
toolkit label: فترة زمنية مرتبطة بتجسيدة @ar
toolkit definition: فترة زمنية ترتبط بتجسيدة. @ar
toolkit label: interval de temps relacionat amb una manifestació @ca
toolkit definition: Interval de temps que s’associa amb una manifestació. @ca
toolkit label: tidsperiode relateret til manifestation @da
toolkit definition: Tidsperiode, som er knyttet til en manifestation. @da
label: kehastusega seotud ajavahemik @et
definition: Seostab kehastuse kehastusega seotud ajavahemikuga. @et
toolkit label: kehastusega seotud ajavahemik @et
toolkit definition: Kehastusega seotud ajavahemik. @et
label: hat mit Manifestation in Beziehung stehenden Zeitraum @de
definition: Setzt eine Manifestation in Beziehung zu einem Zeitraum, der mit einer Manifestation in Verbindung steht. @de
toolkit label: mit Manifestation in Beziehung stehender Zeitraum @de
toolkit definition: Ein Zeitraum, der mit einer Manifestation in Verbindung steht. @de
toolkit label: megjelenési formával kapcsolatban álló időtartam @hu
toolkit definition: Egy megjelenési formához társított időtartam. @hu
label: ha come arco di tempo di manifestazione correlato @it
definition: Correla una manifestazione a un arco di tempo associato a una manifestazione. @it
toolkit label: arco di tempo di manifestazione correlato @it
toolkit definition: Arco di tempo associato a una manifestazione. @it
label: ar manifestāciju saistītais laikposms @lv
definition: Sasaista manifestāciju ar laikposmu, kas saistīts ar manifestāciju. @lv
toolkit label: ar manifestāciju saistītais laikposms @lv
toolkit definition: Laikposms, kas saistīts ar manifestāciju. @lv
label: 有载体表现的关联时间段 @zh-hans
definition: 将一种载体表现与和一种载体表现有关的一个时间段关联起来。 @zh-hans
toolkit label: 载体表现的关联时间段 @zh-hans
toolkit definition: 和一种载体表现有关的一个时间段 @zh-hans
label: gösterimin ilgili zaman aralığı ile ilişkilidir @tr
definition: Bir gösterimi, bir gösterimle ilişkili bir zaman aralığıyla ilişkilendirir. @tr
toolkit label: Gösterimin zaman aralığıyla ilişkisi @tr
toolkit definition: Bir gösterimle bağlantılı olan bir zaman aralığı. @tr
label: tiene un período de tiempo de manifestación relacionado @es
definition: Relaciona una manifestación con un período de tiempo asociado con una manifestación. @es
toolkit label: período de tiempo de manifestación relacionado @es
toolkit definition: Un período de tiempo asociado con una manifestación. @es
has subproperty: has date of manifestation
has subproperty: P30273

has related expression of manifestation
status: Published
sub property of: has related RDA entity of manifestation
type: Property
lexical alias: relatedExpressionOfManifestation.en
definition: Relates a manifestation to an expression that is associated with a manifestation.
domain: C10007
label: có biểu hiện có liên quan (biểu th) @vi
definition: Liên kết biểu thị với biểu hiện liên quan tới biểu thị đang được mô tả. @vi
label: har udtryk relateret til manifestation @da
definition: Relaterer en manifestation til til et udtryk, som er knyttet til en manifestation. @da
label: té com a expressió relacionada amb una manifestació @ca
definition: Relaciona una manifestació amb una expressió que s’associa amb una manifestació. @ca
definition: Liittää manifestaation ekspressioon, joka liittyy manifestaatioon. @fi
toolkit label: manifestaatioon liittyvä ekspressio @fi
toolkit definition: Ekspressio, joka liittyy manifestaatioon. @fi
label: έχει σχετική έκφραση (εκδήλωση) @el
definition: Συνδέει μια εκδήλωση με μια έκφραση που συνδέεται με μια περιγραφόμενη εκδήλωση. @el
label: a pour expression en relation avec une manifestation @fr
definition: Met une manifestation en relation avec une expression qui est associée à une manifestation. @fr
toolkit label: related expression of manifestation
toolkit definition: An expression that is associated with a manifestation.
has element type: 1
sub property of: P00003
label: megjelenési forma kapcsolódó kifejezési formája a következő: @hu
definition: Hozzákapcsol egy megjelenési formát egy kifejezési formához, amelyet egy megjelenési formához társítanak. @hu
label: manifestaatioon liittyvä ekspressio @fi
label: har uttrykk relatert til manifestasjon @no
definition: Relaterer en manifestasjon til et uttrykk som forbindes med en manifestasjon. @no
toolkit label: uttrykk relatert til manifestasjon @no
toolkit definition: Et uttrykk som forbindes med en manifestasjon. @no
toolkit label: expression en relation avec une manifestation @fr
toolkit definition: Expression qui est associée à une manifestation. @fr
label: heeft gerelateerde expressie van manifestatie @nl
definition: Relateert een manifestatie aan een expressie die geassocieerd is met een manifestatie. @nl
toolkit label: gerelateerde expressie van manifestatie @nl
toolkit definition: Een expressie die geassocieerd is met een manifestatie. @nl
label: له تعبيرة مرتبطة بتجسيدة @ar
definition: يربط بين تجسيدة وتعبيرة مرتبطة بتجسيدة. @ar
toolkit label: تعبيرة مرتبطة بتجسيدة @ar
toolkit definition: تعبيرة مرتبطة بتجسيدة. @ar
toolkit label: expressió relacionada amb una manifestació @ca
toolkit definition: Expressió que s’associa amb una manifestació. @ca
toolkit label: udtryk relateret til manifestation @da
toolkit definition: Udtryk, som er knyttet til en manifestation. @da
label: kehastusega seotud väljendus @et
definition: Seostab kehastuse kehastusega seotud väljendusega. @et
toolkit label: kehastusega seotud väljendus @et
toolkit definition: Kehastusega seotud väljendus. @et
label: hat mit Manifestation in Beziehung stehende Expression @de
definition: Setzt eine Manifestation in Beziehung zu einer Expression, die mit einer Manifestation in Verbindung steht. @de
toolkit label: mit Manifestation in Beziehung stehende Expression @de
toolkit definition: Eine Expression, die mit einer Manifestation in Verbindung steht. @de
toolkit label: megjelenési formával kapcsolatban álló kifejezési formája: @hu
toolkit definition: Egy kifejezési forma, amelyet egy megjelenési formához társítanak. @hu
label: ha come espressione di manifestazione correlata @it
definition: Correla una manifestazione a un'espressione associata a una manifestazione. @it
toolkit label: espressione di manifestazione correlata @it
toolkit definition: Espressione associata a una manifestazione. @it
label: ar manifestāciju saistītā izteiksme @lv
definition: Sasaista manifestāciju ar izteiksmi, kas ir saistīta ar manifestāciju. @lv
toolkit label: ar manifestāciju saistītā izteiksme @lv
toolkit definition: Izteiksme, kas ir saistīta ar manifestāciju. @lv
label: 有载体表现的关联内容表达 @zh-hans
definition: 将一种载体表现与和一种载体表现有关的一种内容表达关联起来。 @zh-hans
toolkit label: 载体表现的关联内容表达 @zh-hans
toolkit definition: 和一种载体表现有关的一种内容表达 @zh-hans
label: gösterimin ilgili anlatımı ile ilişkilidir @tr
definition: Bir gösterimi, bir gösterimle ilişkili bir anlatımla ilişkilendirir. @tr
toolkit label: gösterimin ilişkili anlatımı @tr
toolkit definition: Bir gösterimle bağlantılı olan bir anlatım. @tr
label: tiene expresión relacionada de manifestación @es
definition: Relaciona una manifestación con una expresión que está asociada a una manifestación. @es
toolkit label: expresión relacionada de manifestación @es
toolkit definition: Una expresión que está asociada a una manifestación. @es
has subproperty: has expression manifested
has subproperty: P30266

has related collective agent of manifestation
status: Published
sub property of: has related agent of manifestation
type: Property
lexical alias: relatedCollectiveAgentOfManifestation.en
definition: Relates a manifestation to a collective agent who is associated with a manifestation.
domain: C10007
label: có tác nhân tập thể có liên quan (biểu thị) @vi
definition: Liên kết biểu thị với tác nhân tập thể liên quan tới biểu thị đang được mô tả. @vi
label: har kollektiv agent relateret til manifestation @da
definition: Relaterer en manifestation til en kollektiv agent, som er knyttet til en manifestation. @da
label: té com a agent col·lectiu relacionat amb una manifestació @ca
definition: Relaciona una manifestació amb un agent col·lectiu que s’associa amb una manifestació. @ca
definition: Liittää manifestaation yhteistoimijaan, joka liittyy manifestaatioon. @fi
toolkit label: manifestaatioon liittyvä yhteistoimija @fi
toolkit definition: Yhteistoimija, joka liittyy manifestaatioon. @fi
label: έχει σχετικό συλλογικό φορέα (εκδήλωση) @el
definition: Συνδέει μια εκδήλωση με έναν συλλογικό φορέα που συνδέεται με μια περιγραφόμενη εκδήλωση. @el
label: a pour agent collectif en relation avec une manifestation @fr
definition: Met une manifestation en relation avec un agent collectif qui est associé à une manifestation. @fr
toolkit label: related collective agent of manifestation
toolkit definition: A collective agent who is associated with a manifestation.
has element type: 1
sub property of: P00012
label: megjelenési formához kapcsolódó kollektív ágens a következő: @hu
definition: Hozzákapcsol egy megjelenési formát egy megjelenési formához kapcsolódó kollektív ágenshez. @hu
label: manifestaatioon liittyvä yhteistoimija @fi
label: har kollektiv agent relatert til manifestasjon @no
definition: Relaterer en manifestasjon til en kollektiv agent som forbindes med en manifestasjon. @no
toolkit label: kollektiv agent relatert til manifestasjon @no
toolkit definition: En kollektiv agent som forbindes med en manifestasjon. @no
toolkit label: agent collectif en relation avec une manifestation @fr
toolkit definition: Agent collectif qui est associé à une manifestation. @fr
label: heeft gerelateerde collectieve actor van manifestatie @nl
definition: Relateert een manifestatie aan een collectieve actor die geassocieerd is met een manifestatie. @nl
toolkit label: gerelateerde collectieve actor van manifestatie @nl
toolkit definition: Een collectieve actor die geassocieerd is met een manifestatie. @nl
label: له وكيل جماعي مرتبط بتجسيدة @ar
definition: يربط بين تجسيدة ووكيل جماعي يرتبط بتجسيدة. @ar
toolkit label: له وكيل جماعي مرتبط بتجسيدة @ar
toolkit definition: وكيل جماعي يرتبط بتجسيدة. @ar
toolkit label: agent col·lectiu relacionat amb una manifestació @ca
toolkit definition: Agent col·lectiu que s’associa amb una manifestació. @ca
toolkit label: kollektiv agent relateret til manifestation @da
toolkit definition: Kollektiv agent, som er knyttet til en manifestation. @da
label: kehastusega seotud kollektiiv @et
definition: Seostab kehastuse kehastusega seotud kollektiiviga. @et
toolkit label: kehastusega seotud kollektiiv @et
toolkit definition: Kehastusega seotud kollektiiv. @et
label: hat mit Manifestation in Beziehung stehenden gemeinschaftlichen Akteur @de
definition: Setzt eine Manifestation in Beziehung zu einem gemeinschaftlichen Akteur, der mit einer Manifestation in Verbindung steht. @de
toolkit label: mit Manifestation in Beziehung stehender gemeinschaftlicher Akteur @de
toolkit definition: Ein gemeinschaftlicher Akteur, der mit einer Manifestation in Verbindung steht. @de
toolkit label: megjelenési formához kapcsolódó kollektív ágens: @hu
toolkit definition: Egy megjelenési formához kapcsolódó kollektív ágens. @hu
label: ha come agente collettivo di manifestazione correlato @it
definition: Correla una manifestazione all'agente collettivo associato a una manifestazione. @it
toolkit label: agente collettivo di manifestazione correlato @it
toolkit definition: Agente collettivo associato a una manifestazione. @it
label: ar manifestāciju saistītā grupa @lv
definition: Sasaista manifestāciju ar grupu, kas saistīta ar manifestāciju. @lv
toolkit label: ar manifestāciju saistītā grupa @lv
toolkit definition: Grupa, kas saistīta ar manifestāciju. @lv
label: 有载体表现的关联集体行为者 @zh-hans
definition: 将一种载体表现与和一种载体表现有关的一个集体行为者关联起来。 @zh-hans
toolkit label: 载体表现的关联集体行为者 @zh-hans
toolkit definition: 和一种载体表现有关的一个集体行为者 @zh-hans
label: gösterimin ilgili kolektif temsilcisi ile ilişkilidir @tr
definition: Bir gösterimi ortak olan kolektif temsilciyle ilişkilendirir. @tr
toolkit label: Anlatımın kolektif temsilciyle ilişkisi @tr
toolkit definition: Bir gösterimle ilişkilendirilen kolektif bir aracı. @tr
label: tiene agente colectivo de manifestación relacionado @es
definition: Relaciona una manifestación con un agente colectivo que está asociado a una manifestación. @es
toolkit label: agente colectivo de manifestación relacionado @es
toolkit definition: Un agente colectivo que está asociado a una manifestación. @es
has subproperty: has contributor collective agent to aggregate
has subproperty: has creator collective agent of manifestation
has subproperty: has distributor collective agent
has subproperty: has related family of manifestation
has subproperty: has related corporate body of manifestation

has related work of manifestation
status: Published
sub property of: has related RDA entity of manifestation
type: Property
lexical alias: relatedWorkOfManifestation.en
definition: Relates a manifestation to a work that is associated with a manifestation.
domain: C10007
label: có biểu thị tác phẩm có liên quan @vi
definition: Liên kết biểu thị với tác phẩm liên quan tới biểu thị đang được mô tả. @vi
label: har værk relateret til manifestation @da
definition: Relaterer en manifestation til et værk, som er knyttet til en manifestation. @da
label: té com a obra relacionada amb una manifestació @ca
definition: Relaciona una manifestació amb una obra que s’associa amb una manifestació. @ca
definition: Liittää manifestaation teokseen, joka liittyy manifestaatioon. @fi
toolkit label: manifestaatioon liittyvä teos @fi
toolkit definition: Teos, joka liittyy kuvailtavaan manifestaatioon. @fi
label: έχει σχετικό έργο (εκδήλωση) @el
definition: Συνδέει μια εκδήλωση με ένα έργο που συνδέεται με μια περιγραφόμενη εκδήλωση. @el
label: a pour œuvre en relation avec une manifestation @fr
definition: Met une manifestation en relation avec une œuvre qui est associée à une manifestation. @fr
toolkit label: related work of manifestation
toolkit definition: A work that is associated with a manifestation.
has element type: 1
sub property of: P00002
label: megjelenési forma kapcsolódó műve a következő: @hu
definition: Hozzákapcsol egy megjelenési formát egy műhöz, amelyet egy megjelenési formához társítanak. @hu
label: manifestaatioon liittyvä teos @fi
label: har verk relatert til manifestasjon @no
definition: Relaterer en manifestasjon til et verk som forbindes med en manifestasjon. @no
toolkit label: verk relatert til manifestasjon @no
toolkit definition: Et verk som forbindes med en manifestasjon. @no
toolkit label: œuvre en relation avec une manifestation @fr
toolkit definition: Œuvre qui est associée à une manifestation. @fr
label: heeft gerelateerd werk van manifestatie @nl
definition: Relateert een manifestatie aan een werk dat geassocieerd is met een manifestatie. @nl
toolkit label: gerelateerd werk van manifestatie @nl
toolkit definition: Een werk dat geassocieerd is met een manifestatie. @nl
label: له عمل مرتبط بتجسيدة @ar
definition: يربط بين تجسيدة وعمل مرتبط بتجسيدة. @ar
toolkit label: عمل مرتبط بتجسيدة @ar
toolkit definition: عمل مرتبط بتجسيدة. @ar
toolkit label: obra relacionada amb una manifestació @ca
toolkit definition: Obra que s’associa amb una manifestació. @ca
toolkit label: værk relateret til manifestation @da
toolkit definition: Værk, som er knyttet til en manifestation. @da
label: kehastusega seotud teos @et
definition: Seostab kehastuse kehastusega seotud teosega. @et
toolkit label: kehastusega seotud teos @et
toolkit definition: Kehastusega seotud teos. @et
label: hat mit Manifestation in Beziehung stehendes Werk @de
definition: Setzt eine Manifestation in Beziehung zu einem Werk, das mit einer Manifestation in Verbindung steht. @de
toolkit label: mit Manifestation in Beziehung stehendes Werk @de
toolkit definition: Ein Werk, das mit einer Manifestation in Verbindung steht. @de
toolkit label: megjelenési formával kapcsolatban álló mű @hu
toolkit definition: Egy mű, amelyet egy megjelenési formához társítanak. @hu
label: ha come opera di manifestazione correlata @it
definition: Correla una manifestazione a un'opera associata a una manifestazione. @it
toolkit label: opera di manifestazione correlata @it
toolkit definition: Opera associata a una manifestazione. @it
label: ar manifestāciju saistītais darbs @lv
definition: Sasaista manifestāciju ar darbu, kas saistīts ar manifestāciju. @lv
toolkit label: ar manifestāciju saistītais darbs @lv
toolkit definition: Darbs, kas saistīts ar manifestāciju. @lv
label: 有载体表现的关联作品 @zh-hans
definition: 将一种载体表现与和一种载体表现有关的一种作品关联起来。 @zh-hans
toolkit label: 载体表现的关联作品 @zh-hans
toolkit definition: 和一种载体表现有关的一种作品 @zh-hans
label: gösterimin ilgili eseri ile ilişkilidir @tr
definition: Bir gösterimi, bir gösterimle ilişkili bir eserle ilişkilendirir. @tr
toolkit label: Gösterimle ilişkili eser @tr
toolkit definition: Bir gösterim ile bağlantılı olan bir eser. @tr
label: tiene obra relacionada de manifestación @es
definition: Relaciona una manifestación con una obra que está asociada a una manifestación. @es
toolkit label: obra relacionada de manifestación @es
toolkit definition: Una obra que está asociada a una manifestación. @es
has subproperty: has binding of manifestation
has subproperty: is subject manifestation of
has subproperty: has work manifested
has subproperty: is source consulted of
has subproperty: has index

has related nomen of manifestation
status: Published
sub property of: has related RDA entity of manifestation
type: Property
lexical alias: relatedNomenOfManifestation.en
definition: Relates a manifestation to a nomen that is associated with a manifestation.
domain: C10007
label: có danh pháp có liên quan (biểu thị) @vi
definition: Liên kết biểu thị với danh pháp liên quan tới biểu thị đang được mô tả. @vi
label: har nomen relateret til manifestation @da
definition: Relaterer en manifestation til et nomen, som er knyttet til en manifestation. @da
label: té com a nomen relacionat amb una manifestació @ca
definition: Relaciona una manifestació amb un nomen que s’associa amb una manifestació. @ca
definition: Liittää manifestaation nomeniin, joka liittyy manifestaatioon. @fi
toolkit label: manifestaatioon liittyvä nomen @fi
toolkit definition: Nomen, joka liittyy manifestaatioon. @fi
label: έχει σχετικό όνομα (εκδήλωση) @el
definition: Συνδέει μια εκδήλωση με ένα όνομα που συνδέεται με μια περιγραφόμενη εκδήλωση. @el
label: a pour nomen en relation avec une manifestation @fr
definition: Met une manifestation en relation avec un nomen qui est associé à une manifestation. @fr
toolkit label: related nomen of manifestation
toolkit definition: A nomen that is associated with a manifestation.
has element type: 1
sub property of: P00013
label: megjelenési forma kapcsolódó nomenje a következő: @hu
definition: Hozzákapcsol egy megjelenési formát egy nomenhez, amelyet egy megjelenési formához társítanak. @hu
label: manifestaatioon liittyvä nomen @fi
label: har nomen relatert til manifestasjon @no
definition: Relaterer en manifestasjon til et nomen som forbindes med en manifestasjon. @no
toolkit label: nomen relatert til manifestasjon @no
toolkit definition: Et nomen som forbindes med en manifestasjon. @no
toolkit label: nomen en relation avec une manifestation @fr
toolkit definition: Nomen qui est associé à une manifestation. @fr
label: heeft gerelateerde nomen van manifestatie @nl
definition: Relateert een manifestatie aan een nomen dat geassocieerd is met een manifestatie. @nl
toolkit label: gerelateerde nomen van manifestatie @nl
toolkit definition: Een nomen dat geassocieerd is met een manifestatie. @nl
label: له تسمية مرتبطة بتجسيدة @ar
definition: يربط بين تجسيدة وتسمية ترتبط بتجسيدة. @ar
toolkit label: تسمية مرتبطة بتجسيدة @ar
toolkit definition: تسمية ترتبط بتجسيدة. @ar
toolkit label: nomen relacionat amb una manifestació @ca
toolkit definition: Nomen que s’associa amb una manifestació. @ca
toolkit label: nomen relateret til manifestation @da
toolkit definition: Nomen, som er knyttet til en manifestation. @da
label: kehastusega seotud nomen @et
definition: Seostab kehastuse kehastusega seotud nomen'iga. @et
toolkit label: kehastusega seotud nomen @et
toolkit definition: Kehastusega seotud nomen. @et
label: hat mit Manifestation in Beziehung stehendes Nomen @de
definition: Setzt eine Manifestation in Beziehung zu einem Nomen, das mit einer Manifestation in Verbindung steht. @de
toolkit label: mit Manifestation in Beziehung stehendes Nomen @de
toolkit definition: Ein Nomen, das mit einer Manifestation in Verbindung steht. @de
toolkit label: megjelenési formával kapcsolatban álló nomen @hu
toolkit definition: Egy nomen, amelyet egy megjelenési formához társítanak. @hu
label: ha come nomen di manifestazione correlato @it
definition: Correla una manifestazione a un nomen associato a una manifestazione. @it
toolkit label: nomen di manifestazione correlato @it
toolkit definition: Nomen associato a una manifestazione. @it
label: ar manifestāciju saistītais nomens @lv
definition: Sasaista manifestāciju ar nomenu, kas saistīts ar manifestāciju. @lv
toolkit label: ar manifestāciju saistītais nomens @lv
toolkit definition: Nomens, kas saistīts ar manifestāciju. @lv
label: 有载体表现的关联命名 @zh-hans
definition: 将一种载体表现与和一种载体表现有关的一个命名关联起来。 @zh-hans
toolkit label: 载体表现的关联命名 @zh-hans
toolkit definition: 和一种载体表现有关的一个命名 @zh-hans
label: gösterimin ilgili ismi ile ilişkilidir @tr
definition: Bir gösterimi, bir gösterimle ilişkili bir isimle ilişkilendirir. @tr
toolkit label: gösterimin ilişkili ismi @tr
toolkit definition: Bir gösterimle bağlantılı olan bir isim. @tr
label: tiene nomen de manifestación relacionado @es
definition: Relaciona una manifestación con un nomen que está asociado a una manifestación. @es
toolkit label: nomen de manifestación relacionado @es
toolkit definition: Un nomen que está asociado a una manifestación. @es
has subproperty: has appellation of manifestation
has subproperty: has first alphanumeric designation of sequence
has subproperty: has first chronological designation of sequence
has subproperty: has last alphanumeric designation of sequence
has subproperty: has last chronological designation of sequence

has related person of manifestation
status: Published
sub property of: has related agent of manifestation
type: Property
lexical alias: relatedPersonOfManifestation.en
definition: Relates a manifestation to a person who is associated with a manifestation.
domain: C10007
label: có cá nhân có liên quan (biểu thị) @vi
definition: Liên kết biểu thị với cá nhân liên quan tới biểu thị đang được mô tả. @vi
label: har person relateret til manifestation @da
definition: Relaterer en manifestation til en person, som er knyttet til en manifestation. @da
label: té com a persona relacionada amb una manifestació @ca
definition: Relaciona una manifestació amb una persona que s’associa amb una manifestació. @ca
definition: Liittää manifestaation henkilöön, joka liittyy manifestaatioon. @fi
toolkit label: manifestaatioon liittyvä henkilö @fi
toolkit definition: Henkilö, joka liittyy manifestaatioon. @fi
label: έχει σχετικό φυσικό πρόσωπο (εκδήλωση) @el
definition: Συνδέει μια εκδήλωση με ένα φυσικό πρόσωπο που συνδέεται με μια περιγραφόμενη εκδήλωση. @el
label: a pour personne en relation avec une manifestation @fr
definition: Met une manifestation en relation avec une personne qui est associée à une manifestation. @fr
toolkit label: related person of manifestation
toolkit definition: A person who is associated with a manifestation.
has element type: 1
sub property of: P00007
label: megjelenési formához kapcsolódó személy a következő: @hu
definition: Hozzákapcsol egy megjelenési formát egy megjelenési formához kapcsolódó személyhez. @hu
label: manifestaatioon liittyvä henkilö @fi
label: har person relatert til manifestasjon @no
definition: Relaterer en manifestasjon til en person som forbindes med en manifestasjon. @no
toolkit label: person relatert til manifestasjon @no
toolkit definition: En person som forbindes med en manifestasjon. @no
toolkit label: personne en relation avec une manifestation @fr
toolkit definition: Personne qui est associée à une manifestation. @fr
label: heeft gerelateerde persoon van manifestatie @nl
definition: Relateert een manifestatie aan een persoon die geassocieerd is met een manifestatie. @nl
toolkit label: gerelateerde persoon van manifestatie @nl
toolkit definition: Een persoon die geassocieerd is met een manifestatie. @nl
label: له شخص مرتبط بتجسيدة @ar
definition: يربط بين تجسيدة وشخص يرتبط بتجسيدة. @ar
toolkit label: شخص مرتبط بتجسيدة @ar
toolkit definition: شخص يرتبط بتجسيدة. @ar
toolkit label: persona relacionada amb una manifestació @ca
toolkit definition: Persona que s’associa amb una manifestació. @ca
toolkit label: person relateret til manifestation @da
toolkit definition: Person, som er knyttet til en manifestation. @da
label: kehastusega seotud isik @et
definition: Seostab kehastuse kehastusega seotud isikuga. @et
toolkit label: kehastusega seotud isik @et
toolkit definition: Kehastusega seotud isik. @et
label: hat mit Manifestation in Beziehung stehende Person @de
definition: Setzt eine Manifestation in Beziehung zu einer Person, die mit einer Manifestation in Verbindung steht. @de
toolkit label: mit Manifestation in Beziehung stehende Person @de
toolkit definition: Eine Person, die mit einer Manifestation in Verbindung steht. @de
toolkit label: megjelenési formához kapcsolódó személy: @hu
toolkit definition: Egy megjelenési formához kapcsolódó személy. @hu
label: ha come persona di manifestazione correlata @it
definition: Correla una manifestazione alla persona associata a una manifestazione. @it
toolkit label: persona di manifestazione correlata @it
toolkit definition: Persona associata a una manifestazione. @it
label: ar manifestāciju saistītā persona @lv
definition: Sasaista manifestāciju ar personu, kura saistīta ar manifestāciju. @lv
toolkit label: ar manifestāciju saistītā persona @lv
toolkit definition: Persona, kura saistīta ar manifestāciju. @lv
label: 有载体表现的关联个人 @zh-hans
definition: 将一种载体表现与和一种载体表现有关的一个个人关联起来。 @zh-hans
toolkit label: 载体表现的关联个人 @zh-hans
toolkit definition: 和一种载体表现有关的一个个人 @zh-hans
label: gösterimin ilgili kişisi ile ilişkilidir @tr
definition: Bir gösterim, bir gösterimle ilişkili olan bir kişiyle ilişkilendirir. @tr
toolkit label: gösterimle ilişkili kişi @tr
toolkit definition: Bir gösterim ile bağlantılı olan bir kişi. @tr
label: tiene persona relacionada de manifestación @es
definition: Relaciona una manifestación con una persona que está asociada a una manifestación. @es
toolkit label: persona relacionada de manifestación @es
toolkit definition: Una persona que está asociada a una manifestación. @es
has subproperty: has contributor person to aggregate
has subproperty: has creator person of manifestation
has subproperty: has distributor person
has subproperty: has papermaker person
has subproperty: P30268

has related corporate body of manifestation
status: Published
sub property of: has related collective agent of manifestation
type: Property
lexical alias: relatedCorporateBodyOfManifestation.en
definition: Relates a manifestation to a corporate body who is associated with a manifestation.
domain: C10007
label: có tập thể có liên quan (biểu thị) @vi
definition: Liên kết biểu thị với tập thể liên quan tới biểu thị đang được mô tả. @vi
label: har korporation relateret til manifestation @da
definition: Relaterer en manifestation til til en korporation, som er knyttet til en manifestation. @da
label: té com a entitat corporativa relacionada amb una manifestació @ca
definition: Relaciona una manifestació amb una entitat corporativa que s’associa amb una manifestació. @ca
definition: Liittää manifestaation yhteisöön, joka manifestaatioon. @fi
toolkit label: manifestaatioon liittyvä yhteisö @fi
toolkit definition: Yhteisö, joka liittyy manifestaatioon. @fi
label: έχει σχετικό συλλογικό όργανο (εκδήλωση) @el
definition: Συνδέει μια εκδήλωση με ένα συλλογικό όργανο που συνδέεται με μια περιγραφόμενη εκδήλωση. @el
label: a pour collectivité en relation avec une manifestation @fr
definition: Met une manifestation en relation avec une collectivité qui est associée à une manifestation. @fr
toolkit label: related corporate body of manifestation
toolkit definition: A corporate body who is associated with a manifestation.
has element type: 1
sub property of: P00009
label: megjelenési formához kapcsolódó testület a következő: @hu
definition: Hozzákapcsol egy megjelenési formát egy megjelenési formához kapcsolódó testülethez. @hu
label: manifestaatioon liittyvä yhteisö @fi
label: har korporasjon relatert til manifestasjon @no
definition: Relaterer en manifestasjon til en korporasjon som forbindes med en manifestasjon. @no
toolkit label: korporasjon relatert til manifestasjon @no
toolkit definition: En korporasjon som forbindes med en manifestasjon. @no
toolkit label: collectivité en relation avec une manifestation @fr
toolkit definition: Collectivité qui est associée à une manifestation. @fr
label: heeft gerelateerde corporatie van manifestatie @nl
definition: Relateert een manifestatie aan een corporatie die geassocieerd is met een manifestatie. @nl
toolkit label: gerelateerde corporatie van manifestatie @nl
toolkit definition: Een corporatie die geassocieerd is met een manifestatie. @nl
label: له هيئة مرتبطة بتجسيدة @ar
definition: يربط بين تجسيدة وهيئة ترتبط بتجسيدة. @ar
toolkit label: هيئة مرتبطة بتجسيدة @ar
toolkit definition: هيئة ترتبط بتجسيدة. @ar
toolkit label: entitat corporativa relacionada amb una manifestació @ca
toolkit definition: Entitat corporativa que s’associa amb una manifestació. @ca
toolkit label: korporation relateret til manifestation @da
toolkit definition: Korporation, som er knyttet til en manifestation. @da
label: kehastusega seotud asutus @et
definition: Seostab kehastuse kehastusega seotud asutusega. @et
toolkit label: kehastusega seotud asutus @et
toolkit definition: Kehastusega seotud asutus. @et
label: hat mit Manifestation in Beziehung stehende Körperschaft @de
definition: Setzt eine Manifestation in Beziehung zu einer Körperschaft, die mit einer Manifestation in Verbindung steht. @de
toolkit label: mit Manifestation in Beziehung stehende Körperschaft @de
toolkit definition: Eine Körperschaft, die mit einer Manifestation in Verbindung steht. @de
toolkit label: megjelenési formához kapcsolódó testület: @hu
toolkit definition: Egy megjelenési formához kapcsolódó testület. @hu
label: ha come ente di manifestazione correlato @it
definition: Correla una manifestazione all'ente associato a una manifestazione. @it
toolkit label: ente di manifestazione correlato @it
toolkit definition: Ente associato a una manifestazione. @it
label: ar manifestāciju saistītā institūcija @lv
definition: Sasaista manifestāciju ar institūciju, kas saistīta ar manifestāciju. @lv
toolkit label: ar manifestāciju saistītā institūcija @lv
toolkit definition: Institūcija, kas saistīta ar manifestāciju. @lv
label: 有载体表现的关联团体 @zh-hans
definition: 将一种载体表现与和一种载体表现有关的一个团体关联起来。 @zh-hans
toolkit label: 载体表现的关联团体 @zh-hans
toolkit definition: 和一种载体表现有关的一个团体 @zh-hans
label: gösterimin ilgili tüzel kişisi ile ilişkilidir @tr
definition: Bir gösterimi, bir gösterimle ilişkili olan bir tüzel kişilikle ilişkilendirir. @tr
toolkit label: Anlatımın tüzel kişiyle ilişkisi @tr
toolkit definition: Bir gösterimle ilişkilendirilen bir tüzel kişi. @tr
label: tiene cuerpo corporativo de manifestación relacionado @es
definition: Relaciona una manifestación con un cuerpo corporativo que está asociado con una manifestación. @es
toolkit label: cuerpo corporativo de manifestación relacionado @es
toolkit definition: Un cuerpo corporativo que está asociado con una manifestación. @es
has subproperty: has contributor corporate body to aggregate
has subproperty: has creator corporate body of manifestation
has subproperty: has distributor corporate body
has subproperty: has papermaker corporate body
has subproperty: P30270

has details of digital representation of cartographic content
status: Published
type: Property
lexical alias: detailsOfDigitalRepresentationOfCartographicContent.en
definition: Relates a manifestation to details of an encoding of geospatial information in a manifestation.
domain: C10007
instruction number: 3.19.8.4
toolkit label: details of digital representation of cartographic content
toolkit definition: Details of an encoding of geospatial information in a manifestation.
toolkit label: detalles de representación digital del contenido cartográfico @es
toolkit definition: Detalles de una codificación de información geoespacial en una manifestación. @es
sub property of: has details of digital file characteristic
label: har detaljerad information om geografisk data relaterad till kodningen av en kartografisk resurs @sv
toolkit label: detaljerad information om geografisk data relaterad till kodningen av en kartografisk resurs @sv
toolkit label: details van digitale representatie van cartografische content @nl
toolkit definition: Details van een codering van geospatiale informatie in een cartografische resource. @nl
label: có chi tiết của biểu diễn số của nội dung bản đồ @vi
definition: Liên kết biểu thị với chi tiết của ghi mã thông tin địa không gian trong biểu hiện. @vi
toolkit label: chi tiết của biểu diễn số của nội dung bản đồ @vi
toolkit definition: Chi tiết của ghi mã thông tin địa không gian trong biểu hiện. @vi
label: har detaljer om digital repræsentation af kartografisk indhold @da
definition: Relaterer en manifestation til detaljer om kodning af geodata i en manifestation. @da
toolkit label: detaljer om digital repræsentation af kartografisk indhold @da
toolkit definition: Detaljer om kodning af geoinformation i en manifestation. @da
label: hat Details zur digitalen Darstellung von kartografischem Inhalt @de
definition: Setzt eine Manifestation in Beziehung zu den Details zur Kodierung von Geoinformationen in einer Manifestation. @de
toolkit label: Details zur digitalen Darstellung von kartografischem Inhalt @de
toolkit definition: Details zur Kodierung von Geoinformationen in einer Manifestation. @de
label: té com a particularitats de representació digital de contingut cartogràfic @ca
definition: Relaciona una manifestació amb les particularitats d’una codificació de la informació geoespacial d’una manifestació. @ca
toolkit label: particularitats de representació digital de contingut cartogràfic @ca
toolkit definition: Particularitats d’una codificació de la informació geoespacial d’una manifestació. @ca
definition: Liittää manifestaation tarkempiin tietoihin manifestaation maantieteellisen paikkatiedon koodaamisesta. @fi
toolkit label: kartografisen sisällön digitaalisen esitysmuodon tarkemmat tiedot @fi
toolkit definition: Tarkemmat tiedot manifestaation maantieteellisen paikkatiedon koodaamisesta. @fi
toolkit label: detaljer vedrørende digital representasjon av kartografisk innhold @no
toolkit definition: Detaljer vedrørende koding av geospatial informasjon i en manifestasjon. @no
label: έχει λεπτομέρειες της ψηφιακής αναπαράστασης του χαρτογραφικού περιεχομένου @el
definition: Συνδέει μια εκδήλωση με τις λεπτομέρειες μιας κωδικοποίησης των γεωχωρικών πληροφοριών σε μια εκδήλωση. @el
toolkit label: λεπτομέρειες της ψηφιακής αναπαράστασης του χαρτογραφικού περιεχομένου @el
toolkit definition: Λεπτομέρειες μιας κωδικοποίησης των γεωχωρικών πληροφοριών σε μια εκδήλωση. @el
label: a pour particularités d’une représentation numérique de contenu cartographique @fr
definition: Met une manifestation en relation avec des particularités d’un encodage de l’information géospatiale dans une manifestation. @fr
toolkit label: particularités d’une représentation numérique de contenu cartographique @fr
toolkit definition: Particularités d’un encodage de l’information géospatiale dans une manifestation. @fr
has element type: 6
label: kartográfiai tartalom digitális ábrázolásának részletei a következők: @hu
definition: Hozzákapcsol egy megjelenési formát egy megjelenési forma térinformatikai információinak kódolásának részleteihez . @hu
toolkit label: kartográfiai tartalom digitális ábrázolásának részletei: @hu
toolkit definition: Egy megjelenési forma térinformatikai információinak kódolásának részletei. @hu
label: kartografisen sisällön digitaalisen esitysmuodon tarkemmat tiedot @fi
label: har detaljer vedrørende digital representasjon av kartografisk innhold @no
definition: Relaterer en manifestasjon til detaljer vedrørende koding av geospatial informasjon i en manifestasjon. @no
label: heeft details van digitale representatie van cartografische content @nl
definition: Relateert een manifestatie aan details van een codering van geospatiale informatie in een cartografische resource. @nl
label: له تفاصيل تمثيل رقمي لمحتوى خرائطي @ar
definition: يربط بين تجسيدة وتفاصيل تكويد للمعلومات الجغرافية المكانية في تجسيدة. @ar
toolkit label: تفاصيل تمثيل رقمي لمحتوى خرائطي @ar
toolkit definition: تفاصيل تكويد للمعلومات الجغرافية المكانية في تجسيدة. @ar
label: kartograafilise sisu digitaalse esitusviisi täpsustus @et
definition: Seostab kehastuse täpsemate andmetega kehastuses sisalduva georuumilise info kodeeringu kohta. @et
toolkit label: kartograafilise sisu digitaalse esitusviisi täpsustus @et
toolkit definition: Täpsemad andmed kehastuses sisalduva georuumilise info kodeeringu kohta. @et
label: ha come particolari relativi alla rappresentazione digitale del contenuto cartografico @it
definition: Correla una manifestazione ai particolari relativi a una codifica delle informazioni geospaziali in una manifestazione. @it
toolkit label: particolari relativi alla rappresentazione digitale del contenuto cartografico @it
toolkit definition: Particolari relativi a una codifica delle informazioni geospaziali in una manifestazione. @it
label: detalizēti par kartogrāfiskā satura digitālu attēlojumu @lv
definition: Sasaista manifestāciju ar sīkāku informāciju par ģeotelpiskās informācijas kodējumu kartogrāfiskajā manifestācijā. @lv
toolkit label: detalizēti par kartogrāfiskā satura digitālu attēlojumu @lv
toolkit definition: Sīkāka informācija par ģeotelpiskās informācijas kodējumu kartogrāfiskajā manifestācijā. @lv
label: 有地图内容的数字表现的细节 @zh-hans
definition: 将一种载体表现与载体表现中地理空间信息的编码细节关联起来。 @zh-hans
toolkit label: 地图内容的数字表现的细节 @zh-hans
toolkit definition: 载体表现中地理空间信息的编码细节 @zh-hans
label: kartografik içeriğin dijital temsilinin ayrıntıları ile ilişkilidir @tr
definition: Bir gösterimi, bir gösterimdeki jeo-uzamsal bilgi kodlamasının ayrıntılarıyla ilişkilendirir. @tr
toolkit label: kartografik içeriğin dijital temsilinin ayrıntıları @tr
toolkit definition: Bir gösterimdeki coğrafi uzamsal bilgilerin kodlanmasının ayrıntıları. @tr
label: tiene detalles de representación digital del contenido cartográfico @es

has later title proper (Deprecated)
status: Deprecated
definition: Relates a manifestation to a title proper appearing on a later issue or part of a multipart monograph or serial that differs from that on the first or earliest issue or part. (Deprecated)
type: Property
domain: C10007
sub property of: has title proper
lexical alias: laterTitleProper.en
instruction number: 2.3.8
toolkit label: later title proper (Deprecated)
toolkit definition: A title proper appearing on a later issue or part of a multipart monograph or serial that differs from that on the first or earliest issue or part. (Deprecated)
label: a pour titre propre ultérieur @fr
definition: Met une manifestation en relation avec un titre propre qui figure sur une livraison ou partie ultérieure d’une monographie en plusieurs parties ou d’une publication en série et qui diffère de celui figurant sur la première ou la plus ancienne livraison ou partie. @fr
toolkit label: titre propre ultérieur @fr
toolkit definition: Titre propre qui figure sur une livraison ou partie ultérieure d’une monographie en plusieurs parties ou d’une publication en série et qui diffère de celui figurant sur la première ou la plus ancienne livraison ou partie. @fr
toolkit label: título propiamente dicho posterior @es
toolkit definition: Un título propiamente dicho que aparece en una entrega o parte posterior de una monografía en varias partes o publicación seriada que difiere del de la primera o anterior entrega o parte. @es
label: har efterföljande huvudtitel @sv
toolkit label: efterföljande huvudtitel @sv
toolkit label: latere hoofdtitel @nl
toolkit definition: Een hoofdtitel die vermeld staat op een latere aflevering of een later deel van een meerdelige of een seriële publicatie, die afwijkt van die op de eerste of vroegste aflevering of het eerste of vroegste deel. @nl
label: có nhan đề hợp thức sau này @vi
definition: Liên kết biểu thị với nhan đề hợp thức xuất hiện trên số hoặc phần sau này của chuyên khảo nhiều phần hoặc ấn phẩm nhiều kỳ khác với trên số hoặc phần đầu tiên hoăc sớm nhất. @vi
toolkit label: nhan đề hợp thức sau này @vi
toolkit definition: Nhan đề hợp thức xuất hiện trên số hoặc phần sau này của chuyên khảo nhiều phần hoặc ấn phẩm nhiều kỳ khác với trên số hoặc phần đầu tiên hoăc sớm nhất. @vi
label: har senere hovedtitel @da
definition: Relaterer en manifestation til en hovedtitel, der optræder på et senere nummer eller en senere del af et flerbindsværk eller et periodikum, og som afviger fra den titel, der fremgår af første eller tidligste nummer eller del.. @da
toolkit label: senere hovedtitel @da
toolkit definition: Hovedtitel, der optræder på et senere nummer eller en senere del af et flerbindsværk eller et periodikum, og som afviger fra den titel, der fremgår af første eller tidligste nummer eller del. @da
label: hat späteren Haupttitel @de
definition: Setzt eine Manifestation mit einem Haupttitel, der in einer späteren Ausgabe oder einem späteren Teil einer mehrbändigen Monografie oder einer fortlaufenden Ressource erscheint, der von dem in der ersten Ausgabe oder dem ersten Teil abweicht, in Beziehung. @de
toolkit label: Späterer Haupttitel @de
toolkit definition: Ein Haupttitel, der in einer späteren Ausgabe oder einem späteren Teil einer mehrbändigen Monografie oder einer fortlaufenden Ressource erscheint, der von dem in der ersten Ausgabe oder dem ersten Teil abweicht. @de
label: té com a títol propi posterior @ca
definition: Relaciona una manifestació amb un títol propi que figura en un número o una part posterior d’una monografia en diverses parts o d’una publicació en sèrie que difereix d’aquell que figura en el primer número o la primera part o en el número més antic o la part més antiga. @ca
toolkit label: títol propi posterior @ca
toolkit definition: Títol propi que figura en un número o una part posterior d’una monografia en diverses parts o d’una publicació en sèrie que difereix d’aquell que figura en el primer número o la primera part o en el número més antic o la part més antiga. @ca
label: myöhempi päänimeke @fi
definition: Liittää manifestaation moniosaisen monografian tai sarja-aineiston myöhemmässä osassa esiintyvään päänimekkeeseen, joka eroaa ensimmäisessä tai aiemmassa osassa esiintyneestä päänimekkeestä. @fi
toolkit label: myöhempi päänimeke @fi
toolkit definition: Moniosaisen monografian tai sarja-aineiston myöhemmässä osassa esiintyvä päänimeke, joka eroaa ensimmäisessä tai aiemmassa osassa esiintyneestä päänimekkeestä. @fi
toolkit label: senere hovedtittel @no
toolkit definition: Hovedtittel som forekommer i et senere hefte eller en senere del av en flerdelsmonografi eller et periodikum, og som avviker fra hovedtittelen til første eller tidligste tilgjengelige hefte eller del. @no
label: έχει μεταγενέστερο κύριο τίτλο @el
definition: Συνδέει μια εκδήλωση με έναν κύριο τίτλο που εμφανίζεται σε ένα μεταγενέστερο τεύχος ή μέρος μιας πολυμερούς μονογραφίας ή περιοδικού ο οποίος διαφέρει από εκείνον [που εμφανίζεται] στο πρώτο ή προηγούμενο τεύχος ή μέρος. @el
toolkit label: μεταγενέστερος κύριος τίτλος @el
toolkit definition: Ένας κύριος τίτλος που εμφανίζεται σε ένα μεταγενέστερο τεύχος ή μέρος μιας πολυμερούς μονογραφίας ή περιοδικού ο οποίος διαφέρει από εκείνον [που εμφανίζεται] στο πρώτο ή προηγούμενο τεύχος ή μέρος. @el
has element type: 3
label: van későbbi valódi címe @hu
definition: Egy megjelenési formát hozzákapcsol egy valódi címhez, amely egy többrészes monográfia vagy folytatódó dokumentum későbbi számán vagy részén jelenik meg, amely különbözik attól, amely az első vagy legkorábbi számon vagy részen található. @hu
toolkit label: későbbi valódi cím @hu
toolkit definition: Egy valódi cím, amely egy többkötetes monográfia vagy periodika későbbi számán vagy részén jelenik meg, amely különbözik az első vagy legkorábbi számon vagy részen megjelenttől. @hu
has subproperty: P30129

has place of production
status: Published
definition: Relates a manifestation to a place that is associated with the inscription, fabrication, construction, or other method of production of an unpublished manifestation.
type: Property
domain: C10007
lexical alias: placeOfProduction.en
instruction number: 2.7.2
toolkit label: place of production
toolkit definition: A place that is associated with the inscription, fabrication, construction, or other method of production of an unpublished manifestation.
label: a pour lieu de production @fr
definition: Met une manifestation en relation avec un lieu qui est associé à la scription, à la fabrication, à la construction ou à toute autre méthode de production d’une manifestation non publiée. @fr
toolkit label: lieu de production @fr
toolkit definition: Lieu qui est associé à la scription, à la fabrication, à la construction ou à toute autre méthode de production d’une manifestation non publiée. @fr
toolkit label: lugar de producción @es
toolkit definition: Un lugar que está asociado con la inscripción, fabricación, construcción u otro método de producción de una manifestación inédita. @es
label: har produktionsort @sv
toolkit label: produktionsort @sv
toolkit label: plaats van productie @nl
toolkit definition: Een plaats die geassocieerd is met het afschrijven, fabriceren, construeren of andere methode van productie van een ongepubliceerde manifestatie. @nl
label: có địa điểm sản xuất @vi
definition: Liên kết biểu thị với địa điểm liên quan tới khắc, kết cấu, cấu trúc, v.v..., biểu thị dưới hình thái không xuất bản. @vi
toolkit label: địa điểm sản xuất @vi
toolkit definition: Địa điểm liên quan tới khắc, kết cấu, cấu trúc, v.v..., biểu thị dưới hình thái không xuất bản. @vi
label: har produktionssted @da
definition: Relaterer en manifestation til et sted forbundet med indskrift, fremstilling, konstruktion etc. af en upubliceret manifestation. @da
toolkit label: produktionssted @da
toolkit definition: Sted forbundet med indskrift, fremstilling, konstruktion etc. af en upubliceret manifestation. @da
label: hat Entstehungsort @de
definition: Setzt eine Manifestation in Beziehung zu einem Geografikum, das mit der Beschriftung, der Fabrikation, der Konstruktion oder einer anderen Entstehungsmethode einer unveröffentlichten Manifestation in Verbindung steht. @de
toolkit label: Entstehungsort @de
toolkit definition: Ein Geografikum, das mit der Beschriftung, der Fabrikation, der Konstruktion oder einer anderen Entstehungsmethode einer unveröffentlichten Manifestation in Verbindung steht. @de
label: té com a lloc de producció @ca
definition: Relaciona una manifestació amb un lloc que s’associa amb la inscripció, la fabricació, la construcció o un altre mètode de producció d’una manifestació no publicada. @ca
toolkit label: lloc de producció @ca
toolkit definition: Lloc que s’associa amb la inscripció, la fabricació, la construcció o un altre mètode de producció d’una manifestació no publicada. @ca
definition: Liittää manifestaation paikkaan, joka liittyy julkaisemattoman manifestaation kaivertamiseen, valmistamiseen, kokoamiseen tai muuhun tuotantotapaan. @fi
toolkit label: tuotantopaikka @fi
toolkit definition: Paikka, joka liittyy julkaisemattoman manifestaation kaivertamiseen, valmistamiseen, kokoamiseen tai muuhun tuotantotapaan. @fi
toolkit label: produksjonssted @no
toolkit definition: Et sted som forbindes med inskripsjon, fabrikasjon, konstruksjon, etc. av en upublisert manifestasjon. @no
label: έχει τόπο παραγωγής @el
definition: Συνδέει μια εκδήλωση με έναν τόπο που συνδέεται με την εγγραφή, την κατασκευή, τη δόμηση κ.λπ. μιας εκδήλωσης σε μια μη δημοσιευμένη μορφή. @el
toolkit label: τόπος παραγωγής @el
toolkit definition: Ένας τόπος που συνδέεται με την εγγραφή, την κατασκευή, τη δόμηση κ.λπ. μιας εκδήλωσης σε μια μη δημοσιευμένη μορφή. @el
sub property of: has place of manifestation
has element type: 3
label: előállítás helye a következő: @hu
definition: Hozzákapcsol egy megjelenési formát egy helyhez, amely egy kiadatlan megjelenési forma írásához, összeállításához, készítéséhez vagy más módú előállításához kapcsolódik. @hu
toolkit label: előállítás helye: @hu
toolkit definition: Egy hely, amely egy kiadatlan megjelenési forma írásához, összeállításához, készítéséhez vagy más módú előállításához kapcsolódik. @hu
label: tuotantopaikka @fi
label: har produksjonssted @no
definition: Relaterer en manifestasjon til et sted som forbindes med inskripsjon, fabrikasjon, konstruksjon, etc. av en upublisert manifestasjon. @no
label: heeft plaats van productie @nl
definition: Relateert een manifestatie aan een plaats die geassocieerd is met het afschrijven, fabriceren, construeren of andere methode van productie van een ongepubliceerde manifestatie. @nl
label: له مكان إنتاج @ar
definition: يربط بين تجسيدة ومكان مرتبط بتسجيل، أو صناعة، أو إنشاء، إلخ. تجسيدة غير منشورة @ar
toolkit label: مكان إنتاج @ar
toolkit definition: مكان مرتبط بتسجيل، أو صناعة، أو إنشاء، إلخ. تجسيدة غير منشورة @ar
label: tootmiskoht @et
definition: Seostab kehastuse kohaga, mis on seotud avaldamata kehastuse inskribeerimisega, tootmisega, ehitamisega vms. @et
toolkit label: tootmiskoht @et
toolkit definition: Koht, mis on seotud avaldamata kehastuse inskribeerimisega, tootmisega, ehitamisega vms. @et
label: ha come luogo di produzione @it
definition: Correla una manifestazione a un luogo associato all'iscrizione, fabbricazione, costruzione, etc., di una manifestazione non pubblicata. @it
toolkit label: luogo di produzione @it
toolkit definition: Luogo associato all'iscrizione, fabbricazione, costruzione, etc., di una manifestazione non pubblicata. @it
label: izgatavošanas vieta @lv
definition: Sasaista manifestāciju ar vietu, kas saistīta ar nepublicētās manifestācijas uzrakstīšanu, izgatavošanu, radīšanu u.tml. @lv
toolkit label: izgatavošanas vieta @lv
toolkit definition: Vieta, kas saistīta ar nepublicētās manifestācijas uzrakstīšanu, izgatavošanu, radīšanu u.tml. @lv
label: 有制作地 @zh-hans
definition: 将一种载体表现与和一个非出版资源的镌刻、制造、构建或其他制作方法有关的一个地点关联起来。 @zh-hans
toolkit label: 制作地 @zh-hans
toolkit definition: 和一个非出版资源的镌刻、制造、构建或其他制作方法有关的一个地点 @zh-hans
label: yapım yeri ile ilişkilidir @tr
definition: Bir gösterimi, yayınlanmamış bir gösterimin yazıtı, imalatı, inşaatı veya başka bir üretim yöntemiyle ilişkili bir yerle ilişkilendirir. @tr
toolkit label: üretim yeri @tr
toolkit definition: Yayınlanmamış bir gösterimin yazısı, fabrikasyonu, yapımı veya diğer üretim yöntemleriyle bağlantılı olan bir yer. @tr
label: tiene lugar de producción @es

has date of production
status: Published
definition: Relates a manifestation to a timespan during which an unpublished manifestation is inscribed, fabricated, constructed, or otherwise produced.
type: Property
domain: C10007
lexical alias: dateOfProduction.en
instruction number: 2.7.6
toolkit label: date of production
toolkit definition: A timespan during which an unpublished manifestation is inscribed, fabricated, constructed, or otherwise produced.
label: a pour date de production @fr
definition: Met une manifestation en relation avec un laps de temps pendant lequel une manifestation non publiée est écrite à la main, fabriquée, construite ou produite d’une autre manière. @fr
toolkit label: date de production @fr
toolkit definition: Laps de temps pendant lequel une manifestation non publiée est écrite à la main, fabriquée, construite ou produite d’une autre manière. @fr
toolkit label: fecha de producción @es
toolkit definition: Un espacio de tiempo durante el cual una manifestación inédita es inscrita, fabricada, construida o de otra manera producida. @es
label: har produktionstid @sv
toolkit label: produktionstid @sv
toolkit label: datum van productie @nl
toolkit definition: Een tijdspanne gedurende waarvan een ongepubliceerde manifestatie is afgeschreven, gefabriceerd, geconstrueerd of anderszins geproduceerd. @nl
label: có ngày sản xuất @vi
definition: Liên kết biểu thị với ngày liên quan tới khắc, kết cấu, cấu trúc, v.v..., của biểu thị dưới hình thái không xuất bản. @vi
toolkit label: ngày sản xuất @vi
toolkit definition: Ngày liên quan tới khắc, kết cấu, cấu trúc, v.v..., của biểu thị dưới hình thái không xuất bản. @vi
label: har dato for produktion @da
definition: Relaterer en manifestation til en tidsperiode knyttet til indskrift, fremstilling, konstruktion etc. af en upubliceret manifestation. @da
toolkit label: dato for produktion @da
toolkit definition: Tidsperiode knyttet til indskrift, fremstilling, konstruktion etc. af en upubliceret manifestation. @da
label: ist Entstehungsdatum @de
definition: Setzt eine Manifestation in Beziehung zu einem Zeitraum, in dem eine unveröffentlichte Manifestation beschriftet, erschaffen, konstruiert oder anderweitig produziert wird. @de
toolkit label: Entstehungsdatum @de
toolkit definition: Ein Zeitraum, in dem eine unveröffentlichte Manifestation beschriftet, erschaffen, konstruiert oder anderweitig produziert wird. @de
label: té com a data de producció @ca
definition: Relaciona una manifestació amb un interval de temps durant el qual una manifestació no publicada s’inscriu, es fabrica, s’elabora o es produeix d’una altra manera. @ca
toolkit label: data de producció @ca
toolkit definition: Interval de temps durant el qual una manifestació no publicada s’inscriu, es fabrica, s’elabora o es produeix d’una altra manera. @ca
definition: Liittää manifestaation julkaisemattoman manifestaation kaivertamiseen, valmistamiseen, kokoamiseen tai muuhan tuottamiseen liittyvään ajanjaksoon. @fi
toolkit label: tuotantoaika @fi
toolkit definition: Julkaisemattoman manifestaation kaivertamiseen, valmistamiseen, kokoamiseen tai muuhun tuottamiseen liittyvä ajanjakso. @fi
toolkit label: tidsrom for produksjon @no
toolkit definition: Et tidsrom som forbindes med inskripsjon, fabrikasjon, konstruksjon, etc. av en upublisert manifestasjon. @no
label: έχει χρονολογία της παραγωγής @el
definition: Συνδέει μια εκδήλωση με μια χρονολογία που συνδέεται με την επιγραφή, την κατασκευή, τη δόμηση κ.λπ. μιας εκδήλωσης σε μια μη δημοσιευμένη μορφή. @el
toolkit label: χρονολογία της παραγωγής @el
toolkit definition: Μια χρονολογία που συνδέεται με την εγγραφή, την κατασκευή, τη δόμηση κ.λπ. μιας εκδήλωσης σε μια μη δημοσιευμένη μορφή. @el
sub property of: has date of manifestation
has element type: 3
label: létrehozás időpontja a következő: @hu
definition: Hozzákapcsol egy megjelenési formát egy időtartamhoz, amely alatt egy nem kiadatlan megjelenési formát írnak, készítenek, szerkesztenek vagy egyéb módon előállítanak. @hu
toolkit label: létrehozás időpontja: @hu
toolkit definition: Egy időtartam, amely alatt egy nem kiadatlan megjelenési formát írnak, készítenek, szerkesztenek vagy egyéb módon előállítanak. @hu
label: tuotantoaika @fi
label: har tidsrom for produksjon @no
definition: Relaterer en manifestasjon til et tidsrom som forbindes med inskripsjon, fabrikasjon, konstruksjon, etc. av en upublisert manifestasjon. @no
label: heeft datum van productie @nl
definition: Relateert een manifestatie aan een tijdspanne gedurende waarvan een ongepubliceerde manifestatie is afgeschreven, gefabriceerd, geconstrueerd of anderszins geproduceerd. @nl
label: له تاريخ إنتاج @ar
definition: يربط بين تجسيدة وفترة زمنية مرتبطة بالتوقيع، أو التصنيع، أو الإنشاء، إلخ. لتجسيدة غير منشورة. @ar
toolkit label: تاريخ إنتاج @ar
toolkit definition: فترة زمنية مرتبطة بالتوقيع، أو التصنيع، أو الإنشاء، إلخ. لتجسيدة غير منشورة. @ar
label: tootmisaeg @et
definition: Seostab kehastuse ajavahemikuga, mis on seotud avaldamata kehastuse inskribeerimisega, tootmisega, ehitamisega vms. @et
toolkit label: tootmisaeg @et
toolkit definition: Ajavahemik, mis on seotud avaldamata kehastuse inskribeerimisega, tootmisega, ehitamisega vms. @et
label: ha come data di produzione @it
definition: Correla una manifestazione a un arco di tempo associato all'iscrizione, fabbricazione, costruzione, etc. di una manifestazione non pubblicata. @it
toolkit label: data di produzione @it
toolkit definition: Arco di tempo associato all'iscrizione, fabbricazione, costruzione, etc. di una manifestazione non pubblicata. @it
label: izgatavošanas datējums @lv
definition: Sasaista manifestāciju ar laikposmu, kas ir saistīts ar nepublicētas manifestācijas uzrakstīšanu, izgatavošanu u.tml. @lv
toolkit label: izgatavošanas datējums @lv
toolkit definition: Laikposms, kas ir saistīts ar nepublicētas manifestācijas uzrakstīšanu, izgatavošanu u.tml. @lv
label: 有制作日期 @zh-hans
definition: 将一种载体表现与非出版载体表现的镌刻、制造、构建或其他制作方式的时间段关联起来。 @zh-hans
toolkit label: 制作日期 @zh-hans
toolkit definition: 非出版载体表现的镌刻、制造、构建或其他制作方式的时间段 @zh-hans
label: üretim tarihi ile ilişkilidir @tr
definition: Bir gösterimi, yayınlanmamış bir gösterimin kaydedildiği, üretildiği, inşa edildiği veya başka bir şekilde üretildiği bir zaman aralığıyla ilişkilendirir. @tr
toolkit label: imalat tarihi @tr
toolkit definition: Yayınlanmamış bir gösterimin yazıldığı, üretildiği, yapıldığı veya başka bir şekilde oluşturulduğu bir zaman aralığı. @tr
label: tiene fecha de producción @es

has place of publication
status: Published
definition: Relates a manifestation to a place that is associated with the publication, release, or issuing of a published manifestation.
type: Property
domain: C10007
lexical alias: placeOfPublication.en
instruction number: 2.8.2
toolkit label: place of publication
toolkit definition: A place that is associated with the publication, release, or issuing of a published manifestation.
label: a pour lieu de publication @fr
definition: Met une manifestation en relation avec un lieu qui est associé à la publication, à la mise à disposition ou à l’édition d’une manifestation publiée. @fr
toolkit label: lieu de publication @fr
toolkit definition: Lieu qui est associé à la publication, à la mise à disposition ou à l’édition d’une manifestation publiée. @fr
toolkit label: lugar de publicación @es
toolkit definition: Un lugar asociado con la publicación, lanzamiento o emisión de una manifestación publicada. @es
label: har utgivningsort @sv
toolkit label: utgivningsort @sv
toolkit label: plaats van publicatie @nl
toolkit definition: Een plaats die geassocieerd is met het uitgeven, uitbrengen of uitvaardigen van een gepubliceerde manifestatie. @nl
label: có địa điểm xuất bản @vi
definition: Liên kết biểu thị với địa điểm liên quan tới xuất bản, đăng tải, hoặc công bố biểu thị. @vi
toolkit label: địa điểm xuất bản @vi
toolkit definition: Địa điểm liên quan tới xuất bản, đăng tải, hoặc công bố biểu thị. @vi
label: har publiceringssted @da
definition: Relaterer en manifestation til et sted forbundet med publicering, frigivelse eller udgivelse af en publiceret manifestation. @da
toolkit label: publiceringssted @da
toolkit definition: Sted forbundet med publicering, frigivelse eller udgivelse af en publiceret manifestation. @da
label: hat Erscheinungsort @de
definition: Setzt eine Manifestation in Beziehung zu einem Geografikum, das mit der Veröffentlichung, dem Release oder der Herausgabe einer veröffentlichten Manifestation in Verbindung steht. @de
toolkit label: Erscheinungsort @de
toolkit definition: Ein Geografikum, das mit der Veröffentlichung, dem Release oder der Herausgabe einer veröffentlichten Manifestation in Verbindung steht. @de
label: té com a lloc de publicació @ca
definition: Relaciona una manifestació amb un lloc que s’associa amb la publicació, la posada en circulació o l’emissió d’una manifestació publicada. @ca
toolkit label: lloc de publicació @ca
toolkit definition: Lloc que s’associa amb la publicació, la posada en circulació o l’emissió d’una manifestació publicada. @ca
definition: Liittää manifestaation paikkaan, joka liittyy julkaistun manifestaation kustantamiseen, julkaisemiseen tai ilmestymiseen. @fi
toolkit label: kustannuspaikka @fi
toolkit definition: Paikka, joka liittyy julkaistun manifestaation kustantamiseen, julkaisemiseen tai ilmestymiseen. @fi
toolkit label: utgivelsessted @no
toolkit definition: Et sted som forbindes med publisering, tilgjengeliggjøring eller utgivelse av en publisert manifestasjon. @no
label: έχει τόπο δημοσίευσης @el
definition: Συνδέει μια εκδήλωση με έναν τόπο που συνδέεται με τη δημοσίευση, την κυκλοφορία ή την έκδοση μιας εκδήλωσης. @el
toolkit label: τόπος δημοσίευσης @el
toolkit definition: Ένας τόπος που συνδέεται με τη δημοσίευση, την κυκλοφορία ή την έκδοση μιας εκδήλωσης. @el
sub property of: has place of manifestation
has element type: 3
label: kiadás helye a következő: @hu
definition: Hozzákapcsol egy megjelenési formát egy helyhez, amely egy megjelenési forma kiadásához, kibocsájtásához vagy megjelentetéséhez kapcsolódik. @hu
toolkit label: kiadás helye: @hu
toolkit definition: Egy hely, amely egy megjelenési forma kiadásához, kibocsájtásához vagy megjelentetéséhez kapcsolódik. @hu
label: kustannuspaikka @fi
label: har utgivelsessted @no
definition: Relaterer en manifestasjon til et sted som forbindes med publisering, tilgjengeliggjøring eller utgivelse av en publisert manifestasjon. @no
label: heeft plaats van publicatie @nl
definition: Relateert een manifestatie aan een plaats die geassocieerd is met het uitgeven, uitbrengen of uitvaardigen van een gepubliceerde manifestatie. @nl
label: له مكان نشر @ar
definition: يربط بين تجسيدة ومكان مرتبط بالنشر، أو الإطلاق الخاص بتجسيدة منشورة. @ar
toolkit label: مكان نشر @ar
toolkit definition: مكان مرتبط بالنشر، أو الإطلاق الخاص بتجسيدة منشورة. @ar
label: ilmumiskoht @et
definition: Seostab kehastuse kohaga, mis on seotud avaldatud kehastuse avaldamise, väljalaskmise või väljaandmisega. @et
toolkit label: ilmumiskoht @et
toolkit definition: Koht, mis on seotud avaldatud kehastuse avaldamise, väljalaskmise või väljaandmisega. @et
label: ha come luogo di pubblicazione @it
definition: Correla una manifestazione a un luogo associato alla pubblicazione, diffusione o emissione di una manifestazione. @it
toolkit label: luogo di pubblicazione @it
toolkit definition: Luogo associato alla pubblicazione, diffusione o emissione di una manifestazione. @it
label: izdošanas vieta @lv
definition: Sasaista manifestāciju ar vietu, kas saistīta ar publicētas manifestācijas publicēšanu, izlaišanu vai izdošanu. @lv
toolkit label: izdošanas vieta @lv
toolkit definition: Vieta, kas saistīta ar publicētas manifestācijas publicēšanu, izlaišanu vai izdošanu. @lv
label: 有出版地 @zh-hans
definition: 将一种载体表现与和一种出版载体表现的出版、发布或发行有关的一个地点关联起来。 @zh-hans
toolkit label: 出版地 @zh-hans
toolkit definition: 和一种出版载体表现的出版、发布或发行有关的一个地点 @zh-hans
label: yayın yeri ile ilişkilidir @tr
definition: Bir gösterimi, yayınlanmış bir gösterimin yayınlanması veya yayınlanmasıyla ilişkili bir yerle ilişkilendirir. @tr
toolkit label: yayın yeri @tr
toolkit definition: Yayınlanmış bir gösterimin yayımı, piyasaya sürülmesi, veya piyasaya çıkarılması ile bağlantılı olan bir yer. @tr
label: tiene lugar de publicación @es

has date of publication
status: Published
definition: Relates a manifestation to a timespan during which a published manifestation is published, released, or issued.
type: Property
domain: C10007
lexical alias: dateOfPublication.en
instruction number: 2.8.6
toolkit label: date of publication
toolkit definition: A timespan during which a published manifestation is published, released, or issued.
label: a pour date de publication @fr
definition: Met une manifestation en relation avec un laps de temps pendant lequel une manifestation publiée est publiée, mise à disposition ou éditée. @fr
toolkit label: date de publication @fr
toolkit definition: Laps de temps pendant lequel une manifestation publiée est publiée, mise à disposition ou éditée. @fr
toolkit label: fecha de publicación @es
toolkit definition: Un espacio de tiempo durante el cual una manifestación publicada es publicada, lanzada o expedida. @es
label: har utgivningstid @sv
toolkit label: utgivningstid @sv
toolkit label: datum van publicatie @nl
toolkit definition: Een tijdspanne gedurende waarvan een gepubliceerde manifestatie is uitgegeven, uitgebracht of uitgevaardigd. @nl
label: có ngày xuất bản @vi
definition: Liên kết biểu thị với ngày liên quan tới xuất bản, đăng tải, công bố của biểu thị. @vi
toolkit label: ngày xuất bản @vi
toolkit definition: Ngày liên quan tới xuất bản, đăng tải, công bố của biểu thị. @vi
label: har dato for udgivelse @da
definition: Relaterer en manifestation til en tidsperiode, hvorunder en publiceret manifestation er publiceret, frigivet eller udgivet. @da
toolkit label: dato for udgivelse @da
toolkit definition: Tidsperiode, hvorunder en publiceret manifestation er publiceret, frigivet eller udgivet. @da
label: hat Erscheinungsdatum @de
definition: Setzt eine Manifestation in Beziehung zu einem Zeitraum, in dem eine veröffentlichte Manifestation veröffentlicht, freigeschaltet oder herausgegeben wird. @de
toolkit label: Erscheinungsdatum @de
toolkit definition: Ein Zeitraum, in dem eine veröffentlichte Manifestation veröffentlicht, freigeschaltet oder herausgegeben wird. @de
label: té com a data de publicació @ca
definition: Relaciona una manifestació amb un interval de temps durant el qual una manifestació publicada es publica, es posa en circulació o s’emet. @ca
toolkit label: data de publicació @ca
toolkit definition: Interval de temps durant el qual una manifestació publicada es publica, es posa en circulació o s’emet. @ca
definition: Liittää manifestaation manifestaation kustantamiseen, julkaisemiseen tai ilmestymiseen liittyvään ajanjaksoon. @fi
toolkit label: julkaisuaika @fi
toolkit definition: Manifestaation kustantamiseen, julkaisemiseen tai ilmestymiseen liittyvä ajanajakso. @fi
toolkit label: tidsrom for utgivelse @no
toolkit definition: Et tidsrom hvor en publisert manifestasjon blir publisert, tilgjengeliggjort eller utgitt. @no
label: έχει χρονολογία της δημοσίευσης @el
definition: Συνδέει μια εκδήλωση με μια χρονολογία που συνδέεται με τη δημοσίευση, την κυκλοφορία ή την έκδοση μιας εκδήλωσης. @el
toolkit label: χρονολογία της δημοσίευσης @el
toolkit definition: Μια χρονολογία που συνδέεται με τη δημοσίευση, την κυκλοφορία ή την έκδοση μιας εκδήλωσης. @el
sub property of: has date of manifestation
has element type: 3
label: kiadás időpontja a következő: @hu
definition: Hozzákapcsol egy megjelenési formát egy időtartamhoz, amely alatt egy kiadott megjelenési formát kiadnak, kibocsájtanak vagy megjelentetnek. @hu
toolkit label: kiadás időpontja: @hu
toolkit definition: Egy időtartam, mely alatt egy kiadott megjelenési formát kiadnak, kibocsájtanak vagy megjelentetnek. @hu
label: julkaisuaika @fi
label: har tidsrom for utgivelse @no
definition: Relaterer en manifestasjon til et tidsrom hvor en publisert manifestasjon blir publisert, tilgjengeliggjort eller utgitt. @no
label: heeft datum van publicatie @nl
definition: Relateert een manifestatie aan een tijdspanne gedurende waarvan een gepubliceerde manifestatie is uitgegeven, uitgebracht of uitgevaardigd. @nl
label: له تاريخ نشر @ar
definition: يربط بين تجسيدة وفترة زمنية التي خلالها نشرت، أو أطلقت، أو بثت تجسيدة منشورة. @ar
toolkit label: تاريخ نشر @ar
toolkit definition: فترة زمنية التي خلالها نشرت، أو أطلقت، أو بثت تجسيدة منشورة. @ar
label: ilmumisaasta @et
definition: Seostab kehastuse ajavahemikuga, mille jooksul avaldatud kehastus on avaldatud, välja lastud või välja antud. @et
toolkit label: ilmumisaasta @et
toolkit definition: Ajavahemik, mille jooksul avaldatud kehastus on avaldatud, välja lastud või välja antud. @et
label: ha come data di pubblicazione @it
definition: Correla una manifestazione a un arco di tempo nel quale è pubblicata, diffusa o emessa una manifestazione. @it
toolkit label: data di pubblicazione @it
toolkit definition: Arco di tempo nel quale è pubblicata, diffusa o emessa una manifestazione. @it
label: izdošanas datējums @lv
definition: Sasaista manifestāciju ar laikposmu saistīts ar publicētās manifestācijas publicēšanu, izlaišanu vai izdošanu. @lv
toolkit label: izdošanas datējums @lv
toolkit definition: Laikposms saistīts ar publicētās manifestācijas publicēšanu, izlaišanu vai izdošanu. @lv
label: 有出版日期 @zh-hans
definition: 将一种载体表现与出版载体表现的出版、发布或发行的时间段关联起来。 @zh-hans
toolkit label: 出版日期 @zh-hans
toolkit definition: 出版载体表现的出版、发布或发行的时间段 @zh-hans
label: yayın tarihi ile ilişkilidir @tr
definition: Bir gösterimi, yayınlanan bir gösterimin yayınlandığı, piyasaya sürüldüğü veya ihraç edildiği bir zaman aralığıyla ilişkilendirir. @tr
toolkit label: yayınlanma tarihi @tr
toolkit definition: Yayınlanmış bir gösterimin yayınlandığı, piyasaya sürüldüğü veya piyasaya çıkarıldığı bir zaman aralığı. @tr
label: tiene fecha de publicación @es

has publication statement
status: Published
definition: Relates a manifestation to a statement that identifies a place of publication, a publisher, or a date of publication of a published manifestation.
type: Property
domain: C10007
lexical alias: publicationStatement.en
scope note: A publication statement includes a statement about the publication, release, or issuing of a published manifestation.
instruction number: 2.8
toolkit label: publication statement
toolkit definition: A statement that identifies a place of publication, a publisher, or a date of publication of a published manifestation.
label: a pour mention de publication @fr
definition: Met une manifestation en relation avec une mention qui identifie un lieu de publication, un éditeur ou une date de publication d’une manifestation publiée. @fr
scope note: Une mention de publication comprend une mention relative à la publication, à la mise à disposition ou à l’édition d’une manifestation publiée. @fr
toolkit label: mention de publication @fr
toolkit definition: Mention qui identifie un lieu de publication, un éditeur ou une date de publication d’une manifestation publiée. @fr
toolkit label: declaración de publicación @es
toolkit definition: Una declaración que identifica un lugar de publicación, una editorial o una fecha de publicación de una manifestación publicada. @es
label: har utgivningsuppgift @sv
toolkit label: utgivningsuppgift @sv
toolkit label: publicatievermelding @nl
toolkit definition: Een vermelding die een plaats van publicatie, een uitgever of datum van publicatie identificeert van een gepubliceerde manifestatie. @nl
label: có thông tin xuất bản @vi
definition: Liên kết biểu thị với thông tin nhận dạng địa điểm hoặc các địa điểm xuất bản, nhà xuất bản hoặc các nhà xuất bản, và ngày hoặc các ngày xuất bản của biểu thị. @vi
scope note: Thông tin xuất bản bao gồm thông tin liên quan tới xuất bản, đăng tải, công bố, v.v..., của biểu thị. @vi
toolkit label: thông tin xuất bản @vi
toolkit definition: Thông tin nhận dạng địa điểm hoặc các địa điểm xuất bản, nhà xuất bản hoặc các nhà xuất bản, và ngày hoặc các ngày xuất bản của biểu thị. @vi
scope note: Een publicatievermelding omvat een vermelding over het uitgeven, uitbrengen of uitvaardigen van een gepubliceerde manifestatie. @nl
label: har publiceringsoplysning @da
definition: Relaterer en manifestation til en oplysning, som identificerer publiceringssted- eller steder, udgiver eller udgivere og udgivelsesdato- eller datoer af en manifestation. @da
scope note: Publiceringsoplysning omfatter oplysninger, som relaterer til publicering, frigivelse eller udgivelse af en manifestation. @da
toolkit label: publiceringsoplysning @da
toolkit definition: Oplysning, som identificerer publiceringssted- eller steder, udgiver eller udgivere og udgivelsesdato- eller datoer af en manifestation. @da
label: hat Veröffentlichungsangabe @de
definition: Setzt eine Manifestation in Beziehung zu einer Angabe, die einen Erscheinungsort, einen Verlag oder ein Erscheinungsdatum einer veröffentlichten Manifestation identifiziert. @de
scope note: Darunter fallen Angaben über die Veröffentlichung, das Release oder die Herausgabe einer veröffentlichten Manifestation. @de
toolkit label: Veröffentlichungsangabe @de
toolkit definition: Eine Angabe, die einen Erscheinungsort, einen Verlag oder ein Erscheinungsdatum einer veröffentlichten Manifestation identifiziert. @de
label: té com a menció de publicació @ca
definition: Relaciona una manifestació amb una menció que identifica un lloc de publicació, un editor o una data de publicació d’una manifestació publicada. @ca
scope note: Una menció de publicació inclou una menció sobre la publicació, la posada en circulació o l’emissió d’una manifestació publicada. @ca
toolkit label: menció de publicació @ca
toolkit definition: Menció que identifica un lloc de publicació, un editor o una data de publicació d’una manifestació publicada. @ca
definition: Liittää manifestaation merkintöön, joka identifioi manifestaation kustannuspaikan, kustantajan tai julkaisuajan. @fi
toolkit label: julkaisumerkintö @fi
toolkit definition: Merkintö, joka identifioi manifestaation kustannuspaikan, kustantajan tai julkaisuajan. @fi
toolkit label: opplysninger om utgivelse @no
toolkit definition: En angivelse som identifiserer et sted eller steder for utgivelse, utgive eller utgivere og dato eller datoer for utgivelse av en manifestasjon. @no
label: έχει μνεία δημοσίευσης @el
definition: Συνδέει μια εκδήλωση με μια μνεία που ταυτίζει έναν τόπο ή τόπους δημοσίευσης, έναν εκδότη ή εκδότες και μια χρονολογία ή χρονολογίες δημοσίευσης μιας εκδήλωσης. @el
scope note: Οι μνείες δημοσίευσης περιλαμβάνουν μνείες σχετικές με τη δημοσίευση, την κυκλοφορία ή την έκδοση μιας εκδήλωσης. @el
toolkit label: μνεία δημοσίευσης @el
toolkit definition: Μια μνεία που ταυτίζει έναν τόπο ή τόπους δημοσίευσης, έναν εκδότη ή εκδότες και μια χρονολογία ή χρονολογίες δημοσίευσης μιας εκδήλωσης. @el
has element type: 6
label: kiadási közlése a következő: @hu
definition: Hozzákapcsol egy megjelenési formát egy közléshez, amely azonosítja egy kiadott megjelenési forma kiadásának helyét, kiadóját és a kiadás időpontját. @hu
scope note: kiadási közlése: @hu
toolkit label: Egy közlés, amely azonosítja egy kiadott megjelenési forma kiadásának helyét, kiadóját és a kiadás időpontját. @hu
toolkit definition: A kiadási közlések olyan közléseket is magukba foglalnak, amelyek egy megjelenési forma kiadására, kibocsájtására vagy megjelentetésére vonatkoznak. @hu
scope note: Julkaisumerkintö sisältää manifestaation kustantamiseen, julkaisemiseen tai ilmestymiseen liittyvään merkintöön. @fi
label: julkaisumerkintö @fi
label: har opplysninger om utgivelse @no
definition: Relaterer en manifestasjon til en angivelse som identifiserer et sted eller steder for utgivelse, utgive eller utgivere og dato eller datoer for utgivelse av en manifestasjon. @no
scope note: Opplysninger om utgivelse inkluderer angivelse knyttet til publisering, tilgjengeliggjøring eller utgivelse av en manifestasjon. @no
label: heeft publicatievermelding @nl
definition: Relateert een manifestatie aan een vermelding die een plaats van publicatie, een uitgever of datum van publicatie identificeert van een gepubliceerde manifestatie. @nl
label: له بيان نشر @ar
definition: يربط بين تجسيدة وبيان يحدد مكان أو أماكن نشر، وناشر أو ناشرون، وتاريخ أو تواريخ نشر خاص بتجسيدة. @ar
scope note: يشمل بيان النشر البيانات المرتبطة بالنشر والإصدار للتجسيدة. @ar
toolkit label: بيان نشر @ar
toolkit definition: بيان يحدد مكان أو أماكن نشر، وناشر أو ناشرون، وتاريخ أو تواريخ نشر خاص بتجسيدة. @ar
label: ilmumisandmed @et
definition: Seostab kehastuse andmetega, mis identifitseerivad kehastuse ilmumiskoha(d), kirjastaja(d) ja ilmumisaasta(d). @et
scope note: Ilmumisandmed hõlmavad andmeid, mis on seotud kehastuse avaldamise, väljalaskmise või väljaandmisega. @et
toolkit label: ilmumisandmed @et
toolkit definition: Andmed, mis identifitseerivad kehastuse ilmumiskoha(d), kirjastaja(d) ja ilmumisaasta(d). @et
label: ha come formulazione di pubblicazione @it
definition: Correla una manifestazione a una formulazione che identifica il luogo o i luoghi di pubblicazione, l'editore o gli editori e la data o le date di pubblicazione di una manifestazione. @it
scope note: Le formulazioni di pubblicazione comprendono formulazioni relative alla pubblicazione, diffusione o emissione di una manifestazione. @it
toolkit label: formulazione di pubblicazione @it
toolkit definition: Formulazione che identifica il luogo o i luoghi di pubblicazione, l'editore o gli editori e la data o le date di pubblicazione di una manifestazione. @it

has designation of edition
status: Published
definition: Relates a manifestation to a word, character, or group of words or characters, that identifies an edition to which a manifestation belongs.
type: Property
domain: C10007
lexical alias: designationOfEdition.en
instruction number: 2.5.2
toolkit label: designation of edition
toolkit definition: A word, character, or group of words or characters, that identifies an edition to which a manifestation belongs.
label: a pour désignation d’édition @fr
definition: Met une manifestation en relation avec un mot, un caractère ou un groupe de mots ou de caractères qui identifie une édition à laquelle appartient une manifestation. @fr
toolkit label: désignation d’édition @fr
toolkit definition: Mot, caractère ou groupe de mots ou de caractères qui identifie une édition à laquelle appartient une manifestation. @fr
toolkit label: designación de edición @es
toolkit definition: Una palabra, carácter o grupo de palabras o caracteres, que identifica una edición a la que pertenece una manifestación. @es
label: har upplagebeteckning @sv
toolkit label: upplagebeteckning @sv
toolkit label: aanduiding van editie @nl
toolkit definition: Een woord, karakter, of groep van woorden en/of karakters die de editie waartoe een resource behoort identificeert. @nl
label: có định danh của ấn bản @vi
definition: Liên kết biểu thị với từ, ký tự, hoặc nhóm từ hoặc ký tự, nhận dạng ấn bản mà biểu thị thuộc vào. @vi
toolkit label: định danh của ấn bản @vi
toolkit definition: Từ, ký tự, hoặc nhóm từ hoặc ký tự, nhận dạng ấn bản mà biểu thị thuộc vào. @vi
label: har udgavebetegnelse @da
definition: Relaterer en manifestation til et ord, tegn eller en gruppe af ord eller tegn, som identificerer en udgave, hvortil en manifestation tilhører. @da
toolkit label: udgavebetegnelse @da
toolkit definition: Ord, tegn eller gruppe af ord eller tegn, som identificerer en udgave, hvortil en manifestation tilhører. @da
label: hat Ausgabebezeichnung @de
definition: Setzt eine Manifestation in Beziehung zu einem Wort, einem Zeichen oder einer Gruppe von Wörtern oder Zeichen, das/die die Ausgabe identifiziert, zu der eine Manifestation gehört. @de
toolkit label: Ausgabebezeichnung @de
toolkit definition: Ein Wort, ein Zeichen oder eine Gruppe von Wörtern oder Zeichen, das/die die Ausgabe identifiziert, zu der eine Manifestation gehört. @de
label: té com a designació d’edició @ca
definition: Relaciona una manifestació amb una paraula, caràcter o grup de paraules o de caràcters que identifica una edició a la qual pertany una manifestació. @ca
toolkit label: designació d’edició @ca
toolkit definition: Paraula, caràcter o grup de paraules o de caràcters que identifica una edició a la qual pertany una manifestació. @ca
definition: Liittää manifestaation sanaan, merkkiin tai ryhmään sanoja ja/tai merkkejä, jotka identifioivat manifestaation painoksen. @fi
toolkit label: painosmäärite @fi
toolkit definition: Sana, merkki tai ryhmä sanoja ja/tai merkkejä, jotka identifioivat manifestaation painoksen. @fi
toolkit label: betegnelse for utgave @no
toolkit definition: Et ord, et tegn eller en gruppe av ord eller tegn som identifiserer hvilken utgave en manifestasjon tilhører. @no
label: έχει προσδιορισμό της έκδοσης @el
definition: Συνδέει μια εκδήλωση με μια λέξη, έναν χαρακτήρα ή μια ομάδα λέξεων ή χαρακτήρων οι οποίοι ταυτίζουν μια έκδοση στην οποία ανήκει η εκδήλωση. @el
toolkit label: προσδιορισμός της έκδοσης @el
toolkit definition: Μια λέξη, ένας χαρακτήρας ή μια ομάδα λέξεων ή χαρακτήρων οι οποίοι ταυτίζουν μια έκδοση στην οποία ανήκει η εκδήλωση. @el
has element type: 6
label: kiadásjelölése a következő: @hu
definition: Hozzákapcsol egy megjelenési formát egy szóhoz, karakterhez, vagy szavak vagy karakterek egy csoportjához, amely azonosít egy kiadást, amelyhez egy megjelenési forma tartozik. @hu
toolkit label: kiadásjelölése: @hu
toolkit definition: Egy szó, karakter, vagy szavak vagy karakterek egy csoportja, amely azonosít egy kiadást, amelyhez egy megjelenési forma tartozik. @hu
label: painosmäärite @fi
label: har betegnelse for utgave @no
definition: Relaterer en manifestasjon til et ord, et tegn eller en gruppe av ord eller tegn som identifiserer hvilken utgave en manifestasjon tilhører. @no
label: heeft aanduiding van editie @nl
definition: Relateert een manifestatie aan een woord, karakter, of groep van woorden en/of karakters die de editie waartoe een resource behoort identificeert. @nl
label: له تسمية لطبعة @ar
definition: يربط بين تجسيدة وكلمة، أو حرف، أو مجموعة من الكلمات، أو تمثيلات، تحدد طبعة تنتمي لها تجسيدة. @ar
toolkit label: تسمية لطبعة @ar
toolkit definition: كلمة، أو حرف، أو مجموعة من الكلمات، أو تمثيلات، تحدد طبعة تنتمي لها تجسيدة. @ar
label: editsiooni tähistus @et
definition: Seostab kehastuse sõna, märgi või sõnade ja/või märkide rühmaga, mis identifitseerib editsiooni, millesse kehastus kuulub. @et
toolkit label: editsiooni tähistus @et
toolkit definition: Sõna, märk või sõnade ja/või märkide rühm, mis identifitseerib editsiooni, millesse kehastus kuulub. @et
label: ha come designazione di edizione @it
definition: Correla una manifestazione a una parola, carattere o serie di parole e/o caratteri che identificano l'edizione a cui appartiene una manifestazione. @it
toolkit label: designazione di edizione @it
toolkit definition: Parola, carattere o serie di parole e/o caratteri che identificano l'edizione a cui appartiene una manifestazione. @it
label: izdevuma apzīmējums @lv
definition: Sasaista manifestāciju ar vārdu, vārdkopu vai rakstzīmju kopu, kas identificē manifestācijas izdevumu. @lv
toolkit label: izdevuma apzīmējums @lv
toolkit definition: Vārds, vārdkopa vai rakstzīmju kopa, kas identificē manifestācijas izdevumu. @lv
label: 有版本标识 @zh-hans
definition: 将一种载体表现与标识一种载体表现所属于的一个版本的词、字符或者词或字符的组合关联起来。 @zh-hans
toolkit label: 版本标识 @zh-hans
toolkit definition: 标识一种载体表现所属于的一个版本的词、字符或者词或字符的组合 @zh-hans
label: basım ile ilişkilidir @tr
definition: Bir gösterimi, bir gösterimin ait olduğu bir baskıyı tanımlayan bir kelime, karakter ya da kelime veya karakter grubuyla ilişkilendirir. @tr
toolkit label: baskı tanımlaması @tr
toolkit definition: Bir gösterimin ait olduğu bir baskıyı tanımlayan bir kelime, karakter ya da kelime veya karakter grubu. @tr
label: tiene designación de edición @es
definition: Relaciona una manifestación con una palabra, carácter o grupo de palabras o caracteres, que identifica una edición a la que pertenece una manifestación. @es

has designation of named revision of edition
status: Published
definition: Relates a manifestation to a word, character, or group of words or characters, that identifies a particular revision of a named edition.
type: Property
domain: C10007
lexical alias: designationOfNamedRevisionOfEdition.en
instruction number: 2.5.6
toolkit label: designation of named revision of edition
toolkit definition: A word, character, or group of words or characters, that identifies a particular revision of a named edition.
label: a pour désignation d’une révision nommée d’une édition @fr
definition: Met une manifestation en relation avec un mot, un caractère ou un groupe de mots ou de caractères qui identifie une révision particulière d’une édition nommée. @fr
toolkit label: désignation d’une révision nommée d’une édition @fr
toolkit definition: Mot, caractère ou groupe de mots ou de caractères qui identifie une révision particulière d’une édition nommée. @fr
toolkit label: designación de revisión nombrada de edición @es
toolkit definition: Una palabra, carácter o grupo de palabras o caracteres, que identifica una revisión particular de una edición nombrada. @es
label: har påföljande upplagebeteckning @sv
toolkit label: påföljande upplagebeteckning @sv
toolkit label: aanduiding van een benoemde herziening van editie @nl
toolkit definition: Een woord, karakter, of groep van woorden en/of karakters die een bepaalde herziening van een benoemde editie identificeert. @nl
label: có định danh của sửa chữa được định rõ của ấn bản @vi
definition: Liên kết biểu thị với từ, ký tự, hoặc nhóm từ hoặc ký tự, nhận dạng sửa chữa riêng biệt của ấn bản được định rõ. @vi
toolkit label: định danh của sửa chữa được định rõ của ấn bản @vi
toolkit definition: Từ, ký tự, hoặc nhóm từ hoặc ký tự, nhận dạng sửa chữa riêng biệt của ấn bản được định rõ. @vi
label: har betegnelse for en navngivet revision af udgave @da
definition: Relaterer en manifestation til et ord, tegn eller en gruppe af ord eller tegn, som identificerer en bestemt revision af en navngivet udgave. @da
toolkit label: betegnelse for en navngivet revision af udgave @da
toolkit definition: Ord, tegn eller gruppe af ord eller tegn, som identificerer en bestemt revision af en navngivet udgave. @da
label: hat Ausgabebezeichnung einer näher erläuterten Überarbeitung @de
definition: Setzt eine Manifestation in Beziehung zu einem Wort, einem Zeichen oder einer Gruppe von Wörtern oder Zeichen, das/die eine bestimmte Überarbeitung einer näher erläuterten Ausgabe identifiziert. @de
toolkit label: Ausgabebezeichnung einer näher erläuterten Überarbeitung @de
toolkit definition: Ein Wort, ein Zeichen oder eine Gruppe von Wörtern oder Zeichen, das/die eine bestimmte Überarbeitung einer näher erläuterten Ausgabe identifiziert. @de
label: té com a designació d’una revisió explícita d’edició @ca
definition: Relaciona una manifestació amb una paraula, caràcter o grup de paraules o de caràcters que identifica una revisió concreta d’una edició explícita. @ca
toolkit label: designació d’una revisió explícita d’edició @ca
toolkit definition: Paraula, caràcter o grup de paraules o de caràcters que identifica una revisió concreta d’una edició explícita. @ca
definition: Liittää manifestaation sanaan, merkkiin tai ryhmään sanoja ja/tai merkkejä, jotka identifioivat nimetyn painoksen uudistettua painosta. @fi
toolkit label: nimetyn uudistetun painoksen määrite @fi
toolkit definition: Sana, merkki tai ryhmä sanoja ja/tai merkkejä, jotka identifioivat nimetyn painoksen uudistettua painosta. @fi
toolkit label: betegnelse for en bestemt revisjon av en utgave @no
toolkit definition: Et ord, et tegn eller en gruppe av ord eller tegn som identifiserer en bestemt revisjon av en bestemt utgave. @no
label: έχει προσδιορισμό της κατονομαζόμενης αναθεώρησης της έκδοσης @el
definition: Συνδέει μια εκδήλωση με μια λέξη, έναν χαρακτήρα ή μια ομάδα λέξεων ή χαρακτήρων οι οποίοι ταυτίζουν μια συγκεκριμένη εκδοχή μιας κατονομαζόμενης έκδοσης. @el
toolkit label: προσδιορισμός της κατονομαζόμενης αναθεώρησης της έκδοσης @el
toolkit definition: Μια λέξη, ένας χαρακτήρας ή μια ομάδα λέξεων ή χαρακτήρων οι οποίοι ταυτίζουν μια συγκεκριμένη εκδοχή μιας κατονομαζόμενης έκδοσης. @el
has element type: 6
label: kiadás nevesített átdolgozásának jelölése a következő: @hu
definition: Hozzákapcsol egy megjelenési formát egy szóhoz, karakterhez, vagy szavak vagy karakterek egy csoportjához, amely azonosítja egy nevesített kiadás egy adott átdolgozását. @hu
toolkit label: kiadás nevesített átdolgozásának jelölése: @hu
toolkit definition: Egy szó, karakter, vagy szavak vagy karakterek egy csoportja, amely azonosítja egy nevesített kiadás egy adott átdolgozását. @hu
label: nimetyn uudistetun painoksen määrite @fi
label: har betegnelse for en bestemt revisjon av en utgave @no
definition: Relaterer en manifestasjon til et ord, et tegn eller en gruppe av ord eller tegn som identifiserer en bestemt revisjon av en bestemt utgave. @no
label: heeft aanduiding van een benoemde herziening van editie @nl
definition: Relateert een manifestatie aan een woord, karakter, of groep van woorden en/of karakters die een bepaalde herziening van een benoemde editie identificeert. @nl
label: له تسمية لمراجعة مسماة لطبعة @ar
definition: يربط بين تجسيدة وكلمة، أو حرف، أو مجموعة من الكلمات، أو تمثيلات، تحدد مراجعة محددة لطبعة مسماة. @ar
toolkit label: تسمية لمراجعة مسماه لطبعة @ar
toolkit definition: كلمة، أو حرف، أو مجموعة من الكلمات، أو تمثيلات، تحدد مراجعة محددة لطبعة مسماة. @ar
label: editsiooni nimelise uusversiooni tähistus @et
definition: Seostab kehastuse sõna, märgi või sõnade ja/või märkide rühmaga, mis identifitseerib mingi kindla nimega uusversiooni. @et
toolkit label: editsiooni nimelise uusversiooni tähistus @et
toolkit definition: Sõna, märk või sõnade ja/või märkide rühm, mis identifitseerib mingi kindla nimega uusversiooni. @et
label: ha come designazione di una revisione identificata di un'edizione @it
definition: Correla una manifestazione a una parola, carattere, o serie di parole e/o caratteri, che identificano una particolare revisione di un'edizione identificata. @it
toolkit label: designazione di una revisione identificata di un'edizione @it
toolkit definition: Parola, carattere, o serie di parole e/o caratteri, che identificano una particolare revisione di un'edizione identificata. @it
label: pārstrādātā izdevuma apzīmējums @lv
definition: Sasaista manifestāciju ar vārdu, vārdkopu vai rakstzīmju kopu, kas identificē konkrēto pārstrādāto izdevumu. @lv
toolkit label: pārstrādātā izdevuma apzīmējums @lv
toolkit definition: Vārds, vārdkopa vai rakstzīmju kopa, kas identificē konkrēto pārstrādāto izdevumu. @lv
label: 有版本的命名修订的标识 @zh-hans
definition: 将一种载体表现与标识一个命名版本的特定修订的词、字符或者词或字符的组合关联起来。 @zh-hans
toolkit label: 版本的命名修订的标识 @zh-hans
toolkit definition: 标识一个命名版本的特定修订的词、字符或者词或字符的组合 @zh-hans
label: adlandırılmış basım revizyonu ile ilişkilidir @tr
definition: Bir gösterimi, adlandırılmış bir basımın belirli bir revizyonunu tanımlayan bir kelime, karakter ya da kelime veya karakter grubuyla ilişkilendirir. @tr
toolkit label: adlandırılmış baskı revizyonunun tanımlaması @tr
toolkit definition: Belirli bir baskının belirli bir revizyonunu tanımlayan bir kelime, karakter ya da kelime veya karakter grubu. @tr
label: tiene designación de revisión nombrada de edición @es
definition: Relaciona una manifestación con una palabra, carácter o grupo de palabras o caracteres, que identifica una revisión particular de una edición nombrada. @es

has parallel designation of named revision of edition
status: Published
definition: Relates a manifestation to a designation of a named revision of an edition in another language or script.
type: Property
domain: C10007
lexical alias: parallelDesignationOfNamedRevisionOfEdition.en
instruction number: 2.5.7
toolkit label: parallel designation of named revision of edition
toolkit definition: A designation of a named revision of an edition in another language or script.
label: a pour désignation parallèle d’une révision nommée d’une édition @fr
definition: Met une manifestation en relation avec une désignation d’une révision nommée d’une édition dans une autre langue ou écriture. @fr
toolkit label: désignation parallèle d’une révision nommée d’une édition @fr
toolkit definition: Désignation d’une révision nommée d’une édition dans une autre langue ou écriture. @fr
toolkit label: designación paralela de revisión nombrada de edición @es
toolkit definition: Una designación de una revisión nombrada de una edición en otro lenguaje o escritura. @es
label: har parallell påföljande upplageförteckning @sv
toolkit label: parallell påföljande upplageförteckning @sv
toolkit label: parallelvermelding van benoemde herziening van editie @nl
toolkit definition: Een aanduiding van een benoemde herziening van een editie in een andere taal of schrift. @nl
label: có định danh song song của phiên bản được định rõ của ấn bản @vi
definition: Liên kết biểu thị với định danh của phiên bản được định rõ của ấn bản trong ngôn ngữ hoặc hệ thống viết khác với được dùng để ghi trong định danh của phiên bản được định rõ của yếu tố ấn bản. @vi
toolkit label: định danh song song của phiên bản được định rõ của ấn bản @vi
toolkit definition: Định danh của phiên bản được định rõ của ấn bản trong ngôn ngữ hoặc hệ thống viết khác với được dùng để ghi trong định danh của phiên bản được định rõ của yếu tố ấn bản. @vi
label: har parallel betegnelse for en navngivet revision af udgave @da
definition: Relaterer en manifestation til en betegnelse for en navngivet revision af en udgave på et andet sprog eller skriftsystem. @da
toolkit label: parallel betegnelse for en navngivet revision af udgave @da
toolkit definition: Betegnelse for en navngivet revision af en udgave på et andet sprog eller skriftsystem. @da
label: hat parallele Ausgabebezeichnung einer näher erläuterten Überarbeitung @de
definition: Setzt eine Manifestation in Beziehung zu einer Ausgabebezeichnung einer näher erläuterten Überarbeitung in einer anderen Sprache oder einer anderen Schrift. @de
toolkit label: Parallele Ausgabebezeichnung einer näher erläuterten Überarbeitung @de
toolkit definition: Eine Ausgabebezeichnung einer näher erläuterten Überarbeitung in einer anderen Sprache oder einer anderen Schrift. @de
label: té com a designació paral·lela d’una revisió explícita d’edició @ca
definition: Relaciona una manifestació amb una designació d’una revisió explícita d’una edició en una altra llengua o escriptura. @ca
toolkit label: designació paral·lela d’una revisió explícita d’edició @ca
toolkit definition: Designació d’una revisió explícita d’una edició en una altra llengua o escriptura. @ca
definition: Liittää manifestaation nimetyn uudistetun painoksen määritteeseen toisella kielellä ja/tai kirjoitusjärjestelmällä. @fi
toolkit label: nimetyn uudistetun painoksen rinnakkainen määrite @fi
toolkit definition: Nimetyn uudistetun painoksen määrite toisella kielellä ja/tai kirjoitusjärjestelmällä. @fi
toolkit label: parallell betegnelse for en bestemt revisjon av utgave @no
toolkit definition: En betegnelse for en bestemt revisjon av en utgave på et annet språk eller i et annet skriftsystem. @no
label: έχει παράλληλο προσδιορισμό της κατονομαζόμενης αναθεώρησης της έκδοσης @el
definition: Συνδέει μια εκδήλωση με έναν προσδιορισμό μιας κατονομαζόμενης αναθεώρησης μιας έκδοσης σε μια γλώσσα ή γραφή που διαφέρει από εκείνη με την οποία καταχωρίστηκε σε έναν προσδιορισμό μιας κατονομαζόμενης αναθεώρησης ενός στοιχείου έκδοσης. @el
toolkit label: παράλληλος προσδιορισμός της κατονομαζόμενης αναθεώρησης της έκδοσης @el
toolkit definition: Ένας προσδιορισμός μιας κατονομαζόμενης αναθεώρησης μιας έκδοσης σε μια γλώσσα ή γραφή που διαφέρει από εκείνη με την οποία καταχωρίστηκε σε έναν προσδιορισμό μιας κατονομαζόμενης αναθεώρησης ενός στοιχείου έκδοσης. @el
sub property of: has designation of named revision of edition
has element type: 6
label: kiadás nevesített átdolgozásának párhuzamos jelölése a következő: @hu
definition: Hozzákapcsol egy megjelenési formát egy kiadás nevesített átdolgozásának más nyelven vagy írásrendszerben lévő jelöléséhez. @hu
toolkit label: kiadás nevesített átdolgozásának párhuzamos jelölése: @hu
toolkit definition: Egy kiadás nevesített revíziójának a jelölése olyan nyelven vagy írásmódban, amely különbözik attól, amely a kiadás nevesített revíziójának a jelölése elemben rögzítve van. @hu
label: nimetyn uudistetun painoksen rinnakkainen määrite @fi
label: har parallell betegnelse for en bestemt revisjon av utgave @no
definition: Relaterer en manifestasjon til en betegnelse for en bestemt revisjon av en utgave på et annet språk eller i et annet skriftsystem. @no
label: heeft parallelle aanduiding van benoemde herziening van editie @nl
definition: Relateert een manifestatie aan een aanduiding van een benoemde herziening van een editie in een andere taal of schrift. @nl
label: له تسمية موازية لمراجعة مسماة من طبعة @ar
definition: يربط بين تجسيدة وتسمية مراجعة مسماة لطبعة في لغة أخرى أو نظام آخر للحروف. @ar
toolkit label: تسمية موازية لمراجعة مسماة من طبعة @ar
toolkit definition: تسمية مراجعة مسماة لطبعة في لغة أخرى أو نظام آخر للحروف. @ar
label: editsiooni nimelise uusversiooni rööptähistus @et
definition: Seostab kehastuse editsiooni nimelise uusversiooni tähistusega teises keeles või kirjasüsteemis. @et
toolkit label: editsiooni nimelise uusversiooni rööptähistus @et
toolkit definition: Editsiooni nimelise uusversiooni tähistus teises keeles või kirjasüsteemis. @et
label: ha come designazione parallela di una revisione identificata di un'edizione @it
definition: Correla una manifestazione a una designazione di una revisione identificata di un'edizione, in una lingua o scrittura diversa. @it
toolkit label: designazione parallela di una revisione identificata di un'edizione @it
toolkit definition: Designazione di una revisione identificata di un'edizione, in una lingua o scrittura diversa. @it
label: pārstrādātā izdevuma paralēlais apzīmējums @lv
definition: Sasaista manifestāciju ar pārstrādātā izdevuma citas valodas vai rakstības apzīmējumu. @lv
toolkit label: pārstrādātā izdevuma paralēlais apzīmējums @lv
toolkit definition: Pārstrādātā izdevuma citas valodas vai rakstības apzīmējums. @lv
label: 有版本的命名修订的并列标识 @zh-hans
definition: 将一种载体表现与用另一种语言或文字的一个版本的命名修订的一个标识关联起来。 @zh-hans
toolkit label: 版本的命名修订的并列标识 @zh-hans
toolkit definition: 用另一种语言或文字的一个版本的命名修订的一个标识 @zh-hans
label: paralel adlandırılmış basım revizyonu tanımlayıcısı ile ilişkilidir @tr
definition: Bir gösterimi, başka bir dil veya alfabedeki bir basımın adlandırılmış bir revizyonunun tanımıyla ilişkilendirir. @tr
toolkit label: basımın adlandırılmış revizyonunun paralel belirteci @tr
toolkit definition: Başka bir dildeki veya alfabedeki bir basımın adlandırılmış bir revizyonunun tanımı. @tr
label: tiene designación paralela de revisión nombrada de edición @es

has parallel place of publication
status: Published
definition: Relates a manifestation to a place of publication in another language or script.
type: Property
domain: C10007
lexical alias: parallelPlaceOfPublication.en
instruction number: 2.8.3
toolkit label: parallel place of publication
toolkit definition: A place of publication in another language or script.
label: a pour forme parallèle d’un lieu de publication @fr
definition: Met une manifestation en relation avec un lieu de publication dans une autre langue ou écriture. @fr
toolkit label: forme parallèle d’un lieu de publication @fr
toolkit definition: Lieu de publication dans une autre langue ou écriture. @fr
toolkit label: lugar de publicación paralelo @es
toolkit definition: Un lugar de publicación en otro idioma o escritura. @es
label: har parallell utgivningsort @sv
toolkit label: parallell utgivningsort @sv
toolkit label: parallelle plaats van publicatie @nl
toolkit definition: Een plaats van publicatie in een andere taal of schrift. @nl
label: có địa điểm xuất bản song song @vi
definition: Liên kết biểu thị với địa điểm xuất bản trong ngôn ngữ hoặc hệ thống viết khác với được ghi trong yếu tố địa điểm xuất bản. @vi
toolkit label: địa điểm xuất bản song song @vi
toolkit definition: Địa điểm xuất bản trong ngôn ngữ hoặc hệ thống viết khác với được ghi trong yếu tố địa điểm xuất bản. @vi
label: har parallelt publiceringssted @da
definition: Relaterer en manifestation til et publiceringssted på et andet sprog eller skriftsystem. @da
toolkit label: parallelt publiceringssted @da
toolkit definition: Publiceringssted på et andet sprog eller skriftsystem. @da
label: hat parallelen Erscheinungsort @de
definition: Setzt eine Manifestation in Beziehung zu einem Erscheinungsort in einer anderen Sprache oder einer anderen Schrift. @de
toolkit label: Paralleler Erscheinungsort @de
toolkit definition: Ein Erscheinungsort in einer anderen Sprache oder einer anderen Schrift. @de
label: té com a lloc paral·lel de publicació @ca
definition: Relaciona una manifestació amb un lloc de publicació en una altra llengua o escriptura. @ca
toolkit label: lloc paral·lel de publicació @ca
toolkit definition: Lloc de publicació en una altra llengua o escriptura. @ca
definition: Liittää manifestaation kustannuspaikkaan toisella kielellä ja/tai kirjoitusjärjestelmällä. @fi
toolkit label: rinnakkainen kustannuspaikka @fi
toolkit definition: Kustannuspaikka toisella kielellä ja/tai kirjoitusjärjestelmällä. @fi
toolkit label: parallelt utgivelsessted @no
toolkit definition: Et utgivelsessted på et annet språk eller i et annet skriftsystem. @no
label: έχει παράλληλο τόπο δημοσίευσης @el
definition: Συνδέει μια εκδήλωση με έναν τόπο δημοσίευσης σε μια γλώσσα ή γραφή που διαφέρει από εκείνη με την οποία καταχωρίστηκε στο στοιχείο του τόπου δημοσίευσης. @el
toolkit label: παράλληλος τόπος δημοσίευσης @el
toolkit definition: Ένας τόπος δημοσίευσης σε μια γλώσσα ή γραφή που διαφέρει από εκείνη με την οποία καταχωρίστηκε στο στοιχείο του τόπου δημοσίευσης. @el
sub property of: has place of publication
has element type: 3
label: párhuzamos kiadási helye a következő: @hu
definition: Hozzákapcsol egy megjelenési formát egy kiadási helyhez egy másik nyelven vagy írásrendszerben. @hu
toolkit label: párhuzamos kiadási helye: @hu
toolkit definition: Egy kiadási hely egy másik nyelven vagy írásrendszerben. @hu
label: rinnakkainen kustannuspaikka @fi
label: har parallelt utgivelsessted @no
definition: Relaterer en manifestasjon til et utgivelsessted på et annet språk eller i et annet skriftsystem. @no
label: heeft parallelle plaats van publicatie @nl
definition: Relateert een manifestatie aan een plaats van publicatie in een andere taal of schrift. @nl
label: له مكان نشر موازي @ar
definition: يربط بين تجسيدة ومكان نشر في لغة أخرى أو نظام آخر للحروف. @ar
toolkit label: مكان نشر موازي @ar
toolkit definition: مكان نشر في لغة أخرى أو نظام آخر للحروف. @ar
label: ilmumiskoha rööpandmed @et
definition: Seostab kehastuse ilmumiskohaga teises keeles või kirjasüsteemis. @et
toolkit label: ilmumiskoha rööpandmed @et
toolkit definition: Ilmumiskoht teises keeles või kirjasüsteemis. @et
label: ha come luogo di pubblicazione parallelo @it
definition: Correla una manifestazione a un luogo di pubblicazione, in una lingua o scrittura diversa. @it
toolkit label: luogo di pubblicazione parallelo @it
toolkit definition: Luogo di pubblicazione in una lingua o scrittura diversa. @it
label: paralēlā publicēšanas vieta @lv
definition: Sasaista manifestāciju ar publicēšanas vietu citā valodā vai rakstībā. @lv
toolkit label: paralēlā publicēšanas vieta @lv
toolkit definition: Publicēšanas vieta citā valodā vai rakstībā. @lv
label: 有并列出版地 @zh-hans
definition: 将一种载体表现与用另一种语言或文字的出版地关联起来。 @zh-hans
toolkit label: 并列出版地 @zh-hans
toolkit definition: 用另一种语言或文字的出版地 @zh-hans
label: paralel yayın yeri ile ilişkilidir @tr
definition: Bir gösterimi, başka bir dil veya alfabedeki yayın yeri ile ilişkilendirir. @tr
toolkit label: paralel yayın yeri @tr
toolkit definition: Başka bir dilde veya alfabede yayın yeri. @tr
label: tiene un lugar de publicación paralelo @es

has parallel designation of edition
status: Published
definition: Relates a manifestation to a designation of edition in another language or script.
type: Property
domain: C10007
lexical alias: parallelDesignationOfEdition.en
instruction number: 2.5.3
toolkit label: parallel designation of edition
toolkit definition: A designation of edition in another language or script.
label: a pour désignation parallèle d’édition @fr
definition: Met une manifestation en relation avec une désignation d’édition dans une autre langue ou écriture. @fr
toolkit label: désignation parallèle d’édition @fr
toolkit definition: Désignation d’édition dans une autre langue ou écriture. @fr
toolkit label: designación paralela de edición @es
toolkit definition: Una designación de edición en otro lenguaje o escritura. @es
label: har parallell upplageförteckning @sv
toolkit label: parallell upplageförteckning @sv
toolkit label: parallelvermelding van editie @nl
toolkit definition: Een aanduiding van editie in een andere taal of schrift. @nl
label: có định danh song song của ấn bản @vi
definition: Liên kết biểu thị với định danh của ấn bản trong ngôn ngữ hoặc hệ thống viết khác với được dùng để ghi trong định danh của phiên bản được định rõ của yếu tố ấn bản. @vi
toolkit label: định danh song song của ấn bản @vi
toolkit definition: Định danh của ấn bản trong ngôn ngữ hoặc hệ thống viết khác với được dùng để ghi trong định danh của phiên bản được định rõ của yếu tố ấn bản. @vi
label: har parallel udgavebetegnelse @da
definition: Relaterer en manifestation til en betegnelse for en udgave på et andet sprog eller skriftsystem. @da
toolkit label: parallel udgavebetegnelse @da
toolkit definition: Betegnelse for en udgave på et andet sprog eller skriftsystem. @da
label: hat parallele Ausgabebezeichnung @de
definition: Setzt eine Manifestation in Beziehung zu einer Ausgabebezeichnung in einer anderen Sprache oder einer anderen Schrift. @de
toolkit label: Parallele Ausgabebezeichnung @de
toolkit definition: Eine Ausgabebezeichnung in einer anderen Sprache oder einer anderen Schrift. @de
label: té com a designació paral·lela d’edició @ca
definition: Relaciona una manifestació amb una designació d’edició en una altra llengua o escriptura. @ca
toolkit label: designació paral·lela d’edició @ca
toolkit definition: Designació d’edició en una altra llengua o escriptura. @ca
definition: Liittää manifestaation painoksen määritteeseen toisella kielellä ja/tai kirjoitusjärjestelmällä. @fi
toolkit label: painoksen rinnakkainen määrite @fi
toolkit definition: Painoksen määrite toisella kielellä ja/tai kirjoitusjärjestelmällä. @fi
toolkit label: parallell utgaveangivelse @no
toolkit definition: En betegnelse for en utgave på et annet språk eller i et annet skriftsystem. @no
label: έχει παράληλο προσδιορισμό της έκδοσης @el
definition: Συνδέει μια εκδήλωση με έναν προσδιορισμό μιας έκδοσης σε μια γλώσσα ή γραφή που διαφέρει από εκείνη που είναι καταχωρισμένη σε έναν προσδιορισμό ενός στοιχείου έκδοσης. @el
toolkit label: παράλληλος προσδιορισμός της έκδοσης @el
toolkit definition: Ένας προσδιορισμός μιας έκδοσης σε μια γλώσσα ή γραφή που διαφέρει από εκείνη με την οποία καταχωρίστηκε σε έναν προσδιορισμό του στοιχείου της έκδοσης. @el
sub property of: has designation of edition
has element type: 6
label: kiadás párhuzamos jelölése a következő: @hu
definition: Hozzákapcsol egy megjelenési formát egy kiadás más nyelven vagy írásrendszerben lévő megjelöléséhez. @hu
toolkit label: kiadás párhuzamos jelölése: @hu
toolkit definition: A kiadás jelölése egy másik nyelven vagy írásmódban. @hu
label: painoksen rinnakkainen määrite @fi
label: har parallell utgaveangivelse @no
definition: Relaterer en manifestasjon til en betegnelse for en utgave på et annet språk eller i et annet skriftsystem. @no
label: heeft parallelle aanduiding van editie @nl
definition: Relateert een manifestatie aan een aanduiding van editie in een andere taal of schrift. @nl
label: له تسمية موازية لطبعة @ar
definition: يربط بين تجسيدة وتسمية لطبعة في لغة أخرى أو نظام آخر للحروف. @ar
toolkit label: تسمية موازية لطبعة @ar
toolkit definition: تسمية لطبعة في لغة أخرى أو نظام آخر للحروف. @ar
label: editsiooni rööptähistus @et
definition: Seostab kehastuse editsiooni tähistusega teises keeles või kirjasüsteemis. @et
toolkit label: editsiooni rööptähistus @et
toolkit definition: Editsiooni tähistus teises keeles või kirjasüsteemis. @et
label: ha come designazione parallela di edizione @it
definition: Correla una manifestazione a una designazione di edizione, in una lingua o scrittura diversa. @it
toolkit label: designazione parallela di edizione @it
toolkit definition: Designazione di edizione, in una lingua o scrittura diversa. @it
label: izdevuma paralēlais apzīmējums @lv
definition: Sasaista manifestāciju ar izdevuma apzīmējumu citā valodā vai rakstībā. @lv
toolkit label: izdevuma paralēlais apzīmējums @lv
toolkit definition: Izdevuma apzīmējums citā valodā vai rakstībā. @lv
label: 有并列版本标识 @zh-hans
definition: 将一种载体表现与用另一种语言或文字的版本标识关联起来。 @zh-hans
toolkit label: 并列版本标识 @zh-hans
toolkit definition: 用另一种语言或文字的版本标识 @zh-hans
label: paralel basım tanımlayıcısı ile ilişkilidir @tr
definition: Bir gösterimi, başka bir dil veya alfabedeki basımın tanımıyla ilişkilendirir. @tr
toolkit label: basımın paralel belirteci @tr
toolkit definition: Başka bir dilde veya alfabede basım tanımı. @tr
label: tiene designación paralela de edición @es

has publisher number for notated music
status: Published
definition: Relates a manifestation to a nomen that is an identifier for manifestation other than a plate number for notated music, assigned by a publisher to a manifestation of a notated music expression.
type: Property
domain: C10007
sub property of: has identifier for manifestation
lexical alias: publisherNumberForNotatedMusic.en
instruction number: 2.15.2
toolkit label: publisher number for notated music
toolkit definition: A nomen that is an identifier for manifestation other than a plate number for notated music, assigned by a publisher to a manifestation of a notated music expression.
label: a pour numéro d’éditeur pour la musique notée @fr
definition: Met une manifestation en relation avec un nomen qui est un identifiant de manifestation, autre qu’un cotage pour la musique notée, attribué par un éditeur à une manifestation d’une expression de musique notée. @fr
toolkit label: numéro d’éditeur pour la musique notée @fr
toolkit definition: Nomen qui est un identifiant de manifestation, autre qu’un cotage pour la musique notée, attribué par un éditeur à une manifestation d’une expression de musique notée. @fr
toolkit label: número de editor para música notada @es
toolkit definition: Un nomen que es un identificador de manifestación distinto de un número de placa para música notada, asignado por un editor a una manifestación de una expresión musical notada. @es
scope note: The number normally appears only on the title page, the cover, or the first page of music, and sometimes includes initials, abbreviations, or words identifying the publisher.
label: har editionsnummer @sv
toolkit label: editionsnummer @sv
toolkit label: uitgeversnummer voor bladmuziek @nl
toolkit definition: Een nomen dat is een identificatie voor manifestatie, anders dan een plaatnummer voor bladmuziek, door een uitgever toegekend aan een manifestatie van een bladmuziek-expressie @nl
label: có chỉ số nhà xuất bản cho âm nhạc ký hiệu @vi
definition: Liên kết biểu thị với định danh số được nhà xuất bản gán cho biểu thị âm nhạc ký hiệu. @vi
scope note: Chỉ số của nhà xuất bản cho âm nhạc ký hiệu đôi khi bao gồm viết tắt bằng các chữ cái đầu, viết tắt, hoặc các từ nhận dạng nhà xuất bản đó. @vi
toolkit label: chỉ số nhà xuất bản cho âm nhạc ký hiệu @vi
toolkit definition: Định danh số được nhà xuất bản gán cho biểu thị âm nhạc ký hiệu. @vi
scope note: Het nummer staat meestal alleen op de titelpagina, het omslag of de eerste muziekpagina,en omvat soms initialen, afkortingen of woorden die de uitgever identificeren. @nl
label: har editionsnummer for noteret musik @da
definition: Relaterer en manifestation til et nomen, som er en identifikator for manifestation, som er en anden end et pladenummer for noteret musik, tildelt af en udgiver af en manifestation af et noteret musikudtryk. @da
scope note: Nummeret fremtræder normalt kun på titelsiden, omslaget eller den første side med noder og indeholder sommetider initialer, forkortelser eller ord, som identificerer udgiveren. @da
toolkit label: editionsnummer for noteret musik @da
toolkit definition: Identifikator for manifestation, som er en anden end et pladenummer for noteret musik, tildelt af en udgiver af en manifestation af et noteret musikudtryk. @da
label: hat Noten-Bestellnummer @de
definition: Setzt eine Manifestation in Beziehung zu einem Identifikator für eine Manifestation, der von einem Verlag einer Manifestation einer Noten-Expression zugewiesen wird und bei dem es sich nicht um die Druckplattennummer handelt. @de
scope note: Die Nummer erscheint normalerweise nur auf der Titelseite, der Einbanddecke oder der ersten Seite von Musikalien und enthält manchmal Initialen, Abkürzungen oder Wörter, die den Verlag identifizieren. @de
toolkit label: Noten-Bestellnummer @de
toolkit definition: Ein Identifikator für eine Manifestation, der von einem Verlag einer Manifestation einer Noten-Expression zugewiesen wird und bei dem es sich nicht um die Druckplattennummer handelt. @de
label: té com a número d’editor de música notada @ca
definition: Relaciona una manifestació amb un nomen que és un identificador de manifestació diferent d’un número de planxa de música notada, assignat per un editor a una manifestació d’una expressió de música notada. @ca
scope note: Normalment el número només figura a la portada, a la coberta o a la primera pàgina de música i de vegades inclou inicials, abreviacions o paraules que identifiquen l’editor. @ca
toolkit label: número d’editor de música notada @ca
toolkit definition: Nomen que és un identificador de manifestació diferent d’un número de planxa de música notada, assignat per un editor a una manifestació d’una expressió de música notada. @ca
definition: Liittää manifestaation nomeniin, joka on musiikin kustantajan nuottiaineiston ekspression manifestaatiolle antama tunniste, joka ei ole nuottiaineiston laatan numero. @fi
toolkit label: kustantajan nuottiaineistolle antama numero @fi
toolkit definition: Nomen, joka on musiikin kustantajan nuottiaineiston ekspression manifestaatiolle antama tunniste, joka ei ole laatan numero. @fi
toolkit label: edisjonsnummer for nedskrevet musikk @no
toolkit definition: En identifikator for manifestasjon som ikke er et platenummer for nedskrevet musikk, angitt av en utgiver av en manifestasjon av et uttrykk av nedskrevet musikk. @no
label: έχει αριθμό του εκδότη για μουσική σημειογραφία @el
definition: Συνδέει μια εκδήλωση με έναν αριθμητικό προσδιορισμό που ανατίθεται σε μια εκδήλωση μουσικής σημειογραφίας από έναν εκδότη. @el
scope note: Ο αριθμός ενός εκδότη για τη μουσική σημειογραφία κάποιες φορές περιλαμβάνει αρχικά, συντομογραφίες ή λέξεις που ταυτίζουν τον εκδότη. @el
toolkit label: αριθμός του εκδότη για μουσική σημειογραφία @el
toolkit definition: Ένας αριθμητικός προσδιορισμός που ανατίθεται σε μια εκδήλωση μουσικής σημειογραφίας από έναν εκδότη. @el
scope note: Le numéro figure habituellement uniquement sur la page de titre, la couverture ou la première page de musique et comprend parfois des initiales, des abréviations ou des mots identifiant l’éditeur. @fr
has element type: 3
label: kiadói műjegyzékszáma a következő: @hu
definition: Egy megjelenési formát hozzákapcsol egy számozási jelöléshez, amelyet egy kiadó rendel hozzá egy kottázott zenei megjelenési formához. @hu
scope note: A szám általában a címoldalon, a borítón vagy a zenei lejegyzés első oldalán jelenik meg, és néha magába foglal kezdőbetűket, rövidítéseket vay a kiadót megnevező szavakat. @hu
toolkit label: kiadói műjegyzékszáma: @hu
toolkit definition: Egy számozási jelölés, amelyet egy kiadó egy kottázott zenei megjelenési formához rendel hozzá. @hu
alternative label: publisher's number for notated music
scope note: Numero esiintyy yleensä vain nimiösivulla, kannessa tai ensimmäisellä nuottisivulla ja sisältää joskus kustantajaa identifioivia alkukirjainlyhenteitä, sanalyhenteitä tai sanoja. @fi
label: kustantajan nuottiaineistolle antama numero @fi
label: har edisjonsnummer for nedskrevet musikk @no
definition: Relaterer en manifestasjon til en identifikator for manifestasjon som ikke er et platenummer for nedskrevet musikk, angitt av en utgiver av en manifestasjon av et uttrykk av nedskrevet musikk. @no
scope note: Nummeret finnes som regel kun på tittelsiden, omslaget eller den første siden med musikk og inneholder noen ganger initialer, forkortelser eller ord som identifiserer utgiveren. @no
label: heeft uitgeversnummer voor bladmuziek @nl
definition: Relateert een manifestatie aan een nomen dat is een identificatie voor manifestatie, anders dan een plaatnummer voor bladmuziek, door een uitgever toegekend aan een manifestatie van een bladmuziek-expressie @nl
label: له رقم ناشر لموسيقى مدونة @ar
definition: يربط بين تجسيدة ومعرف تجسيدة بخلاف رقم لوحة لمدونة موسيقية، التى يخصصها ناشر لتجسيدة خاصة بتعبيرة مدونة موسيقية. @ar
scope note: يظهر الرقم عادة فقط على صفحة العنوان، أو الغلاف، أو الصفحة الأولى من الموسيقى، ويشمل أحيانًا على الاستهلاليات، أو الإختصارات، أو الكلمات التى تعرف بالناشر. @ar
toolkit label: رقم ناشر لموسيقى مدونة @ar
toolkit definition: معرف تجسيدة بخلاف رقم لوحة لمدونة موسيقية، التى يخصصها ناشر لتجسيدة خاصة بتعبيرة مدونة موسيقية. @ar
label: noodi kirjastajanumber @et
definition: Seostab kehastuse kehastuse identifikaatoriga, mis ei ole noodi trükiplaadinumber ja mille kirjastaja on andnud noodi väljenduse kehastusele. @et
scope note: Number asub tavaliselt ainult tiitellehel, kaanel või noodiosa esimesel leheküljel ning sisaldab mõnikord kirjastajat identifitseerivaid initsiaale, lühendeid või sõnu. @et
toolkit label: noodi kirjastajanumber @et
toolkit definition: Kehastuse identifikaator, mis ei ole noodi trükiplaadinumber ja mille kirjastaja on andnud noodi väljenduse kehastusele. @et
label: ha come numero dell'editore per la musica notata @it
definition: Correla una manifestazione a un identificatore per la manifestazione, diverso dal numero di lastra per la musica notata, assegnato da un editore a una manifestazione di un'espressione di musica notata. @it
scope note: Il numero compare normalmente solo sul frontespizio, sulla copertina, o sulla prima pagina di musica e comprende talvolta iniziali, abbreviazioni o parole che identificano l'editore. @it

has name of publisher
status: Published
definition: Relates a manifestation to a nomen that is a name of an agent who is responsible for publishing a manifestation.
type: Property
domain: C10007
lexical alias: nameOfPublisher.en
instruction number: 2.8.4
toolkit label: name of publisher
toolkit definition: A nomen that is a name of an agent who is responsible for publishing a manifestation.
label: a pour nom d’éditeur @fr
definition: Met une manifestation en relation avec un nomen qui est un nom d’un agent responsable de la publication d’une manifestation. @fr
toolkit label: nom d’éditeur @fr
toolkit definition: Nomen qui est un nom d’un agent responsable de la publication d’une manifestation. @fr
toolkit label: nombre de publicador @es
toolkit definition: Un nomen que es el nombre de un agente que es responsable de publicar una manifestación. @es
label: har utgivarnamn @sv
toolkit label: utgivarnamn @sv
toolkit label: naam van uitgever @nl
toolkit definition: Een nomen dat is een naam van een actor die verantwoordelijk is voor het uitgeven van een manifestatie. @nl
label: có tên nhà xuất bản @vi
definition: Liên kết biểu thị với tên của tác nhân có trách nhiệm về xuất bản, đăng tảu, công bố biểu hiện. @vi
toolkit label: tên nhà xuất bản @vi
toolkit definition: Tên của tác nhân có trách nhiệm về xuất bản, đăng tảu, công bố biểu hiện. @vi
label: har navn på udgiver @da
definition: Relaterer en manifestation til et navn på en agent, som er ansvarlig for at publicere en manifestation. @da
toolkit label: navn på udgiver @da
toolkit definition: Navn på en agent, som er ansvarlig for at publicere en manifestation. @da
label: hat Verlagsnamen @de
definition: Setzt eine Manifestation in Beziehung zum Namen eines Akteurs, der für die Veröffentlichung einer Manifestation verantwortlich ist. @de
toolkit label: Verlagsname @de
toolkit definition: Ein Name eines Akteurs, der für die Veröffentlichung einer Manifestation verantwortlich ist. @de
label: té com a nom d’editor @ca
definition: Relaciona una manifestació amb un nomen que és un nom d’un agent que és responsable de la publicació d’una manifestació. @ca
toolkit label: nom d’editor @ca
toolkit definition: Nomen que és un nom d’un agent que és responsable de la publicació d’una manifestació. @ca
definition: Liittää manifestaation nomeniin, joka on manifestaation kustantamisesta vastuussa olevan toimijan nimi. @fi
toolkit label: kustantajan nimi @fi
toolkit definition: Nomen, joka on manifestaation kustantamisesta vastuussa olevan toimijan nimi. @fi
toolkit label: navn på utgiver @no
toolkit definition: Et navn på en agent som er ansvarlig for å utgi en manifestasjon. @no
label: έχει όνομα εκδότη @el
definition: Συνδέει μια εκδήλωση με ένα όνομα ενός φορέα υπεύθυνου για τη δημοσίευση, την κυκλοφορία ή την έκδοση μιας εκδήλωσης. @el
toolkit label: όνομα εκδότη @el
toolkit definition: Ένα όνομα ενός φορέα υπεύθυνου για τη δημοσίευση, την κυκλοφορία ή την έκδοση μιας εκδήλωσης. @el
sub property of: has name of agent of manifestation
alternative label: publisher's name
has element type: 3
label: kiadó neve a következő: @hu
definition: Hozzákapcsol egy megjelenési formát egy nomenhez, egy ágens nevéhez, amely felelős egy kiadott megjelenési forma terjesztéséért. @hu
toolkit label: kiadó neve: @hu
toolkit definition: Egy nomen, egy ágens neve, amely felelős egy kiadott megjelenési forma terjesztéséért. @hu
scope note: Publication includes release and issuance.
scope note: Kustantaminen pitää sisällään myös julkaisemisen ja ilmestymisen. @fi
label: kustantajan nimi @fi
label: har navn på utgiver @no
definition: Relaterer en manifestasjon til et navn på en agent som er ansvarlig for å utgi en manifestasjon. @no
scope note: Utgivelse inkluderer lansering og utstedelse. @no
alternative label: utgiverens navn @no
scope note: La publication comprend la mise à disposition et l’édition. @fr
label: heeft naam van uitgever @nl
definition: Relateert een manifestatie aan een nomen dat is een naam van een actor die verantwoordelijk is voor het uitgeven van een manifestatie. @nl
scope note: Uitgeven omvat uitbrengen en uitvaardigen. @nl
label: له اسم ناشر @ar
definition: يربط بين تجسيدة واسم وكيل مسئول عن نشر تجسيدة. @ar
scope note: يشمل النشر الإطلاق والإصدار. @ar
alternative label: اسم ناشر @ar
toolkit label: اسم ناشر @ar
toolkit definition: اسم وكيل مسئول عن نشر تجسيدة. @ar
scope note: La publicació inclou la posada en circulació i l’emissió. @ca
scope note: Publikation omfatter frigivelse og udstedelse. @da
alternative label: udgivers navn @da
label: kirjastaja nimi @et
definition: Seostab kehastuse kehastuse avaldamise eest vastutava tegija nimega. @et
scope note: Avaldamine hõlmab ka väljalaskmist ja väljaandmist. @et
toolkit label: kirjastaja nimi @et
toolkit definition: Kehastuse avaldamise eest vastutava tegija nimi. @et
scope note: Darunter fallen die Freigabe und die Herausgabe. @de
scope note: kiadója neve: @hu
alternative label: A közzététel megjelenést és kibocsátást foglal magába. @hu
label: ha come nome dell'editore @it

is on carrier unit with
status: Published
definition: Relates a manifestation to a manifestation that is a part of the same carrier unit as another part manifestation.
type: Property
domain: C10007
sub property of: is accompanied by manifestation
toolkit label: on carrier unit with
toolkit definition: A manifestation that is a part of the same carrier unit as another part manifestation.
label: est sur une unité de support matériel avec @fr
definition: Met une manifestation en relation avec une manifestation qui constitue une partie de la même unité de support matériel qu’une autre partie de manifestation. @fr
toolkit label: sur une unité de support matériel avec @fr
toolkit definition: Manifestation qui constitue une partie de la même unité de support matériel qu’une autre partie de manifestation. @fr
toolkit label: en unidad portadora con @es
toolkit definition: Una manifestación que es parte de la misma unidad portadora como otra manifestación parcial. @es
instruction number: 24.5
toolkit label: uitgevaardigd met @nl
toolkit definition: Een manifestatie die is uitgevaardigd op dezelfde drager als een manifestatie die wordt beschreven. @nl
label: được công bố với @vi
definition: Liên kết biểu thị với biểu thị được công bố trên cùng vật mang tin với biểu thị đang được mô tả. @vi
toolkit label: được công bố với @vi
toolkit definition: Biểu thị được công bố trên cùng vật mang tin với biểu thị đang được mô tả. @vi
label: er udgivet sammen med @da
definition: Relaterer en manifestation til en manifestation, som er udgivet på den samme bærer som den manifestation, der bliver beskrevet. @da
toolkit label: udgivet sammen med @da
toolkit definition: Manifestation, som er udgivet på den samme bærer som den manifestation, der bliver beskrevet. @da
label: ist erschienen mit @de
definition: Setzt eine Manifestation in Beziehung zu einer Manifestation, die auf demselben Datenträger erscheint, wie die Manifestation, die beschrieben wird. @de
toolkit label: erscheint mit @de
toolkit definition: Eine Manifestation, die auf demselben Datenträger erscheint, wie die Manifestation, die beschrieben wird. @de
label: és en unitat de suport físic amb @ca
definition: Relaciona una manifestació amb una manifestació que és una part de la mateixa unitat de suport físic com una altra manifestació de part. @ca
toolkit label: en unitat de suport físic amb @ca
toolkit definition: Manifestació que és una part de la mateixa unitat de suport físic com una altra manifestació de part. @ca
definition: Liittää manifestaation manifestaatio, joka on ilmestynyt samalla tallenteella kuin kuvailun kohteena oleva manifestaatio. @fi
toolkit label: tallenteella myös @fi
toolkit definition: Manifestaatio, joka on ilmestynyt samalla tallenteella kuin kuvailun kohteena oleva manifestaatio. @fi
toolkit label: utgitt sammen med @no
toolkit definition: En manifestasjon som er utgitt på samme bærer som manifestasjonen som beskrives. @no
label: εκδίδεται με @el
definition: Συνδέει μια εκδήλωση με μια εκδήλωση που εκδίδεται στον ίδιο φορέα αποθήκευσης με την περιγραφόμενη εκδήλωση. @el
toolkit label: εκδίδεται με @el
toolkit definition: Μια εκδήλωση που εκδίδεται στον ίδιο φορέα αποθήκευσης με την περιγραφόμενη εκδήλωση. @el
has element type: 2
label: együtt kiadva a következővel: @hu
definition: Hozzákapcsol egy megjelenési formát egy megjelenési formához, amelyet ugyanazon a hordozón adnak ki, mint az éppen leírt megjelenési formát. @hu
toolkit label: együtt kiadva a következővel: @hu
toolkit definition: Egy megjelenési forma, amelyet ugyanazon a hordozón adnak ki, mint az éppen leírt megjelenési formát. @hu
label: tallenteella myös @fi
label: er utgitt sammen med @no
definition: Relaterer en manifestasjon til en manifestasjon som er utgitt på samme bærer som manifestasjonen som beskrives. @no
label: is uitgevaardigd met @nl
definition: Relateert een manifestatie aan een manifestatie die is uitgevaardigd op dezelfde drager als een manifestatie die wordt beschreven. @nl
label: هو صادر مع @ar
definition: يربط بين تجسيدة وتجسيدة صادرة على الوسيط نفسه مثل التجسيدة التي يتم وصفها. @ar
toolkit label: صادر مع @ar
toolkit definition: تجسيدة صادرة على الوسيط نفسه مثل التجسيدة التي يتم وصفها. @ar
label: ilmunud koos kehastusega @et
definition: Seostab kehastuse kehastusega, mis on ilmunud kirjeldatava kehastusega samal kandjal. @et
toolkit label: ilmunud koos kehastusega @et
toolkit definition: Kehastus, mis on ilmunud kirjeldatava kehastusega samal kandjal. @et
label: è pubblicata con @it
definition: Correla una manifestazione a una manifestazione pubblicata sullo stesso supporto della manifestazione descritta. @it
toolkit label: pubblicata con @it
toolkit definition: Manifestazione pubblicata sullo stesso supporto della manifestazione descritta. @it
alternative label: issued with
lexical alias: onCarrierUnitWith.en
label: ir izdots kopā ar @lv
definition: Sasaista manifestāciju ar manifestāciju, kas ir izdota tajā pašā nesējā kā aprakstāmā manifestācija. @lv
toolkit label: izdots kopā ar @lv
toolkit definition: Manifestācija, kas ir izdota tajā pašā nesējā kā aprakstāmā manifestācija. @lv
alternative label: ilmestynyt yhdessä @fi
alternative label: 与……一起发行 @zh-hans
label: 与……一起在载体单元上 @zh-hans
definition: 将一种载体表现与和另一个部分载体表现同是一载体单元一部分的一种载体表现关联起来。 @zh-hans
toolkit label: 与……一起在载体单元上 @zh-hans
toolkit definition: 和另一个部分载体表现同是一载体单元一部分的一种载体表现 @zh-hans
alternative label: emitido con @es
alternative label: publié avec @fr
alternative label: ile yayımlanan @tr
label: ile aynı taşıyıcı ünitede yer alır @tr

has mode of issuance
status: Published
definition: Relates a manifestation to a categorization that reflects whether a manifestation is issued in one or more units.
type: Property
domain: C10007
lexical alias: modeOfIssuance.en
instruction number: 2.13
toolkit label: mode of issuance
toolkit definition: A categorization that reflects whether a manifestation is issued in one or more units.
label: a pour mode de parution @fr
definition: Met une manifestation en relation avec une catégorisation qui indique si une manifestation est publiée en une ou plusieurs unités. @fr
toolkit label: mode de parution @fr
toolkit definition: Catégorisation qui indique si une manifestation est publiée en une ou plusieurs unités. @fr
toolkit label: modo de expedición @es
toolkit definition: Una categorización que refleja si una manifestación se expide en una o mas unidades. @es
label: har utgivningssätt @sv
toolkit label: utgivningssätt @sv
toolkit label: wijze van uitvaardiging @nl
toolkit definition: Een categorisatie die weergeeft of een manifestatie is uitgevaardigd in één of meer delen. @nl
label: có kiểu công bố @vi
definition: Liên kết biểu thị với chia loại phản ánh biểu thị được công bố thành một hay nhiều hơn phần, cách cập nhật, và việc kết thúc có được định trước hay không. @vi
toolkit label: kiểu công bố @vi
toolkit definition: Chia loại phản ánh biểu thị được công bố thành một hay nhiều hơn phần, cách cập nhật, và việc kết thúc có được định trước hay không. @vi
label: har udgivelsesform @da
definition: Relaterer en manifestation til en kategorisering, som afspejler, hvorvidt en manifestation er udgivet i en eller flere enheder. @da
toolkit label: udgivelsesform @da
toolkit definition: Kategorisering, som afspejler, hvorvidt en manifestation er udgivet i en eller flere enheder. @da
label: hat Erscheinungsweise @de
definition: Setzt eine Manifestation in Beziehung zu einer Kategorisierung die widerspiegelt, ob eine Manifestation in einem Teil oder mehreren Teilen erscheint. @de
toolkit label: Erscheinungsweise @de
toolkit definition: Eine Kategorisierung die widerspiegelt, ob eine Manifestation in einem Teil oder mehreren Teilen erscheint. @de
label: té com a forma de publicació @ca
definition: Relaciona una manifestació amb una categorització que reflecteix si una manifestació es publica en una o més unitats. @ca
toolkit label: forma de publicació @ca
toolkit definition: Categorització que reflecteix si una manifestació es publica en una o més unitats. @ca
definition: Liittää manifestaation kategorisointiin, joka kertoo, ilmestyykö manifestaatio yhtenä vai useana yksikkönä. @fi
toolkit label: julkaisutapa @fi
toolkit definition: Kategorisointi, joka kertoo, ilmestyykö manifestaatio yhtenä vai useana yksikkönä. @fi
toolkit label: utgivelsesmåte @no
toolkit definition: En inndeling som gjenspeiler om en manifestasjon er utgitt i én eller flere deler. @no
label: έχει τρόπο κυκλοφορίας @el
definition: Συνδέει μια εκδήλωση με μια κατηγοριοποίηση που αντανακλά αν μια εκδήλωση εκδίδεται σε ένα ή περισσότερα μέρη, τον τρόπο με τον οποίο ενημερώνεται/ανανεώνεται και αν ο τερματισμός της είναι προκαθορισμένος ή όχι. @el
toolkit label: τρόπος κυκλοφορίας @el
toolkit definition: Μια κατηγοριοποίηση που αντανακλά αν μια εκδήλωση εκδίδεται σε ένα ή περισσότερα μέρη, τον τρόπο με τον οποίο ενημερώνεται/ανανεώνεται και αν ο τερματισμός της είναι προκαθορισμένος ή όχι. @el
has element type: 4
label: kibocsájtás módja a következő: @hu
definition: Hozzákapcsol egy megjelenési formát egy kategorizációhoz, amely azt tükrözi, hogy vajon egy megjelenési forma egy vagy több részben kerül-e kibocsájtásra. @hu
toolkit label: kibocsájtás módja:: @hu
toolkit definition: Egy kategorizáció, amely azt tükrözi, hogy vajon egy megjelenési forma egy vagy több részben kerül-e kibocsájtásra. @hu
label: julkaisutapa @fi
label: har utgivelsesmåte @no
definition: Relaterer en manifestasjon til en inndeling som gjenspeiler om en manifestasjon er utgitt i én eller flere deler. @no
label: heeft wijze van uitvaardiging @nl
definition: Relateert een manifestatie aan een categorisatie die weergeeft of een manifestatie is uitgevaardigd in één of meer delen. @nl
label: له أسلوب للإصدار @ar
definition: يربط بين تجسيدة وفئة تعكس ما إذا كانت التجسيدة قد صدرت في وحدة واحدة أو عدة وحدات. @ar
toolkit label: أسلوب للإصدار @ar
toolkit definition: فئة تعكس ما إذا كانت التجسيدة قد صدرت في وحدة واحدة أو عدة وحدات. @ar
label: avaldamisviis @et
definition: Seostab kehastuse kategooriaga, mis väljendab seda, kas kehastus on avaldatud ühe või mitme üksusena. @et
toolkit label: avaldamisviis @et
toolkit definition: Kategooria, mis väljendab seda, kas kehastus on avaldatud ühe või mitme üksusena. @et
label: ha come modalità di emissione @it
definition: Correla una manifestazione a una categorizzazione che riflette se una manifestazione è pubblicata in una o più unità. @it
toolkit label: modalità di emissione @it
toolkit definition: Categorizzazione che riflette se una manifestazione è pubblicata in una o più unità. @it
label: izlaides veids @lv
definition: Sasaista manifestāciju ar apzīmējumu, kas atspoguļo, vai manifestācija ir izdota vienā vai vairākās daļās/vienībās. @lv
toolkit label: izlaides veids @lv
toolkit definition: Apzīmējums, kas atspoguļo, vai manifestācija ir izdota vienā vai vairākās daļās/vienībās. @lv
label: 有发行方式 @zh-hans
definition: 将一种载体表现与反映载体表现以一个还是以多个单元发行的分类关联起来。 @zh-hans
toolkit label: 发行方式 @zh-hans
toolkit definition: 反映载体表现以一个还是以多个单元发行的分类 @zh-hans
label: yayın biçimi ile ilişkilidir @tr
definition: Bir gösterimi, bir veya daha fazla birimde yayınlanıp yayınlanmadığını yansıtan bir sınıflandırmayla ilişkilendirir. @tr
toolkit label: Yayınlama seçeneği @tr
toolkit definition: Bir gösterimin bir veya daha fazla birim halinde yayımlanıp yayımlanmadığını yansıtan bir sınıflandırma. @tr
label: tiene modo de expedición @es
definition: Relaciona una manifestación con una categorización que refleja si una manifestación se expide en una o mas unidades. @es

has expression manifested
status: Published
definition: Relates a manifestation to an expression that is embodied by a manifestation.
type: Property
domain: C10007
lexical alias: expressionManifested.en
toolkit label: expression manifested
toolkit definition: An expression that is embodied by a manifestation.
label: a pour expression manifestée @fr
definition: Met une manifestation en relation avec une expression qui est matérialisée par une manifestation. @fr
toolkit label: expression manifestée @fr
toolkit definition: Expression qui est matérialisée par une manifestation. @fr
toolkit label: expresión manifestada @es
toolkit definition: Una expresión que está encarnada por una manifestación. @es
label: har manifesterat uttryck @sv
toolkit label: manifesterat uttryck @sv
toolkit label: gemanifesteerde expressie @nl
toolkit definition: Een expressie verwezenlijkt in een manifestatie. @nl
label: có biểu hiện được biểu thị @vi
definition: Liên kết biểu thị với biểu hiện thể hiện biểu thị. @vi
toolkit label: biểu hiện được biểu thị @vi
toolkit definition: Biểu hiện thể hiện biểu thị. @vi
label: har udtryk manifesteret @da
definition: Relaterer en manifestation til et udtryk, som er indeholdt i en manifestation. @da
toolkit label: udtryk manifesteret @da
toolkit definition: Udtryk, som er indeholdt i en manifestation. @da
label: hat in einer Manifestation verkörperte Expression @de
definition: Setzt eine Manifestation in Beziehung zu einer Expression, die durch eine Manifestation verkörpert ist. @de
toolkit label: In einer Manifestation verkörperte Expression @de
toolkit definition: Eine Expression, die durch eine Manifestation verkörpert ist. @de
label: té com a expressió manifestada @ca
definition: Relaciona una manifestació amb una expressió que es materialitza en una manifestació. @ca
toolkit label: expressió manifestada @ca
toolkit definition: Expressió que es materialitza en una manifestació. @ca
definition: Liittää manifestaation ekspressioon, joka sisältyy manifestaatioon. @fi
toolkit label: manifestaatioon sisältyvä ekspressio @fi
toolkit definition: Ekspressio, joka sisältyy manifestaatioon. @fi
toolkit label: manifestert uttrykk @no
toolkit definition: Et uttrykk som er realisert i en manifestasjon. @no
label: έχει υλοποιημένη έφραση @el
definition: Συνδέει μια εκδήλωση με μια έκφραση που ενσωματώνεται σε μια εκδήλωση. @el
toolkit label: υλοποιημένη έκφραση @el
toolkit definition: Μια έκφραση που ενσωματώνεται σε μια εκδήλωση. @el
sub property of: has related expression of manifestation
has element type: 3
label: van kinyilvánított kifejezési formája @hu
definition: Hozzákapcsol egy megjelenési formát egy kifejezési formához, amely egy megjelenési formában testesül meg. @hu
toolkit label: megjelentetett kifejezési forma @hu
toolkit definition: Egy kifejezési forma, amely egy megjelenési formában testesül meg. @hu
instruction number: 17.1
label: manifestaatioon sisältyvä ekspressio @fi
label: har manifestert uttrykk @no
definition: Relaterer en manifestasjon til et uttrykk som er realisert i en manifestasjon. @no
label: heeft gemanifesteerde expressie @nl
definition: Relateert een manifestatie aan een expressie verwezenlijkt in een manifestatie. @nl
label: له تعبيرة مجسيدة @ar
definition: يربط بين تجسيدة وتعبيرة تم تجسيدها في تجسيدة. @ar
toolkit label: تعبيرة مجسيدة @ar
toolkit definition: تعبيرة تم تجسيدها في تجسيدة. @ar
label: kehastatud väljendus @et
definition: Seostab kehastuse väljendusega, mis on kehastuses teostatud. @et
toolkit label: kehastatud väljendus @et
toolkit definition: Väljendus, mis on kehastuses teostatud. @et
label: ha come espressione manifestata @it
definition: Correla una manifestazione a un'espressione materializzata in una manifestazione. @it
toolkit label: espressione manifestata @it
toolkit definition: Espressione materializzata in una manifestazione. @it
label: manifestētā izteiksme @lv
definition: Sasaista manifestāciju ar izteiksmi, ko iemiesojusi manifestācija. @lv
toolkit label: manifestētā izteiksme @lv
toolkit definition: Izteiksme, ko iemiesojusi manifestācija. @lv
label: 有被载体表现的内容表达 @zh-hans
definition: 将种载体表现与被一种载体表现具体化的一种内容表达关联起来。 @zh-hans
toolkit label: 被载体表现的内容表达 @zh-hans
toolkit definition: 被一种载体表现具体化的一种内容表达 @zh-hans
label: gösterimde somutlaştırılmış anlatım ile ilişkilidir @tr
definition: Bir gösterimi, bir gösterimin somutlaştırdığı bir anlatımla ilişkilendirir. @tr
toolkit label: gösterime dönüştürülmüş anlatım @tr
toolkit definition: Bir gösterim tarafından somutlaştırılan bir anlatım. @tr
label: tiene expresión manifestada @es

has encoding format
status: Published
definition: Relates a manifestation to a schema or standard that is used to encode the digital content of a manifestation.
type: Property
domain: C10007
sub property of: has digital file characteristic
lexical alias: encodingFormat.en
instruction number: 3.19.3
toolkit label: encoding format
toolkit definition: A schema or standard that is used to encode the digital content of a manifestation.
label: a pour format d’encodage @fr
definition: Met une manifestation en relation avec une norme ou un schéma qui est utilisé pour encoder le contenu numérique d’une manifestation. @fr
toolkit label: format d’encodage @fr
toolkit definition: Norme ou schéma qui est utilisé pour encoder le contenu numérique d’une manifestation. @fr
toolkit label: formato de codificación @es
toolkit definition: Un esquema o estándar que se utiliza para codificar el contenido digital de una manifestación. @es
label: har kodningsformat @sv
toolkit label: kodningsformat @sv
toolkit label: coderingsformaat @nl
toolkit definition: Een schema of standaard die is gebruikt om de digitale content van een manifestatie te coderen. @nl
label: có định dạng ghi mã @vi
definition: Liên kết biểu thị với lược đồ, chuẩn, v.v..., được sử dụng để ghi mã nội dung số của biểu hiện. @vi
toolkit label: định dạng ghi mã @vi
toolkit definition: Lược đồ, chuẩn, v.v..., được sử dụng để ghi mã nội dung số của biểu hiện. @vi
definition: Relaterer en manifestation til et skema, standard etc., som anvendes til kodning af en manifestations digitale indhold. @da
toolkit definition: Skema, standard etc., som anvendes til kodning af en manifestations digitale indhold. @da
label: hat Kodierungsformat @de
definition: Setzt eine Manifestation in Beziehung zu einem Schema oder Standard, das/der zum Kodieren des digitalen Inhalts einer Manifestation verwendet wird. @de
toolkit label: Kodierungsformat @de
toolkit definition: Ein Schema oder Standard, das/der zum Kodieren des digitalen Inhalts einer Manifestation verwendet wird. @de
label: té com a format de codificació @ca
definition: Relaciona una manifestació amb un esquema o estàndard que s’usa per codificar el contingut digital d’una manifestació. @ca
toolkit label: format de codificació @ca
toolkit definition: Esquema o estàndard que s’usa per codificar el contingut digital d’una manifestació. @ca
definition: Liittää manifestaation sen digitaalisen sisällön koodaamiseen käytettyyn skeemaan rai standardiin. @fi
toolkit label: koodausmuoto @fi
toolkit definition: Manifestaation digitaalisen sisällön koodaamiseen käytetty skeema tai standardi. @fi
toolkit label: kodeformat @no
toolkit definition: Et skjema, en standard etc. som er brukt for å kode det digitale innholdet i en manifestasjon. @no
label: έχει μορφότυπο κωδικοποίησης @el
definition: Συνδέει μια εκδήλωση με ένα σχήμα, πρότυπο κ.λπ. το οποίο χρησιμοποιείται για την κωδικοποίηση του ψηφιακού περιεχομένου μιας εκδήλωσης. @el
toolkit label: μορφότυπο κωδικοποίησης @el
toolkit definition: Ένα σχήμα, πρότυπο κ.λπ. το οποίο χρησιμοποιείται για την κωδικοποίηση του ψηφιακού περιεχομένου μιας εκδήλωσης. @el
has element type: 5
label: kódolási formátuma a következő: @hu
definition: Hozzákapcsol egy megjelenési formát egy sémához vagy szabványhoz, amelyet egy megjelenési forma digitális tartalmának a kódolására használnak. @hu
toolkit label: kódolási formátuma: @hu
toolkit definition: Egy séma vagy szabvány, amelyet egy megjelenési forma digitális tartalmának a kódolására használnak. @hu
label: koodausmuoto @fi
label: har kodeformat @no
definition: Relaterer en manifestasjon til et skjema, en standard etc. som er brukt for å kode det digitale innholdet i en manifestasjon. @no
label: heeft coderingsformaat @nl
definition: Relateert een manifestatie aan een schema of standaard die is gebruikt om de digitale content van een manifestatie te coderen. @nl
label: له نظام ترميز @ar
definition: يربط بين تجسيدة وخطة، أو معيار، إلخ. مستخدمة في تكويد المحتوى الرقمي لتجسيدة. @ar
toolkit label: نظام ترميز @ar
toolkit definition: خطة، أو معيار، إلخ. مستخدمة في تكويد المحتوى الرقمي لتجسيدة. @ar
label: kodeerimisformaat @et
definition: Seostab kehastuse süsteemi või standardiga, mida on kasutatud kehastuse digitaalsisu kodeerimiseks. @et
toolkit label: kodeerimisformaat @et
toolkit definition: Süsteem või standard, mida on kasutatud kehastuse digitaalsisu kodeerimiseks. @et
label: ha come formato di codifica @it
definition: Correla una manifestazione a uno schema, standard, etc. utilizzato per la codifica del contenuto digitale di una manifestazione. @it
toolkit label: formato di codifica @it
toolkit definition: Schema, standard, etc. utilizzato per la codifica del contenuto digitale di una manifestazione. @it
label: kodējuma formāts @lv
definition: Sasaista manifestāciju ar shēmu, standartu u.tml., kas izmantots kodējot manifestācijas digitālo saturu. @lv
toolkit label: kodējuma formāts @lv
toolkit definition: Shēma, standarts u.tml., kas izmantots kodējot manifestācijas digitālo saturu. @lv
label: 有编码格式 @zh-hans
definition: 将一种载体表现与用于对一种载体表现的数字内容进行编码的一种方案或标准关联起来。 @zh-hans
toolkit label: 编码格式 @zh-hans
toolkit definition: 用于对一种载体表现的数字内容进行编码的一种方案或标准 @zh-hans
label: kodlama formatı ile ilişkilidir @tr
definition: Bir gösterimi, bir gösterimin dijital içeriğini kodlamak için kullanılan bir şema veya standartla ilişkilendirir. @tr
toolkit label: kodlama formatı @tr
toolkit definition: Bir gösterimin dijital içeriğini kodlamak için kullanılan bir şema veya standart. @tr
label: tiene formato de codificación @es
definition: Relaciona una manifestación con un esquema o estándar que se utiliza para codificar el contenido digital de una manifestación. @es
has subproperty: P30096

has details of encoding format
status: Published
type: Property
lexical alias: detailsOfEncodingFormat.en
definition: Relates a manifestation to details of a schema or standard used to encode the digital content of a manifestation.
domain: C10007
instruction number: 3.19.3.4
toolkit label: details of encoding format
toolkit definition: Details of a schema or standard used to encode the digital content of a manifestation.
toolkit label: detalles del formato de codificación @es
toolkit definition: Detalles de un esquema o estándar utilizado para codificar el contenido digital de una manifestación. @es
sub property of: has details of digital file characteristic
label: har detaljerad information om kodningsformat @sv
toolkit label: detaljerad information om kodningsformat @sv
toolkit label: details van coderingsformaat @nl
toolkit definition: Details van een schema of standaard gebruikt om de digitale content van een resource te coderen. @nl
label: có chi tiết của định dạng ghi mã @vi
definition: Liên kết biểu thị với chi tiết của lược đồ, chuẩn, v.v..., được sử dụng để ghi mã nội dung số của biểu hiện. @vi
toolkit label: chi tiết của định dạng ghi mã @vi
toolkit definition: Chi tiết của lược đồ, chuẩn, v.v..., được sử dụng để ghi mã nội dung số của biểu hiện. @vi
label: har detaljer om indkodningsformat @da
definition: Relaterer en manifestation til detaljer om skema, standard etc., som bruges til kodning af en manifestations digitale indhold. @da
toolkit label: detaljer om indkodningsformat @da
toolkit definition: Detaljer om skema, standard etc., som bruges til kodning af en manifestations digitale indhold. @da
label: hat Details zum Kodierungsformat @de
definition: Setzt eine Manifestation in Beziehung zu den Details zu dem Schema oder Standard, das/der zum Kodieren des digitalen Inhalts einer Manifestation verwendet wird. @de
toolkit label: Details zum Kodierungsformat @de
toolkit definition: Details zu dem Schema oder Standard, das/der zum Kodieren des digitalen Inhalts einer Manifestation verwendet wird. @de
label: té com a particularitats de format de codificació @ca
definition: Relaciona una manifestació amb les particularitats d’un esquema o d’un estàndard usat per codificar el contingut digital d’una manifestació. @ca
toolkit label: particularitats de format de codificació @ca
toolkit definition: Particularitats d’un esquema o d’un estàndard usat per codificar el contingut digital d’una manifestació. @ca
definition: Liittää manifestaation tarkempiin tietoihin manifestaation digitaalisen sisällön koodaamiseen käytetystä skeemasta tai standardista. @fi
toolkit label: koodausmuodon tarkemmat tiedot @fi
toolkit definition: Tarkemmat tiedot manifestaation digitaalisen sisällön koodaamiseen käytetystä skeemasta tai standardista. @fi
toolkit label: detaljer vedrørende kodeformat @no
toolkit definition: Detaljer vedrørende et skjema, en standard etc. brukt til å kode det digitale innholdet i en manifestasjon. @no
label: έχει λεπτομέρειες του μορφότυπου κωδικοποίησης @el
definition: Συνδέει μια εκδήλωση με τις λεπτομέρειες ενός σχήματος, προτύπου κ.λπ. που χρησιμοποιείται για την κωδικοποίηση του ψηφιακού περιεχομένου μιας εκδήλωσης. @el
toolkit label: λεπτομέρειες του μορφότυπου κωδικοποίησης @el
toolkit definition: Λεπτομέρειες ενός σχήματος, προτύπου κ.λπ. που χρησιμοποιείται για την κωδικοποίηση του ψηφιακού περιεχομένου μιας εκδήλωσης. @el
label: a pour particularités d’un format d’encodage @fr
definition: Met une manifestation en relation avec des particularités d’une norme ou d’un schéma utilisé pour encoder le contenu numérique d’une manifestation. @fr
toolkit label: particularités d’un format d’encodage @fr
toolkit definition: Particularités d’une norme ou d’un schéma utilisé pour encoder le contenu numérique d’une manifestation. @fr
has element type: 6
label: kódolási formátum részletei a következők: @hu
definition: Hozzákapcsol egy megjelenési formát azon séma vagy szabvány részleteihez, amelyet egy megjelenési forma digitális tartalmának a kódolására használnak. @hu
toolkit label: kódolási formátum részletei: @hu
toolkit definition: Azon séma vagy szabvány részletei, amelyet egy megjelenési forma digitális tartalmának a kódolására használnak. @hu
label: koodausmuodon tarkemmat tiedot @fi
label: har detaljer vedrørende kodeformat @no
definition: Relaterer en manifestasjon til detaljer vedrørende et skjema, en standard etc. brukt til å kode det digitale innholdet i en manifestasjon. @no
label: heeft details van coderingsformaat @nl
definition: Relateert een manifestatie aan details van een schema of standaard gebruikt om de digitale content van een resource te coderen. @nl
label: له تفاصيل نظام ترميز @ar
definition: يربط بين تجسيدة وتفاصيل خطة، أو معيار، إلخ. مستخدم في تكويد المحتوى الرقمي لتجسيدة. @ar
toolkit label: تفاصيل نظام ترميز @ar
toolkit definition: تفاصيل خطة، أو معيار، إلخ. مستخدم في تكويد المحتوى الرقمي لتجسيدة. @ar
label: kodeerimisformaadi täpsustus @et
definition: Seostab kehastuse täpsemate andmetega süsteemi või standardi kohta, mida on kasutatud kehastuse digitaalsisu kodeerimiseks. @et
toolkit label: kodeerimisformaadi täpsustus @et
toolkit definition: Täpsemad andmed süsteemi või standardi kohta, mida on kasutatud kehastuse digitaalsisu kodeerimiseks. @et
label: ha come particolari relativi al formato di codifica @it
definition: Correla una manifestazione ai particolari relativi a uno schema, standard, etc. utilizzato per la codifica del contenuto digitale di una manifestazione. @it
toolkit label: particolari relativi al formato di codifica @it
toolkit definition: Particolari relativi a uno schema, standard, etc. utilizzato per la codifica del contenuto digitale di una manifestazione. @it
label: detalizēti par kodējuma formātu @lv
definition: Sasaista manifestāciju ar sīkāku informāciju par shēmu, standartu u.tml., ko lieto, lai kodētu manifestācijas digitālo saturu. @lv
toolkit label: detalizēti par kodējuma formātu @lv
toolkit definition: Sīkāka informācija par shēmu, standartu u.tml., ko lieto, lai kodētu manifestācijas digitālo saturu. @lv
label: 有编码格式的细节 @zh-hans
definition: 将一种载体表现与用于对一种载体表现的数字内容进行编码的一种方案或标准的细节关联起来。 @zh-hans
toolkit label: 编码格式的细节 @zh-hans
toolkit definition: 用于对一种载体表现的数字内容进行编码的一种方案或标准的细节 @zh-hans
label: kodlama formatının ayrıntıları ile ilişkilidir @tr
definition: Bir gösterimi, bir dijital içeriği kodlamak için kullanılan bir şema veya standardın ayrıntılarıyla ilişkilendirir. @tr
toolkit label: kodlama formatının ayrıntıları @tr
toolkit definition: Bir gösterimin dijital içeriğini kodlamak için kullanılan bir şema veya standardın ayrıntıları. @tr
label: tiene detalles del formato de codificación @es

has encoded bitrate
status: Published
definition: Relates a manifestation to a speed at which streaming audio, video, or other content is designed to play.
type: Property
domain: C10007
sub property of: has digital file characteristic
lexical alias: encodedBitrate.en
instruction number: 3.19.7
toolkit label: encoded bitrate
toolkit definition: A speed at which streaming audio, video, or other content is designed to play.
label: a pour débit binaire codé @fr
definition: Met une manifestation en relation avec une vitesse à laquelle un flux audio, vidéo ou autre est destiné à être diffusé. @fr
toolkit label: débit binaire codé @fr
toolkit definition: Vitesse à laquelle un flux audio, vidéo ou autre est destiné à être diffusé. @fr
toolkit label: tasa de bits codificada @es
toolkit definition: La velocidad a la que está diseñado para reproducirse la transmisión de audio, vídeo u otro contenido. @es
label: har bithastighet @sv
toolkit label: bithastighet @sv
toolkit label: gecodeerde bitsnelheid @nl
toolkit definition: Een snelheid waarmee streaming audio, video of andere content, bedoeld is om afgespeeld te worden. @nl
label: có tốc độ bit được mã @vi
definition: Liên kết biểu thị với tốc độ mà audio, video truyền, v.v... được thiết kế để chơi. @vi
toolkit label: tốc độ bit được mã @vi
toolkit definition: Tốc độ mà audio, video truyền, v.v... Được thiết kế để chơi. @vi
label: har kodet bitrate @da
definition: Relaterer en manifestation til en hastighed, som streaming af lyd, video etc. er beregnet til. @da
toolkit label: kodet bitrate @da
toolkit definition: Hastighed, som streaming af lyd, video etc. er beregnet til. @da
label: hat Bitrate @de
definition: Setzt eine Manifestation in Beziehung zu einer Geschwindigkeit, mit der Audio-, Video oder andere Streaming-Inhalte abgespielt werden. @de
toolkit label: Bitrate @de
toolkit definition: Eine Geschwindigkeit, mit der Audio-, Video oder andere Streaming-Inhalte abgespielt werden. @de
label: té com a velocitat de transmissió @ca
definition: Relaciona una manifestació amb una velocitat a la qual es dissenya l’estríming d’àudio, vídeo o un altre contingut @ca
toolkit label: velocitat de transmissió @ca
toolkit definition: Velocitat a la qual es dissenya l’estríming d’àudio, vídeo o un altre contingut @ca
definition: Liittää manifestaation nopeuteen, jolla suoratoistoääni, -video tai muu sisältö on suunniteltu toistettavan. @fi
toolkit label: koodattu bittinopeus @fi
toolkit definition: Nopeus, jolla suoratoistoääni, -video tai muu sisältö on suunniteltu toistettavan. @fi
toolkit label: kodet bithastighet @no
toolkit definition: En avspillingshastighet som strømmet lyd, video etc. er laget for. @no
label: έχει κωδικοποιημένο ρυθμό μετάδοσης @el
definition: Συνδέει μια εκδήλωση με μια ταχύτητα στην οποία η ροή ήχου, εικόνας κ.λπ. είναι προορισμένη να αναπαράγεται. @el
toolkit label: κωδικοποιημένος ρυθμός μετάδοσης @el
toolkit definition: Μια ταχύτητα στην οποία η ροή ήχου, εικόνας κ.λπ. είναι προορισμένη να αναπαράγεται. @el
has element type: 5
label: kódolt bitrátája a következő: @hu
definition: Hozzákapcsol egy megjelenési formát egy sebességhez, amelyen egy sztrímelt audió, videó vagy egyéb tartalom terv szerint lejátszódik. @hu
toolkit label: kódolt bitrátája: @hu
toolkit definition: Egy sebesség, amelyen egy sztrímelt audió, videó vagy egyéb tartalom terv szerint lejátszódik. @hu
label: koodattu bittinopeus @fi
label: har kodet bithastighet @no
definition: Relaterer en manifestasjon til en avspillingshastighet som strømmet lyd, video etc. er laget for. @no
label: heeft gecodeerde bitsnelheid @nl
definition: Relateert een manifestatie aan een snelheid waarmee streaming audio, video of andere content, bedoeld is om afgespeeld te worden. @nl
label: له معدل للبتات المكودة @ar
definition: يربط بين تجسيدة وسرعة تم تصميم كل من الصوت، والفيديو، إلخ. للتشغيل وفقا لها. @ar
toolkit label: معدل للبتات المكودة @ar
toolkit definition: سرعة تم تصميم كل من الصوت، والفيديو، إلخ. للتشغيل وفقا لها. @ar
label: kodeeritud bitikiirus @et
definition: Seostab kehastuse kiirusega, millega heli, video jms voogedastus on mõeldud toimima. @et
toolkit label: kodeeritud bitikiirus @et
toolkit definition: Kiirus, millega heli, video jms voogedastus on mõeldud toimima. @et
label: ha come codifica bitrate @it
definition: Correla una manifestazione a una velocità di riproduzione in streaming di registrazioni audio, video, etc. @it
toolkit label: codifica bitrate @it
toolkit definition: Velocità di riproduzione in streaming di registrazioni audio, video, etc. @it
label: kodēts bitu pārraides ātrums @lv
definition: Sasaista manifestāciju ar ātrumu, kādā paredzēts atskaņot straumētu audio, video u.tml. @lv
toolkit label: kodēts bitu pārraides ātrums @lv
toolkit definition: Ātrums, kādā paredzēts atskaņot straumētu audio, video u.tml. @lv
label: 有编码的比特率 @zh-hans
definition: 将一种载体表现与流播音频、视频或其他内容被设计播放的速度关联起来。 @zh-hans
toolkit label: 编码的比特率 @zh-hans
toolkit definition: 流播音频、视频或其他内容被设计播放的速度 @zh-hans
label: kodlanmış bit hızı ile ilişkilidir @tr
definition: Bir gösterimi, ses, video veya diğer içeriğin oynatılmak üzere tasarlandığı bir hızla ilişkilendirir. @tr
toolkit label: kodlanmış bit hızı @tr
toolkit definition: Akış halindeki ses, video veya diğer içeriklerin oynatılmak üzere tasarlandığı hız. @tr
label: tiene tasa de bits codificada @es

is manifestation commentary in
status: Published
type: Property
lexical alias: manifestationCommentaryIn.en
definition: Relates a manifestation to a work that is a set of explanatory or critical notes on a manifestation.
domain: C10007
toolkit label: manifestation commentary in
toolkit definition: A work that is a set of explanatory or critical notes on a manifestation.
label: est une manifestation commentée dans @fr
definition: Met une manifestation en relation avec une œuvre qui consiste en un ensemble de notes explicatives ou critiques sur une manifestation. @fr
toolkit label: manifestation commentée dans @fr
toolkit definition: Œuvre qui consiste en un ensemble de notes explicatives ou critiques sur une manifestation. @fr
toolkit label: comentario de manifestación en @es
toolkit definition: Una obra que es un conjunto de notas explicativas o críticas sobre una manifestación. @es
sub property of: is manifestation described by
instruction number: 23.5
toolkit label: manifestatie-commentaar in @nl
toolkit definition: Een werk dat is een verzameling verklarende of kritische noten over een manifestatie. @nl
label: là bình luận trong (biểu thị) @vi
definition: Liên kết biểu thị với tác phẩm có chứa chuỗi các ghi chú giải thích hoặc phê bình về biểu thị được mô tả. @vi
toolkit label: bình luận trong (biểu thị)ị @vi
toolkit definition: Tác phẩm có chứa chuỗi các ghi chú giải thích hoặc phê bình về biểu thị được mô tả. @vi
label: er manifestation kommentar i @da
definition: Relaterer en manifestation til et værk, som indeholder et sæt af forklarende eller kritiske noter om en manifestation. @da
toolkit label: manifestation kommentar i @da
toolkit definition: Værk, som indeholder et sæt af forklarende eller kritiske noter om en manifestation. @da
label: ist Manifestation kommentiert in @de
definition: Setzt eine Manifestation in Beziehung zu einem Werk, bei dem es sich um eine Reihe von erläuternden oder kritischen Anmerkungen zu einer Manifestation handelt. @de
toolkit label: Manifestation kommentiert in @de
toolkit definition: Ein Werk, bei dem es sich um eine Reihe von erläuternden oder kritischen Anmerkungen zu einer Manifestation handelt. @de
label: és comentari de manifestació en @ca
definition: Relaciona una manifestació amb una obra que és un conjunt de notes explicatives o crítiques sobre una manifestació. @ca
toolkit label: comentari de manifestació en @ca
toolkit definition: Obra que és un conjunt de notes explicatives o crítiques sobre una manifestació. @ca
definition: Liittää manifestaation teokseen, joka on manifestaatiota selittävien tai kritisoivien huomautusten joukko. @fi
toolkit label: manifestaation kommentaari @fi
toolkit definition: Teos, joka on manifestaatiota selittävien tai kritisoivien huomautusten joukko. @fi
toolkit label: manifestasjon kommentert i @no
toolkit definition: Et verk som inneholder et sett med forklarende eller kritiske noter til en manifestasjon. @no
label: είναι σχόλια στην (εκδήλωση) @el
definition: Συνδέει μια εκδήλωση με ένα έργο που περιέχει ένα σύνολο από επεξηγηματικές ή κριτικές σημειώσεις σε μια περιγραφόμενη εκδήλωση. @el
toolkit label: σχόλια στην (εκδήλωση) @el
toolkit definition: Ένα έργο που περιέχει ένα σύνολο από επεξηγηματικές ή κριτικές σημειώσεις σε μια περιγραφόμενη εκδήλωση. @el
has element type: 2
alternative label: commentary in (manifestation)
label: kommentálva a következő megjelenési formában: @hu
definition: Hozzákapcsol egy megjelenési formát egy műhöz, amely egy megjelenési forma magyarázó vagy kritikai jegyzeteinek a halmaza. @hu
toolkit label: kommentálva a következő megjelenési formában: @hu
toolkit definition: Egy mű, amely egy megjelenési forma magyarázó vagy kritikai jegyzeteinek a halmaza. @hu
label: manifestaation kommentaari @fi
label: er manifestasjon kommentert i @no
definition: Relaterer en manifestasjon til et verk som inneholder et sett med forklarende eller kritiske noter til en manifestasjon. @no
alternative label: kommentar i (manifestasjon) @no
alternative label: commentaire dans (manifestation) @fr
label: is manifestatie-commentaar in @nl
definition: Relateert een manifestatie aan een werk dat is een verzameling verklarende of kritische noten over een manifestatie. @nl
label: هو تعليق على تجسيدة في @ar
definition: يربط بين تجسيدة وعمل يحتوي على مجموعة من الملاحظات الشارحة أو الناقدة لتجسيدة. @ar
alternative label: تعليق في (تجسيدة) @ar
toolkit label: تعليق على تجسيدة في @ar
toolkit definition: عمل يحتوي على مجموعة من الملاحظات الشارحة أو الناقدة لتجسيدة. @ar
alternative label: comentari en (manifestació) @ca
alternative label: kommentar i (manifestation) @da
label: kehastuse kommentaar @et
definition: Seostab kehastuse teosega, mis sisaldab kogumi selgitavaid või kriitilisi märkusi kehastuse kohta. @et
toolkit label: kehastuse kommentaar @et
toolkit definition: Teos, mis sisaldab kogumi selgitavaid või kriitilisi märkusi kehastuse kohta. @et
alternative label: Kommentar in (Manifestation) @de
alternative label: kommentálva a következőben (megjelenési forma): @hu
label: è manifestazione commentata in @it
definition: Correla una manifestazione a un’opera che contiene un insieme di note esplicative o critiche su una manifestazione. @it
alternative label: commentata in (manifestazione) @it
toolkit label: manifestazione commentata in @it
toolkit definition: Opera che contiene un insieme di note esplicative o critiche su una manifestazione. @it
label: ir manifestācijas komentārs @lv
definition: Sasaista manifestāciju ar darbu, kas satur skaidrojošu vai kritisku piezīmju kopumu par aprakstīto manifestāciju. @lv
toolkit label: manifestācijas komentārs @lv
toolkit definition: Darbs, kas satur skaidrojošu vai kritisku piezīmju kopumu par aprakstīto manifestāciju. @lv
alternative label: ……中的评注（载体表现） @zh-hans
label: 是……中的载体表现评注 @zh-hans
toolkit label: ……中的载体表现评注 @zh-hans

has earlier title proper (Deprecated)
status: Deprecated
definition: Relates a manifestation to a title proper appearing on an earlier iteration of an integrating resource that differs from that on the current iteration. (Deprecated)
type: Property
domain: C10007
sub property of: has title proper
lexical alias: earlierTitleProper.en
instruction number: 2.3.7
toolkit label: earlier title proper (Deprecated)
toolkit definition: A title proper appearing on an earlier iteration of an integrating resource that differs from that on the current iteration. (Deprecated)
label: a pour titre propre antérieur @fr
definition: Met une manifestation en relation avec un titre propre qui figure sur une itération antérieure d’une ressource intégratrice et qui diffère du titre de l’itération courante. @fr
toolkit label: titre propre antérieur @fr
toolkit definition: Titre propre qui figure sur une itération antérieure d’une ressource intégratrice et qui diffère du titre de l’itération courante. @fr
toolkit label: título propiamente dicho anterior @es
toolkit definition: Un título propiamente dicho que aparece en una iteración anterior de un recurso integrable que difiere del que aparece en la iteración actual. @es
label: har föregående huvudtitel @sv
toolkit label: föregående huvudtitel @sv
toolkit label: eerdere hoofdtitel @nl
toolkit definition: Een hoofdtitel die vermeld staat op een eerdere iteratie van een integrerende resource die afwijkt van die op de huidige iteratie. @nl
label: có nhan đề hợp thức trước đây @vi
definition: Liên kết biểu thị với nhan đề hợp thức xuất hiện trên lần lặp trước đây của tài nguyên tích hợp khác với trên lần lặp hiện tại. @vi
toolkit label: nhan đề hợp thức trước đây @vi
toolkit definition: Nhan đề hợp thức xuất hiện trên lần lặp trước đây của tài nguyên tích hợp khác với trên lần lặp hiện tại. @vi
label: har tidligere hovedtitel @da
definition: Relaterer en manifestation til en hovedtitel, der forekommer på en tidligere iteration af en integrerende ressource, der afviger fra hovedtitlen på den aktuelle iteration. @da
toolkit label: tidligere hovedtitel @da
toolkit definition: Hovedtitel, der forekommer på en tidligere iteration af en integrerende ressource, der afviger fra hovedtitlen på den aktuelle iteration. @da
label: hat früheren Haupttitel @de
definition: Setzt eine Manifestation mit einem Haupttitel, der in einer früheren Iteration einer integrierenden Ressource erscheint, der von dem in der aktuellen Iteration abweicht, in Beziehung. @de
toolkit label: Früherer Haupttitel @de
toolkit definition: Ein Haupttitel, der in einer früheren Iteration einer integrierenden Ressource erscheint, der von dem in der aktuellen Iteration abweicht. @de
label: té com a títol propi anterior @ca
definition: Relaciona una manifestació amb un títol propi que figura en una iteració anterior d’un recurs integrant que difereix del de la iteració actual. @ca
toolkit label: títol propi anterior @ca
toolkit definition: Títol propi que figura en una iteració anterior d’un recurs integrant que difereix del de la iteració actual. @ca
label: aiempi päänimeke @fi
definition: Liittää manifestaation päivittyvän aineiston aiemmassa versiossa esiintyvään päänimekkeeseen, joka eroaa senhetkisessä versiossa esiintyvästä päänimekkeestä. @fi
toolkit label: aiempi päänimeke @fi
toolkit definition: Päivittyvän aineiston aiemmassa versiossa esiintyvä päänimeke, joka eroaa senhetkisessä versiossa esiintyvästä päänimekkeestä. @fi
toolkit label: tidligere hovedtittel @no
toolkit definition: En hovedtittel som framkommer på en tidligere versjon av en integrerende ressurs og som er forskjellig fra gjeldende versjon. @no
label: έχει προηγούμενο κύριο τίτλο @el
definition: Συνδέει μια εκδήλωση με έναν κύριο τίτλο που εμφανίζεται στην προηγούμενη επανάληψη ενός ενσωματωμένου πόρου ή πόρου διαρκούς ενημέρωσης/ανανέωσης που διαφέρει από εκείνον [που εμφανίζεται] στην τρέχουσα επανάληψη. @el
toolkit label: προηγούμενος κύριος τίτλος @el
toolkit definition: Ενας κύριος τίτλος που εμφανίζεται στην προηγούμενη επανάληψη ενός ενσωματωμένου πόρου ή πόρου διαρκούς ενημέρωσης/ανανέωσης ο οποίος διαφέρει από εκείνον [που εμφανίζεται] στην τρέχουσα επανάληψη. @el
has element type: 3
label: van korábbi valódi címe @hu
definition: Egy megjelenési formát hozzákapcsol egy valódi címhez, amely egy integráló forrás korábbi ismétlésein vagy iterációin jelenik meg, amely különbözik attól, amely a jelenlegi iteráción található. @hu
toolkit label: korábbi valódi cím @hu
toolkit definition: Egy valódi cím, amely egy integráló forrás korábbi iterációján jelenik meg, amely különbözik a jelenlegi iteráción megjelenttől. @hu
has subproperty: P30130

has related item of manifestation
status: Published
definition: Relates a manifestation to an item that is associated with a manifestation.
type: Property
domain: C10007
lexical alias: relatedItemOfManifestation.en
label: a pour item en relation avec une manifestation @fr
definition: Met une manifestation en relation avec un item qui est associé à une manifestation. @fr
toolkit label: elemento de manifestación relacionado @es
toolkit definition: Un elemento que está asociado con una manifestación. @es
label: har relaterat exemplar @sv
toolkit label: relaterat exemplar @sv
sub property of: has related RDA entity of manifestation
toolkit label: gerelateerd item van manifestatie @nl
toolkit definition: Een item dat is geassocieerd met het item dat beschreven wordt. @nl
label: có biểu thị bản có liên quan @vi
definition: Liên kết biểu thị với bản liên quan tới biểu thị đang được mô tả. @vi
toolkit label: biểu thị bản có liên quan @vi
toolkit definition: Bản liên quan tới biểu thị đang được mô tả. @vi
label: har eksemplar relateret til manifestation @da
definition: Relaterer en manifestation til et eksemplar, som er knyttet til en manifestation. @da
label: té com a ítem relacionat amb una manifestació @ca
definition: Relaciona una manifestació amb un ítem que s’associa amb una manifestació. @ca
definition: Liittää manifestaation kappaleeseen, joka liittyy manifestaatioon. @fi
toolkit label: manifestaatioon liittyvä kappale @fi
toolkit definition: Kappale, joka liittyy manifestaatioon. @fi
label: έχει σχετικό αντίτυπο (εκδήλωση) @el
definition: Συνδέει μια εκδήλωση με ένα αντίτυπο που συνδέεται με μια περιγραφόμενη εκδήλωση. @el
toolkit label: related item of manifestation
toolkit definition: An item that is associated with a manifestation.
has element type: 1
sub property of: P00005
label: megjelenési forma kapcsolódó példánya a következő: @hu
definition: Hozzákapcsol egy megjelenési formát egy példányhoz, amelyet egy megjelenési formához társítanak. @hu
label: manifestaatioon liittyvä kappale @fi
label: har relatert eksemplar av manifestasjon @no
definition: Relaterer en manifestasjon til et eksemplar som forbindes med en manifestasjon. @no
toolkit label: relatert eksemplar av manifestasjon @no
toolkit definition: Et eksemplar som forbindes med en manifestasjon. @no
toolkit label: item en relation avec une manifestation @fr
toolkit definition: Item qui est associé à une manifestation. @fr
label: heeft gerelateerd item van manifestatie @nl
definition: Relateert een manifestatie aan een item dat is geassocieerd met het item dat beschreven wordt. @nl
label: له مفردة متعلقة بالتجسيد @ar
definition: يربط بين تجسيدة ومفردة مرتبطة بتجسيدة. @ar
toolkit label: مفردة متعلقة بالتجسيد @ar
toolkit definition: مفردة مرتبطة بتجسيدة. @ar
toolkit label: ítem relacionat amb una manifestació @ca
toolkit definition: Ítem que s’associa amb una manifestació. @ca
toolkit label: eksemplar relateret til manifestation @da
toolkit definition: Eksemplar, som er knyttet til en manifestation. @da
label: kehastusega seotud eksemplar @et
definition: Seostab kehastuse eksemplariga, mis on kehastusega seotud. @et
toolkit label: kehastusega seotud eksemplar @et
toolkit definition: Eksemplar, mis on kehastusega seotud. @et
label: hat mit Manifestation in Beziehung stehendes Exemplar @de
definition: Setzt eine Manifestation in Beziehung zu einem Exemplar, das mit einer Manifestation in Verbindung steht. @de
toolkit label: mit Manifestation in Beziehung stehendes Exemplar @de
toolkit definition: Ein Exemplar, das mit einer Manifestation in Verbindung steht. @de
toolkit label: megjelenési formával összefüggő példány @hu
toolkit definition: Egy példány, amelyet egy megjelenési formához társítanak. @hu
label: ha come item di manifestazione correlato @it
definition: Correla una manifestazione a un item associato a una manifestazione. @it
toolkit label: item di manifestazione correlato @it
toolkit definition: Item associato a una manifestazione. @it
label: ar manifestāciju saistītā vienība @lv
definition: Sasaista manifestāciju ar vienību, kas ir saistīta ar manifestāciju. @lv
toolkit label: ar manifestāciju saistītā vienība @lv
toolkit definition: Vienība, kas ir saistīta ar manifestāciju. @lv
label: 有载体表现的关联单件 @zh-hans
definition: 将一种载体表现与和一种载体表现有关的一个单件关联起来。 @zh-hans
toolkit label: 载体表现的关联单件 @zh-hans
toolkit definition: 和一种载体表现有关的一个单件 @zh-hans
label: gösterimin ilgili kopyası ile ilişkilidir @tr
definition: Bir gösterimi, bir gösterimle ilişkili bir kopyayla ilişkilendirir. @tr
toolkit label: Anlatımla ilişkili kopya @tr
toolkit definition: Bir gösterimle bağlantılı olan bir kopya. @tr
label: tiene un elemento de manifestación relacionado @es
definition: Relaciona una manifestación con un elemento que está asociado con una manifestación. @es
has subproperty: has exemplar of manifestation

has media type
status: Published
definition: Relates a manifestation to a categorization that reflects the general type of intermediation device required to view, play, run, or otherwise access the content of a manifestation.
type: Property
domain: C10007
lexical alias: mediaType.en
instruction number: 3.2
toolkit label: media type
toolkit definition: A categorization that reflects the general type of intermediation device required to view, play, run, or otherwise access the content of a manifestation.
label: a pour type de média @fr
definition: Met une manifestation en relation avec une catégorisation qui indique le type général de dispositif de médiation requis pour visionner, faire fonctionner ou faire défiler le contenu d’une manifestation, ou y accéder d’une autre manière. @fr
toolkit label: type de média @fr
toolkit definition: Catégorisation qui indique le type général de dispositif de médiation requis pour visionner, faire fonctionner ou faire défiler le contenu d’une manifestation, ou y accéder d’une autre manière. @fr
toolkit label: tipo de medios @es
toolkit definition: Una categorización que refleja el tipo general del dispositivo de intermediación requerido para visualizar, reproducir, ejecutar o de alguna manera acceder al contenido de una manifestación. @es
label: har medietyp @sv
toolkit label: medietyp @sv
toolkit label: type medium @nl
toolkit definition: Een categorisatie die het algemene type weergeeft van het apparaat dat benodigd is om de content van een manifestatie in te zien, af te spelen, te starten of anderszins toegang te geven. @nl
label: có loại phương tiện @vi
definition: Liên kết biểu thị với chia loại phản ánh loại chung của thiết bị trung gian yêu cầu để xem, chơi, chạy, v.v..., nội dung của biểu thị. @vi
toolkit label: loại phương tiện @vi
toolkit definition: Chia loại phản ánh loại chung của thiết bị trung gian yêu cầu để xem, chơi, chạy, v.v..., nội dung của biểu thị. @vi
label: har medietype @da
definition: Relaterer en manifestation til en kategorisering, som generelt afspejler typen af formidlingsudstyr, som kræves for at tilgå en manifestations indhold. @da
toolkit label: medietype @da
toolkit definition: Kategorisering, som generelt afspejler typen af formidlingsudstyr, som kræves for at tilgå en manifestations indhold. @da
label: hat Medientyp @de
definition: Setzt eine Manifestation in Beziehung zu einer Kategorisierung, die die allgemeine Art des Hilfsmittels widerspiegelt, das erforderlich ist, um den Inhalt einer Manifestation anzuschauen, abzuspielen, laufen zu lassen oder anderweitig darauf zuzugreifen. @de
toolkit label: Medientyp @de
toolkit definition: Eine Kategorisierung, die die allgemeine Art des Hilfsmittels widerspiegelt, das erforderlich ist, um den Inhalt einer Manifestation anzuschauen, abzuspielen, laufen zu lassen oder anderweitig darauf zuzugreifen. @de
label: té com a tipus de suport @ca
definition: Relaciona una manifestació amb una categorització que reflecteix el tipus general de l’aparell de mediació requerit per visionar, reproduir, fer funcionar o accedir d’una altra manera el contingut d’una manifestació. @ca
toolkit label: tipus de suport @ca
toolkit definition: Categorització que reflecteix el tipus general de l’aparell de mediació requerit per visionar, reproduir, fer funcionar o accedir d’una altra manera el contingut d’una manifestació. @ca
definition: Liittää manifestaation kategorisointiin, joka ilmaisee manifestaation sisällön katsomiseen, toistamiseen, suorittamiseen tai muuhun toimintaan tarvittavan välittävän laitteen yleistä tyyppiä. @fi
toolkit label: mediatyyppi @fi
toolkit definition: Kategorisointi, joka ilmaisee manifestaation sisällön katsomiseen, toistamiseen, suorittamiseen tai muuhun toimintaan tarvittavan välittävän laitteen yleistä tyyppiä. @fi
toolkit definition: En inndeling som gjenspeiler den generelle typen overføringsenhet som kreves for å se, spille, kjøre, etc. innholdet i en manifestasjon. @no
label: έχει τύπο του μέσου μετάδοσης @el
definition: Συνδέει μια εκδήλωση με μια κατηγοριοποίηση που αντανακλά τον γενικό τύπο της ενδιάμεσης συσκευής που απαιτείται για τη θέαση, την αναπαραγωγή, τη ροή κ.λπ. του περιεχομένου μιας εκδήλωσης. @el
toolkit label: τύπος μέσου μετάδοσης @el
toolkit definition: Μια κατηγοριοποίηση που αντανακλά τον γενικό τύπο της ενδιάμεσης συσκευής που απαιτείται για τη θέαση, την αναπαραγωγή, τη ροή κ.λπ. του περιεχομένου μιας εκδήλωσης. @el
has element type: 4
label: médiatípusa a következő: @hu
definition: Hozzákapcsol egy megjelenési formát egy kategorizáláshoz, amely tükrözi a közvetítőkészülék általános típusát, amely egy megjelenési forma tartalmának megtekintéséhez, lejátszásához, futtatásához, vagy egyéb módú hozzáférhetőségéhez szükséges. @hu
toolkit label: médiatípusa: @hu
toolkit definition: Egy kategorizálás, amely tükrözi a közvetítőkészülék általános típusát, amely egy megjelenési forma tartalmának megtekintéséhez, lejátszásához, futtatásához, vagy egyéb módú hozzáférhetőségéhez szükséges. @hu
label: mediatyyppi @fi
definition: Relaterer en manifestasjon til en inndeling som gjenspeiler den generelle typen overføringsenhet som kreves for å se, spille, kjøre, etc. innholdet i en manifestasjon. @no
label: heeft type medium @nl
definition: Relateert een manifestatie aan een categorisatie die het algemene type weergeeft van het apparaat dat benodigd is om de content van een manifestatie in te zien, af te spelen, te starten of anderszins toegang te geven. @nl
label: له نوع الوسيط @ar
definition: يربط بين تجسيدة وفئة تعكس النوع العام للجهاز الوسيط المطلوب لعرض، أو تشغيل، أو الوصول إلى محتوى تجسيدة. @ar
toolkit label: نوع الوسيط @ar
toolkit definition: فئة تعكس النوع العام للجهاز الوسيط المطلوب لعرض، أو لتشغيل، إلخ. محتوى تجسيدة. @ar
label: meediumi tüüp @et
definition: Seostab kehastuse kategooriaga, mis väljendab vahendusseadme üldist tüüpi, mis on vajalik kehastuse sisu vaatamiseks, mängimiseks, käitamiseks vms. @et
toolkit label: meediumi tüüp @et
toolkit definition: Kategooria, mis väljendab vahendusseadme üldist tüüpi, mis on vajalik kehastuse sisu vaatamiseks, mängimiseks, käitamiseks vms. @et
label: ha come tipo di media @it
definition: Correla una manifestazione a una categorizzazione che indica il tipo generale di dispositivo di intermediazione necessario per vedere, riprodurre, azionare, etc. il contenuto di una manifestazione. @it
toolkit label: tipo di media @it
toolkit definition: Categorizzazione che indica il tipo generale di dispositivo di intermediazione necessario per vedere, riprodurre, azionare, etc. il contenuto di una manifestazione. @it
label: vides veids @lv
definition: Sasaista manifestāciju ar apzīmējumu, kas atspoguļo starpniekierīces veidu, kas nepieciešams, lai manifestācijas saturu apskatītu, spēlētu, izrādītu, u. tml. @lv
toolkit label: vides veids @lv
toolkit definition: Apzīmējums, kas atspoguļo starpniekierīces veidu, kas nepieciešams, lai manifestācijas saturu apskatītu, spēlētu, izrādītu, u. tml. @lv
label: 有媒介类型 @zh-hans
definition: 将一种载体表现与反映载体表现内容的浏览、播放、运行或其他存取方式等所需中间设备的一般类型的分类关联起来。 @zh-hans
toolkit label: 媒介类型 @zh-hans
toolkit definition: 反映载体表现内容的浏览、播放、运行或其他存取方式等所需中间设备的一般类型的分类 @zh-hans
label: ortam türü ile ilişkilidir @tr
definition: Bir gösterimi, bir gösterimin içeriğini görüntülemek, oynatmak, çalıştırmak veya başka bir şekilde erişmek için gereken aracı aygıtın genel tipini yansıtan bir katergorize etmeyle ilişkilendirir. @tr
toolkit label: ortam türü @tr
toolkit definition: Bir gösterimin içeriğini görüntülemek, oynatmak, çalıştırmak veya başka bir şekilde erişmek için gereken aracı aygıtın genel türünü yansıtan bir sınıflandırma. @tr
label: tiene tipo de medios @es
definition: Relaciona una manifestación con una categorización que refleja el tipo general del dispositivo de intermediación requerido para visualizar, reproducir, ejecutar o de alguna manera acceder al contenido de una manifestación. @es
has subproperty: P30002

has key title (Deprecated)
status: Deprecated
definition: Relates a manifestation to a title that is unique assigned to a manifestation by an ISSN registration agency. (Deprecated)
type: Property
domain: C10007
sub property of: has title of manifestation
lexical alias: keyTitle.en
instruction number: 2.3.9
toolkit label: key title (Deprecated)
toolkit definition: A title that is unique assigned to a manifestation by an ISSN registration agency. (Deprecated)
label: a pour titre-clé @fr
definition: Met une manifestation en relation avec un nom unique attribué à une manifestation par une agence d’enregistrement de l’ISSN. @fr
toolkit label: titre-clé @fr
toolkit definition: Nom unique attribué à une manifestation par une agence d’enregistrement de l’ISSN. @fr
toolkit label: título clave @es
toolkit definition: El nombre único asignado a un recurso por una agencia de registro del ISSN. @es
label: har nyckeltitel @sv
toolkit label: nyckeltitel @sv
toolkit label: key title @nl
toolkit definition: Een unieke naam aan een resource toegekend door een ISSN-registratiebureau. @nl
label: có nhan đề khoá @vi
definition: Liên kết biểu thị với tên duy nhất được cơ quan đăng ký ISSN gán cho biểu thị. @vi
toolkit label: nhan đề khoá @vi
toolkit definition: Tên duy nhất được cơ quan đăng ký ISSN gán cho biểu thị. @vi
label: har nøgletitel @da
definition: Relaterer en manifestation til et unikt navn, der gives til en manifestation af et ISSN-registreringsorgan. @da
toolkit label: nøgletitel @da
toolkit definition: Unikt navn, der gives til en manifestation af et ISSN-registreringsorgan. @da
label: hat Key Title @de
definition: Setzt eine Manifestation mit einer eindeutigen Bezeichnung, die einer Manifestation durch eine ISSN-Registrierungsstelle zugewiesen wird, in Beziehung. @de
toolkit label: Key Title @de
toolkit definition: Eine eindeutige Bezeichnung, die einer Manifestation durch eine ISSN-Registrierungsstelle zugewiesen wird. @de
label: té com a títol clau @ca
definition: Relaciona una manifestació amb un nom únic assignat a una manifestació per una agència de registre de l’ISSN. @ca
toolkit label: títol clau @ca
toolkit definition: Nom únic assignat a una manifestació per una agència de registre de l’ISSN. @ca
label: avainnimeke @fi
definition: Liittää manifestaation ISSN-rekisteröintiyksikön manifestaatiolle antamaan yksilölliseen nimeen. @fi
toolkit label: avainnimeke @fi
toolkit definition: ISSN-rekisteröintiyksikön manifestaatiolle antama yksilöllinen nimi. @fi
toolkit label: nøkkeltittel @no
toolkit definition: Et entydig navn tildelt en manifestasjon av et ISSN-kontor. @no
label: έχει τίτλο κλειδί @el
definition: Συνδέει μια εκδήλωση με ένα μοναδικό όνομα που ανατίθεται σε μια εκδήλωση από έναν φορέα απόδοσης του ISSN. @el
toolkit label: τίτλος κλειδί @el
toolkit definition: Ένα μοναδικό όνομα που ανατίθεται σε μια εκδήλωση από έναν φορέα απόδοσης του ISSN. @el
has element type: 2
label: van kulcscíme @hu
definition: Egy megjelenési formát hozzákapcsol egy egyedi névhez, amelyet egy ISSN regisztrációs ügynökség utal ki egy megjelenési formának. @hu
toolkit label: kulcscím @hu
toolkit definition: Egy egyedi név, amelyet egy ISSN regisztrációs ügynökség utal ki egy megjelenési formának. @hu
has subproperty: P30209

has special issue (Deprecated)
status: Deprecated
definition: Relates a manifestation to a manifestation that consists of a single issue or a supplementary section of a periodical or newspaper devoted to a special subject, with or without serial numbering. (Deprecated)
type: Property
domain: C10007
sub property of: has part manifestation
lexical alias: specialIssue.en
toolkit label: special issue (Deprecated)
toolkit definition: A manifestation that consists of a single issue or a supplementary section of a periodical or newspaper devoted to a special subject, with or without serial numbering. (Deprecated)
label: a pour numéro spécial @fr
definition: Met une manifestation en relation avec une manifestation qui consiste en un numéro isolé ou en un supplément d’une publication en série ou d’un journal consacré à un sujet spécifique, avec ou sans numérotation séquentielle. @fr
toolkit label: numéro spécial @fr
toolkit definition: Manifestation qui consiste en un numéro isolé ou en un supplément d’une publication en série ou d’un journal consacré à un sujet spécifique, avec ou sans numérotation séquentielle. @fr
toolkit label: número especial @es
toolkit definition: Una manifestación que contiene un número o sección suplementaria de una publicación seriada o periódico dedicada a un tema especial. @es
instruction number: 24.5
toolkit label: speciaal nummer @nl
toolkit definition: Een manifestatie die bestaat uit een enkele aflevering of een supplementair onderdeel van een tijdschrift of krant, gewijd aan een speciaal onderwerp, al dan niet met volgnummering. @nl
label: là số đặc biệt @vi
definition: Liên kết biểu thị với biểu thị có chứa số đơn lẻ hoặc phần phụ bản của ấn phẩm định kỳ hoặc báo dành cho chủ đề đặc biệt, có hoặc không đánh số ấn phẩm nhiều kỳ. @vi
toolkit label: số đặc biệt @vi
toolkit definition: Biểu thị có chứa số đơn lẻ hoặc phần phụ bản của ấn phẩm định kỳ hoặc báo dành cho chủ đề đặc biệt, có hoặc không đánh số ấn phẩm nhiều kỳ. @vi
label: har særnummer @da
definition: Relaterer en manifestation til en manifestation, der består af et enkelt nummer eller et tillæg til et periodikum eller en avis, helliget et bestemt emne og med eller uden nummerering. @da
toolkit label: særnummer @da
toolkit definition: Manifestation, der består af et enkelt nummer eller et tillæg til et periodikum eller en avis, helliget et bestemt emne og med eller uden nummerering. @da
label: hat Sonderausgabe @de
definition: Setzt eine Manifestation mit einer Manifestation, die aus einem Einzelheft oder einer ergänzenden Untergliederung einer fortlaufenden Ressource oder einer Zeitung besteht, das/die einem speziellen Thema gewidmet ist, mit oder ohne fortlaufende Zählung, in Beziehung. @de
toolkit label: Sonderausgabe @de
toolkit definition: Eine Manifestation, die aus einem Einzelheft oder einer ergänzenden Untergliederung einer fortlaufenden Ressource oder einer Zeitung besteht, das/die einem speziellen Thema gewidmet ist, mit oder ohne fortlaufende Zählung. @de
label: és número especial @ca
definition: Relaciona una manifestació amb una manifestació que consisteix en un número sol o un suplement d’una publicació en sèrie o un diari dedicat a un tema especial, amb o sense numeració. @ca
toolkit definition: Manifestació que consisteix en un número sol o un suplement d’una publicació en sèrie o un diari dedicat a un tema especial, amb o sense numeració. @ca
label: erikoisnumero @fi
definition: Liittää manifestaation manifestaatioon, joka on sarja-aineiston numero tai täydentävä osa, joka keskittyy tiettyyn aiheeseen, ja se voi olla numeroitu tai numeroimaton. @fi
toolkit label: erikoisnumero @fi
toolkit definition: Manifestaatio, joka on sarja-aineiston numero tai täydentävä osa, joka keskittyy tiettyyn aiheeseen, ja se voi olla numeroitu tai numeroimaton. @fi
toolkit label: spesialutgave @no
toolkit definition: En manifestasjon som består av en enkeltutgave eller et bilag til et tidsskrift eller en avis som handler om et bestemt emne, kan være nummerert som periodika eller ikke. @no
label: είναι ειδική έκδοση @el
definition: Συνδέει μια εκδήλωση με μια εκδήλωση που συνίσταται από ένα μοναδικό τεύχος ή ένα συμπληρωματικό τμήμα ενός περιοδικού ή μιας εφημερίδας που αφιερώνεται σε ένα ειδικό θέμα, με ή χωρίς σειριακή αρίθμηση. @el
toolkit label: ειδική έκδοση @el
toolkit definition: Μια εκδήλωση που συνίσταται από ένα μοναδικό τεύχος ή ένα συμπληρωματικό τμήμα ενός περιοδικού ή μιας εφημερίδας που αφιερώνεται σε ένα ειδικό θέμα, με ή χωρίς σειριακή αρίθμηση. @el
has element type: 2
label: különkiadás @hu
definition: Egy megjelenési formát hozzákapcsol egy olyan megjelenési formához, amely egy speciális tárgynak szentelt periodika vagy újság egyetlen számából vagy melléklapjából áll, sorozati számmal vagy anélkül. @hu
toolkit label: különszám @hu
toolkit definition: Egy megjelenési forma, amely egy periodika vagy újság egy speciális tárgynak szentelt egyetlen számából vagy különszámából áll sorozati számozással vagy anélkül. @hu
has subproperty: P30030

is special issue of (Deprecated)
status: Deprecated
definition: Relates a manifestation to a periodical or newspaper containing a single issue or a supplementary section devoted to a special subject, with or without serial numbering. (Deprecated)
type: Property
domain: C10007
sub property of: is part of manifestation
lexical alias: specialIssueOf.en
toolkit label: special issue of (Deprecated)
toolkit definition: A periodical or newspaper containing a single issue or a supplementary section devoted to a special subject, with or without serial numbering. (Deprecated)
label: est un numéro spécial de @fr
definition: Met une manifestation en relation avec une publication en série ou un journal qui contient un numéro isolé ou un supplément consacré à un sujet spécifique, avec ou sans numérotation séquentielle. @fr
toolkit label: numéro spécial de @fr
toolkit definition: Publication en série ou journal qui contient un numéro isolé ou un supplément consacré à un sujet spécifique, avec ou sans numérotation séquentielle. @fr
toolkit label: número especial de @es
toolkit definition: Una publicación seriada o periódico que contiene un número único o sección suplementaria dedicada a un tema especial, con o sin numeración seriada, tal como un número de aniversario de un periódico o revista. @es
instruction number: 24.5
toolkit label: speciale aflevering van @nl
toolkit definition: Een tijdschrift of krant bevattende een enkele aflevering of een supplement gewijd aan een speciaal onderwerp, met of zonder volgnummering. @nl
label: là số đặc biệt của @vi
definition: Liên kết biểu thị với ấn phẩm định kỳ hoặc báo có chứa số đơn lẻ hoặc phần phụ bản dành cho chủ đề đặc biệt, có hoặc không đánh số ấn phẩm nhiều kỳ. @vi
toolkit label: số đặc biệt của @vi
toolkit definition: ấn phẩm định kỳ hoặc báo có chứa số đơn lẻ hoặc phần phụ bản dành cho chủ đề đặc biệt, có hoặc không đánh số ấn phẩm nhiều kỳ. @vi
label: er særnummer af @da
definition: Relaterer en manifestation til et periodikum eller avis, der indeholder et enkelt nummer eller et tillæg helliget et bestemt emne, med eller uden periodikanummerering. @da
toolkit label: særnummer af @da
toolkit definition: Periodikum eller avis, der indeholder et enkelt nummer eller et tillæg helliget et bestemt emne, med eller uden periodikanummerering. @da
label: ist Sonderausgabe von @de
definition: Setzt eine Manifestation mit einer fortlaufenden Ressource oder einer Zeitung, die ein Einzelheft oder eine ergänzende Untergliederung enthält, das/die einem speziellen Thema gewidmet ist, mit oder ohne fortlaufende Zählung, in Beziehung. @de
toolkit label: Sonderausgabe von @de
toolkit definition: Eine fortlaufende Ressource oder eine Zeitung, die ein Einzelheft oder eine ergänzende Untergliederung enthält, das/die einem speziellen Thema gewidmet ist, mit oder ohne fortlaufende Zählung. @de
label: és número especial de @ca
definition: Relaciona una manifestació amb una publicació en sèrie o diari que conté un número sol o un suplement dedicat a un tema especial, amb o sense numeració. @ca
toolkit definition: Publicació en sèrie o diari que conté un número sol o un suplement dedicat a un tema especial, amb o sense numeració. @ca
label: erikoisnumero aineistoon @fi
definition: Liittää manifestaation sarja-aineistoon, jonka numero tai täydentävä osa kuvailun kohde on. Erikoisnumero keskittyy usein tiettyyn aiheeseen, ja se voi olla numeroitu tai numeroimaton. @fi
toolkit label: erikoisnumero aineistoon @fi
toolkit definition: Sarja-aineisto, jonka numero tai täydentävä osa kuvailun kohde on. Erikoisnumero keskittyy usein tiettyyn aiheeseen, ja se voi olla numeroitu tai numeroimaton. @fi
toolkit label: spesialutgave av @no
toolkit definition: Et tidsskrift eller en avis som inneholder en enkeltutgave eller et bilag som handler om et bestemt emne, kan være nummerert som periodika eller ikke. @no
label: είναι ειδική έκδοση του @el
definition: Συνδέει μια εκδήλωση με ένα περιοδικό ή μια εφημερίδα που περιέχει ένα μοναδικό τεύχος ή ένα συμπληρωματικό τμήμα που αφιερώνεται σε ένα ειδικό θέμα, με ή χωρίς περιοδική αρίθμηση. @el
toolkit label: ειδική έκδοση του @el
toolkit definition: Ένα περιοδικό ή μια εφημερίδα που περιέχει ένα μοναδικό τεύχος ή ένα συμπληρωματικό τμήμα που αφιερώνεται σε ένα ειδικό θέμα, με ή χωρίς περιοδική αρίθμηση. @el
has element type: 2
label: különszáma @hu
definition: Egy megjelenési formát hozzákapcsol egy folytatódó dokumentumhoz vagy újsághoz, amely egy speciális témának szentelt számot vagy szupplementumot tartalmaz sorozatszámozással vagy anélkül. @hu
toolkit label: különszáma @hu
toolkit definition: Egy periodika vagy újság, amely egy speciális tárgynak szentelt egyetlen számot vagy szupplementumot tartalmaz sorozati számozással vagy anélkül. @hu
has subproperty: P30101

has last alphanumeric designation of alternative sequence
status: Published
definition: Relates a manifestation to a nomen that is a designation in the form of numbers or alphabetic characters that is used to indicate the last in a concurrent sequence of numbering of the parts or iterations of a manifestation.
type: Property
domain: C10007
lexical alias: lastAlphanumericDesignationOfAlternativeSequence.en
instruction number: 2.6.8
toolkit label: last alphanumeric designation of alternative sequence
toolkit definition: A nomen that is a designation in the form of numbers or alphabetic characters that is used to indicate the last in a concurrent sequence of numbering of the parts or iterations of a manifestation.
label: a pour dernière désignation alphanumérique d’une autre séquence @fr
definition: Met une manifestation en relation avec un nomen qui est une désignation sous forme de nombres ou de caractères alphabétiques servant à indiquer la dernière partie ou itération dans une séquence concomitante de numérotation des parties ou itérations d’une manifestation. @fr
toolkit label: dernière désignation alphanumérique d’une autre séquence @fr
toolkit definition: Nomen qui est une désignation sous forme de nombres ou de caractères alphabétiques servant à indiquer la dernière partie ou itération dans une séquence concomitante de numérotation des parties ou itérations d’une manifestation. @fr
toolkit label: última designación alfanumérica de secuencia alternativa @es
toolkit definition: Un nomen que es una designación en forma de números o caracteres alfabéticos que se utiliza para indicar el último en una secuencia concurrente de numeración de las partes o iteraciones de una manifestación. @es
label: har alternativ numerisk och/eller alfabetisk beteckning för sista numret/delen i svit @sv
toolkit label: alternativ numerisk och/eller alfabetisk beteckning för sista numret/delen i svit @sv
toolkit label: laatste alfanumerieke aanduiding van alternatieve reeks @nl
toolkit definition: Een nomen dat is een aanduiding in de vorm van nummers of alfabetische karakters die gebruikt is om de laatste aan te geven in een opeenvolgende volgorde van nummering van de delen of iteraties van een manifestatie. @nl
label: có định danh con số hoặc chữ lựa chọn của số hoặc phần cuối cùng của chuỗi @vi
definition: Liên kết biểu thị với hệ thống thứ hai hoặc tiếp theo của đánh số được trình bày dưới hình thái con số hoặc chữ trên số hoặc phần cuối cùng của chuỗi đánh số đối với ấn phẩm nhiều kỳ. @vi
toolkit label: định danh con số hoặc chữ lựa chọn của số hoặc phần cuối cùng của chuỗi @vi
toolkit definition: Hệ thống thứ hai hoặc tiếp theo của đánh số được trình bày dưới hình thái con số hoặc chữ trên số hoặc phần cuối cùng của chuỗi đánh số đối với ấn phẩm nhiều kỳ. @vi
label: har sidste alfanummeriske betegnelse for alternativ rækkefølge @da
definition: Relaterer en manifestation til en betegnelse i form af numre eller skrifttegn, som anvendes til at indikere den sidste i en fortløbende rækkefølgenummerering af delene eller iterationer af en manifestation. @da
toolkit label: sidste alfanummeriske betegnelse for alternativ rækkefølge @da
toolkit definition: Betegnelse i form af numre eller skrifttegn, som anvendes til at indikere den sidste i en fortløbende rækkefølgenummerering af delene eller iterationer af en manifestation. @da
label: hat alternative alphanumerische Bezeichnung der letzten Ausgabe einer fortlaufenden Ressource @de
definition: Setzt eine Manifestation in Beziehung zu einer Bezeichnung in Form von Nummern oder Buchstaben, die verwendet wird, um in einer alternativen Zählfolge der Ausgaben einer Manifestation auf die letzte hinzuweisen. @de
toolkit label: Alternative alphanumerische Bezeichnung der letzten Ausgabe einer fortlaufenden Ressource @de
toolkit definition: Eine Bezeichnung in Form von Nummern oder Buchstaben, die verwendet wird, um in einer alternativen Zählfolge der Ausgaben einer Manifestation auf die letzte hinzuweisen. @de
label: té com a darrera designació alfanumèrica d’una seqüència alternativa @ca
definition: Relaciona una manifestació amb un nomen que és una designació en la forma de números o caràcters alfabètics que s’usa per indicar la darrera de les parts o les iteracions en una seqüència de numeració concurrent d’una manifestació. @ca
toolkit label: darrera designació alfanumèrica d’una seqüència alternativa @ca
toolkit definition: Nomen que és una designació en la forma de números o caràcters alfabètics que s’usa per indicar la darrera de les parts o les iteracions en una seqüència de numeració concurrent d’una manifestació. @ca
definition: Liittää manifestaation nomeniin, joka on numeroista tai kirjaimista muodostuva määrite, joka on manifestaation osien tai iteraatioiden rinnakkaisen numerointijakson viimeinen määrite. @fi
toolkit label: vaihtoehtoisen numerointijakson viimeinen numero- tai kirjainmäärite @fi
toolkit definition: Nomen, joka on numeroista tai kirjaimista muodostuva määrite, joka on manifestaation osien tai iteraatioiden rinnakkaisen numerointijakson viimeinen määrite. @fi
toolkit label: siste alfanumeriske betegnelse for alternativ sekvens @no
toolkit definition: En betegnelse i form av numeriske eller alfabetiske tegn som brukes til å indikere den siste i en fortløpende sekvens av nummerering av deler eller versjoner av en manifestasjon. @no
label: έχει εναλλακτικό αριθμητικό ή/και αλφαβητικό προσδιορισμό του τελευταίου τεύχους ή μέρους της ακολουθίας @el
definition: Συνδέει μια εκδήλωση με ένα δεύτερο ή διαδοχικό σύστημα αρίθμησης που παρουσιάζεται σε αριθμητική ή/και αλφαβητική μορφή στο τελευταίο τεύχος ή μέρος μιας αριθμητικής ακολουθίας για ένα περιοδικό. @el
toolkit label: εναλλακτικός αριθμητικός ή/και αλφαβητικός προσδιορισμός του τελευταίου τεύχους ή μέρους της ακολουθίας @el
toolkit definition: Ένα δεύτερο ή διαδοχικό σύστημα αρίθμησης που παρουσιάζεται σε αριθμητική ή/και αλφαβητική μορφή στο τελευταίο τεύχος ή μέρος μιας αριθμητικής ακολουθίας για ένα περιοδικό. @el
label: alternatív sorrendiségének alfanumerikus zárójelölése a következő: @hu
definition: Hozzákapcsol egy megjelenési formát egy nomenhez, amelynek megjelölése számok vagy alfabetikus karakterek formájában jelzi az utolsót egy megjelenési forma részeinek vagy iterációinak konkurens számozási sorrendjében. @hu
toolkit label: alternatív sorrendiségének alfanumerikus zárójelölése: @hu
toolkit definition: Egy nomen, amelynek megjelölése számok vagy alfabetikus karakterek formájában jelzi az utolsót egy megjelenési forma részeinek vagy iterációinak konkurens számozási sorrendjében. @hu
alternative label: alternative numeric and/or alphabetic designation of last issue or part of sequence
alternative label: numerointijakson viimeisen numeron tai osan vaihtoehtoinen numero- tai kirjainmäärite @fi
label: vaihtoehtoisen numerointijakson viimeinen numero- tai kirjainmäärite @fi
label: har siste alfanumeriske betegnelse for alternativ sekvens @no
definition: Relaterer en manifestasjon til en betegnelse i form av numeriske eller alfabetiske tegn som brukes til å indikere den siste i en fortløpende sekvens av nummerering av deler eller versjoner av en manifestasjon. @no
alternative label: alternativ numerisk og/eller alfabetisk betegnelse for siste hefte eller del av en sekvens @no
sub property of: has last alphanumeric designation of sequence
alternative label: autre désignation numérique et/ou alphabétique de la dernière livraison ou partie d’une séquence @fr
label: heeft laatste alfanumerieke aanduiding van alternatieve reeks @nl
definition: Relateert een manifestatie aan een nomen dat is een aanduiding in de vorm van nummers of alfabetische karakters die gebruikt is om de laatste aan te geven in een opeenvolgende volgorde van nummering van de delen of iteraties van een manifestatie. @nl
label: له تسمية رقمية أخيرة لتسلسل بديل @ar
definition: يربط بين تجسيدة وتسمية في شكل أرقام أو حروف هجائية مستخدمة لتشير إلى تسلسل الترقيم الأخير للأجزاء أو الأعداد لتجسيدة. @ar
alternative label: بديل تسمية رقمي و/أو الهجائية للعدد أو الجزء الأخير فى التسلسل. @ar
toolkit label: تسمية رقمية أخيرة لتسلسل بديل @ar
toolkit definition: تسمية في شكل أرقام أو حروف هجائية مستخدمة لتشير إلى تسلسل الترقيم الأخير للأجزاء أو الأعداد لتجسيدة. @ar
alternative label: designació numèrica i/o alfabètica alternativa del darrer número o darrera part d’una seqüència @ca
alternative label: alternativ numerisk og/eller alfabetisk betegnelse for sidste nummer eller del af en rækkefølge @da
label: alternatiivse nummerduse viimane tähtnumbriline tähistus @et
definition: Seostab kehastuse numbritest või tähtedest koosneva tähistusega, mis on kehastuse osade või seisude alternatiivse nummerduse viimane tähistus. @et
toolkit label: alternatiivse nummerduse viimane tähtnumbriline tähistus @et
toolkit definition: Numbritest või tähtedest koosnev tähistus, mis on kehastuse osade või seisude alternatiivse nummerduse viimane tähistus. @et
alternative label: egy alternatív sorrendiség utolsó számának vagy részének számmal és/vagy betűkkel megjelenített jelölése: @hu
label: ha come ultima designazione alfanumerica di sequenza alternativa @it
definition: Correla una manifestazione a una designazione in forma numerica e/o alfabetica, utilizzata per indicare l'ultima in una sequenza concomitante di numerazione delle parti o iterazioni di una manifestazione. @it
alternative label: designazione numerica e/o alfabetica alternativa dell'ultimo fascicolo o parte della sequenza @it
toolkit label: ultima designazione alfanumerica di sequenza alternativa @it
toolkit definition: Designazione in forma numerica e/o alfabetica, utilizzata per indicare l'ultima in una sequenza concomitante di numerazione delle parti o iterazioni di una manifestazione. @it
label: secības pēdējais burtciparu alternatīvais apzīmējums @lv
definition: Sasaista manifestāciju ar nomenu, kas ir alternatīvais apzīmējums ciparu vai alfabēta burtu veidā, kas lietots, lai norādītu pēdējā laidiena secīgo daļu vai manifestācijas atkārtojumu. @lv
toolkit label: secības pēdējais burtciparu alternatīvais apzīmējums @lv
toolkit definition: Alternatīvais apzīmējums ciparu vai alfabēta burtu veidā, kas lietots, lai norādītu pēdējā laidiena secīgo daļu vai manifestācijas atkārtojumu. @lv
alternative label: Alternative alphanumerische Bezeichnung der letzten Ausgabe einer fortlaufenden Ressource @de
has element type: 3

has last alphanumeric designation of sequence
status: Published
definition: Relates a manifestation to a nomen that is a designation in the form of numbers or alphabetic characters that is used to indicate the last in a sequence of numbering of the parts or iterations of a manifestation.
type: Property
domain: C10007
lexical alias: lastAlphanumericDesignationOfSequence.en
instruction number: 2.6.4
toolkit label: last alphanumeric designation of sequence
toolkit definition: A nomen that is a designation in the form of numbers or alphabetic characters that is used to indicate the last in a sequence of numbering of the parts or iterations of a manifestation.
label: a pour dernière désignation alphanumérique d’une séquence @fr
definition: Met une manifestation en relation avec un nomen qui est une désignation sous forme de nombres ou de caractères alphabétiques servant à indiquer la dernière partie ou itération dans une séquence de numérotation des parties ou itérations d’une manifestation. @fr
toolkit label: dernière désignation alphanumérique d’une séquence @fr
toolkit definition: Nomen qui est une désignation sous forme de nombres ou de caractères alphabétiques servant à indiquer la dernière partie ou itération dans une séquence de numérotation des parties ou itérations d’une manifestation. @fr
toolkit label: última designación alfanumérica de secuencia @es
toolkit definition: Un nomen que es una designación en forma de números o caracteres alfabéticos que se utiliza para indicar el último en una secuencia de numeración de las partes o iteraciones de una manifestación. @es
label: har numerisk och/eller alfabetisk beteckning för sista numret/delen i svit @sv
toolkit label: numerisk och/eller alfabetisk beteckning för sista numret/delen i svit @sv
toolkit label: laatste alfanumerieke aanduiding van reeks @nl
toolkit definition: Een nomen dat is een aanduiding in de vorm van nummers of alfabetische tekens die is gebruikt om aan te geven de laatste in een reeks van nummering van de delen of iteraties van een manifestatie. @nl
label: định danh con số hoặc chữ của số hoặc phần cuối cùng của chuỗi @vi
definition: Liên kết biểu thị với định danh dưới hình thái con số và/hoặc chữ được trình bày trên số hoặc phần cuối cùng trong chuỗi đánh số. @vi
toolkit label: định danh con số hoặc chữ của số hoặc phần cuối cùng của chuỗi @vi
toolkit definition: Định danh dưới hình thái con số và/hoặc chữ được trình bày trên số hoặc phần cuối cùng trong chuỗi đánh số. @vi
label: har sidste alfanumeriske betegnelse af rækkefølge @da
definition: Relaterer en manifestation til en betegnelse i form af numre eller skrifttegn, som anvendes til at indikere den sidste i en rækkefølgenummerering af delene eller iterationer af en manifestation. @da
toolkit label: sidste alfanumeriske betegnelse af rækkefølge @da
toolkit definition: Betegnelse i form af numre eller skrifttegn, som anvendes til at indikere den sidste i en rækkefølgenummerering af delene eller iterationer af en manifestation. @da
label: hat alphanumerische Bezeichnung der letzten Ausgabe einer fortlaufenden Ressource @de
definition: Setzt eine Manifestation in Beziehung zu einer Bezeichnung in Form von Nummern oder Buchstaben, die verwendet wird, um in einer Zählfolge der Ausgaben einer Manifestation auf die letzte hinzuweisen. @de
toolkit label: Alphanumerische Bezeichnung der letzten Ausgabe einer fortlaufenden Ressource @de
toolkit definition: Eine Bezeichnung in Form von Nummern oder Buchstaben, die verwendet wird, um in einer Zählfolge der Ausgaben einer Manifestation auf die letzte hinzuweisen. @de
label: té com a darrera designació alfanumèrica d’una seqüència @ca
definition: Relaciona una manifestació amb un nomen que és una designació en la forma de números o caràcters alfabètics que s’usa per indicar la darrera de les parts o les iteracions en una seqüència de numeració d’una manifestació. @ca
toolkit label: darrera designació alfanumèrica d’una seqüència @ca
toolkit definition: Nomen que és una designació en la forma de números o caràcters alfabètics que s’usa per indicar la darrera de les parts o les iteracions en una seqüència de numeració d’una manifestació. @ca
definition: Liittää manifestaation nomeniin, joka on numeroista tai kirjaimista muodostuva määrite, joka ilmaisee manifestaation osien tai iteraatioiden numerointijakson viimeisen määritteen. @fi
toolkit label: numerointijakson viimeinen numero- ja/tai kirjainmäärite @fi
toolkit definition: Nomen, joka on numeroista tai kirjaimista muodostuva määrite, joka ilmaisee manifestaation osien tai iteraatioiden numerointijakson viimeisen määritteen. @fi
toolkit label: siste alfanumeriske betegnelse for sekvens @no
toolkit definition: En betegnelse i form av numeriske eller alfabetiske tegn som brukes til å indikere den siste i en sekvens av nummerering av deler eller versjoner av en manifestasjon. @no
label: έχει αριθμητικό ή και αλφαβητικό προσδιορισμό του τελευταίου τεύχους ή μέρους της ακολουθίας @el
definition: Συνδέει μια εκδήλωση με έναν προσδιορισμό σε αριθμητική ή/και αλφαβητική μορφή που παρουσιάζεται στο τελευταίο τεύχος ή μέρος ενός περιοδικού που εκδίδεται σε μια αριθμητική ακολουθία. @el
toolkit label: αριθμητικός ή/και αλφαβητικός προσδιορισμός του τελευταίου τεύχους ή μέρους της ακολουθίας @el
toolkit definition: Ένας προσδιορισμός σε αριθμητική ή/και αλφαβητική μορφή που παρουσιάζεται στο τελευταίο τεύχος ή μέρος ενός περιοδικού που εκδίδεται σε μια αριθμητική ακολουθία. @el
label: sorrendiségének alfanumerikus zárójelölése a következő: @hu
definition: Hozzákapcsol egy megjelenési formát egy nomenhez, amely megjelölésként számok vagy alfabetikus karakterek formájában jelzi az utolsót egy megjelenési forma részeinek vagy iterációinak számozási sorrendjében. @hu
toolkit label: sorrendiségének alfanumerikus zárójelölése: @hu
toolkit definition: Egy nomen, amely megjelölésként számok vagy alfabetikus karakterek formájában jelzi az utolsót egy megjelenési forma részeinek vagy iterációinak számozási sorrendjében. @hu
alternative label: numeric and/or alphabetic designation of last issue or part of sequence
alternative label: numerointijakson viimeisen numeron tai osan numero- ja/tai kirjainmäärite @fi
label: numerointijakson viimeinen numero- ja/tai kirjainmäärite @fi
label: har siste alfanumeriske betegnelse for sekvens @no
definition: Relaterer en manifestasjon til en betegnelse i form av numeriske eller alfabetiske tegn som brukes til å indikere den siste i en sekvens av nummerering av deler eller versjoner av en manifestasjon. @no
alternative label: numerisk og/eller alfabetisk betegnelse for siste hefte eller del @no
sub property of: has related nomen of manifestation
alternative label: désignation numérique et/ou alphabétique de la dernière livraison ou partie d’une séquence @fr
label: heeft laatste alfanumerieke aanduiding van reeks @nl
definition: Relateert een manifestatie aan een nomen dat is een aanduiding in de vorm van nummers of alfabetische tekens die is gebruikt om aan te geven de laatste in een reeks van nummering van de delen of iteraties van een manifestatie. @nl
label: له تسمية رقمية أخيرة لتسلسل @ar
definition: يربط بين تجسيدة وتسمية في شكل أرقام أو حروف هجائية مستخدمة لتشير إلى الترقيم الأخير للأجزاء أو الأعداد لتجسيدة. @ar
alternative label: تسمية رقمية و/أو هجائية لعدد أخير أو جزء أخير من تسلسل @ar
toolkit label: تسمية رقمية أخيرة لتسلسل @ar
toolkit definition: تسمية في شكل أرقام أو حروف هجائية مستخدمة لتشير إلى الترقيم الأخير للأجزاء أو الأعداد لتجسيدة. @ar
alternative label: designació numèrica i/o alfabètica del darrer número o darrera part d’una seqüència @ca
alternative label: numerisk og/eller alfabetisk betegnelse for sidste nummer eller del af rækkefølge @da
label: nummerduse viimane tähtnumbriline tähistus @et
definition: Seostab kehastuse numbritest või tähtedest koosneva tähistusega, mis on kehastuse osade või seisude nummerduse viimane tähistus. @et
toolkit label: nummerduse viimane tähtnumbriline tähistus @et
toolkit definition: Numbritest või tähtedest koosnev tähistus, mis on kehastuse osade või seisude nummerduse viimane tähistus. @et
alternative label: egy sorrendiség utolsó számának vagy részének számmal és/vagy betűkkel megjelenített jelölése: @hu
label: ha come ultima designazione alfanumerica della sequenza @it
definition: Correla una manifestazione a una designazione espressa con numeri o caratteri alfabetici, utilizzata per indicare l'ultima in una sequenza di numerazione delle parti o iterazioni di una manifestazione. @it
alternative label: designazione numerica e/o alfabetica dell'ultimo fascicolo o parte della sequenza @it
toolkit label: ultima designazione alfanumerica della sequenza @it
toolkit definition: Designazione in forma di numeri o caratteri alfabetici, utilizzata per indicare l'ultima in una sequenza di numerazione delle parti o iterazioni di una manifestazione. @it
label: secības pēdējais burtciparu apzīmējums @lv
definition: Sasaista manifestāciju ar nomenu, kas ir apzīmējums ciparu vai alfabēta burtu veidā, kas lietots, lai norādītu pēdējā laidiena secīgo daļu vai manifestācijas atkārtojumu. @lv
toolkit label: secības pēdējais burtciparu apzīmējums @lv
toolkit definition: Apzīmējums ciparu vai alfabēta burtu veidā, kas lietots, lai norādītu pēdējā laidiena secīgo daļu vai manifestācijas atkārtojumu. @lv
alternative label: Alphanumerische Bezeichnung der letzten Ausgabe oder des letzten Teils einer Folge @de
has element type: 3

has last chronological designation of alternative sequence
status: Published
definition: Relates a manifestation to a nomen that is a designation in the form of a date or other timespan that is used to indicate the last in a concurrent sequence of numbering of the parts or iterations of a manifestation.
type: Property
domain: C10007
lexical alias: lastChronologicalDesignationOfAlternativeSequence.en
instruction number: 2.6.9
toolkit label: last chronological designation of alternative sequence
toolkit definition: A nomen that is a designation in the form of a date or other timespan that is used to indicate the last in a concurrent sequence of numbering of the parts or iterations of a manifestation.
label: a pour dernière désignation chronologique d’une autre séquence @fr
definition: Met une manifestation en relation avec un nomen qui est une désignation sous forme de date ou d’un autre laps de temps servant à indiquer la dernière partie ou itération dans une séquence de numérotation concomitante des parties ou itérations d’une manifestation. @fr
toolkit label: dernière désignation chronologique d’une autre séquence @fr
toolkit definition: Nomen qui est une désignation sous forme de date ou d’un autre laps de temps servant à indiquer la dernière partie ou itération dans une séquence de numérotation concomitante des parties ou itérations d’une manifestation. @fr
toolkit label: última designación cronológica de secuencia alternativa @es
toolkit definition: Un nomen que es una designación en forma de fecha u otro período de tiempo que se utiliza para indicar el último en una secuencia concurrente de numeración de las partes o iteraciones de una manifestación. @es
scope note: A designation includes a year; year and month; month, day, and year. A chronological designation of alternative sequence may include a date in a different calendar.
toolkit label: laatste chronologische aanduiding van alternatieve reeks @nl
toolkit definition: Een nomen dat is een aanduiding in de vorm van een datum of andere tijdspanne die gebruikt is om de laatste aan te geven in een opeenvolgende volgorde van nummering van de delen of iteraties van een manifestatie. @nl
label: có định danh biên niên lựa chọn của số hoặc phần cuối cùng của chuỗi @vi
definition: Liên kết biểu thị với hệ thống thứ hai hoặc tiếp theo của đánh số được trình bày dưới hình thái ngày trên số hoặc phần cuối cùng của chuỗi đánh số đối với ấn phẩm nhiều kỳ. @vi
scope note: Đinh danhbao gồm năm; năm và tháng; tháng, ngày, và năm. Định danh biên niên lựa chọn có thể bao gồm ngày trong lịch khác. @vi
toolkit label: định danh biên niên lựa chọn của số hoặc phần cuối cùng của chuỗi @vi
toolkit definition: Hệ thống thứ hai hoặc tiếp theo của đánh số được trình bày dưới hình thái ngày trên số hoặc phần cuối cùng của chuỗi đánh số đối với ấn phẩm nhiều kỳ. @vi
scope note: Een aanduiding omvat een jaar; jaar en maand; maand, dag en jaar. Een chronologische aanduiding van alternatieve volgorde kan een datum omvatten in een andere jaartelling. @nl
label: har sidste kronologisk betegnelse for alternativ rækkefølge @da
definition: Relaterer en manifestation til en betegnelse i form af en dato eller anden tidsperiode, som anvendes til at indikere den sidste i en fortløbende rækkefølgenummerering af delene eller iterationer af en manifestation. @da
scope note: Betegnelse omfatter et år; år og måned; måned, dag og år. En alternativ kronologisk betegnelse kan omfatte en dato i en anden kalender. @da
toolkit label: har sidste kronologisk betegnelse for alternativ rækkefølge @da
toolkit definition: Betegnelse i form af en dato eller anden tidsperiode, som anvendes til at indikere den sidste i en fortløbende rækkefølgenummerering af delene eller iterationer af en manifestation. @da
label: hat alternative chronologische Bezeichnung der letzten Ausgabe einer fortlaufenden Ressource @de
definition: Setzt eine Manifestation in Beziehung zu einer Bezeichnung in Form eines Datums oder eines anderen Zeitraums, die verwendet wird, um in einer alternativen Zählfolge der Ausgaben einer Manifestation auf die letzte hinzuweisen. @de
scope note: Darunter fällt ein Jahr; ein Monat und ein Jahr; ein Tag, ein Monat und ein Jahr. Zu einer alternativen chronologischen Bezeichnung einer fortlaufenden Ressource kann auch ein Datum nach einem anderen Kalender gehören. @de
toolkit label: Alternative chronologische Bezeichnung der letzten Ausgabe einer fortlaufenden Ressource @de
toolkit definition: Eine Bezeichnung in Form eines Datums oder eines anderen Zeitraums, die verwendet wird, um in einer alternativen Zählfolge der Ausgaben einer Manifestation auf die letzte hinzuweisen. @de
label: té com a darrera designació cronològica d’una seqüència alternativa @ca
definition: Relaciona una manifestació amb un nomen que és una designació en la forma d’una data o de qualsevol altre interval de temps que s’usa per indicar la darrera de les parts o les iteracions en una seqüència de numeració concurrent d’una manifestació. @ca
scope note: Una designació inclou un any; any i mes; dia, mes i any. Una designació cronològica alternativa pot incloure una data en un calendari diferent. @ca
toolkit label: darrera designació cronològica d’una seqüència alternativa @ca
toolkit definition: Nomen que és una designació en la forma d’una data o de qualsevol altre interval de temps que s’usa per indicar la darrera de les parts o les iteracions en una seqüència de numeració concurrent d’una manifestació. @ca
definition: Liittää manifestaation nomeniin, joka on päivämäärästä tai muusta ajanjaksosta muodostuva määrite, joka on manifestaation osien tai iteraatioiden rinnakkaisen numerointijakson viimeinen määrite. @fi
toolkit label: vaihtoehtoisen numerointijakson viimeinen aikamäärite @fi
toolkit definition: Nomen, joka on päivämäärästä tai muusta ajanjaksosta muodostuva määrite, joka on manifestaation osien tai iteraatioiden rinnakkaisen numerointijakson viimeinen määrite. @fi
toolkit label: siste kronologiske betegnelse for alternativ sekvens @no
toolkit definition: En betegnelse i form av en dato eller et annet tidsrom som brukes til å indikere den siste i en fortløpende sekvens av nummerering av deler eller versjoner av en manifestasjon. @no
label: έχει εναλλακτικό χρονολογικό προσδιορισμό του τελευταίου τεύχους ή μέρους της ακολουθίας @el
definition: Συνδέει μια εκδήλωση με ένα δεύτερο ή διαδοχικό σύστημα αρίθμησης που παρουσιάζεται στη μορφή μιας χρονολογίας στο τελευταίο τεύχος ή μέρος μιας αριθμητικής ακολουθίας για ένα περιοδικό. @el
scope note: Ο προσδιορισμός περιλαμβάνει ένα έτος; έτος και μήνα; μήνα, ημέρα και έτος. Ένας εναλλακτικός χρονολογικός προσδιορισμός μπορεί να περιλαμβάνει μια χρονολογία σε ένα διαφορετικό ημερολόγιο. @el
toolkit label: εναλλακτικός χρονολογικός προσδιορισμός του τελευταίου τεύχους ή μέρους της ακολουθίας @el
toolkit definition: Ένα δεύτερο ή διαδοχικό σύστημα αρίθμησης που παρουσιάζεται στη μορφή μιας χρονολογίας στο τελευταίο τεύχος ή μέρος μιας αριθμητικής ακολουθίας για ένα περιοδικό. @el
scope note: Des exemples de désignation comprennent : année ; année et mois ; jour, mois et année. Une désignation chronologique d’une autre séquence peut inclure une date exprimée selon un calendrier différent. @fr
label: alternatív sorrendiségének kronológiai zárójelölése a következő: @hu
definition: Hozzákapcsol egy megjelenési formát egy nomenhez, amelynek megjelölése dátum vagy más időtartam formájában jelzi az utolsót egy megjelenési forma részeinek vagy iterációinak konkurens számozási sorrendjében. @hu
scope note: Jelölés lehet év; év és hónap; hónap, nap és év. Az alternatív sorrendiség kronológiai jelölése tartalmazhat dátumot egy másik naptárból is. @hu
alternative label: alternative chronological designation of last issue or part of sequence
scope note: Määrite sisältää vuoden; vuoden ja kuukauden; kuukauden, päivän ja vuoden. Vaihtoehtoinen aikamääre voi sisältää toisen kalenterin mukaisen ajankohdan. @fi
alternative label: numerointijakson viimeisen numeron tai osan vaihtoehtoinen aikamäärite @fi
label: vaihtoehtoisen numerointijakson viimeinen aikamäärite @fi
label: har siste kronologiske betegnelse for alternativ sekvens @no
definition: Relaterer en manifestasjon til en betegnelse i form av en dato eller et annet tidsrom som brukes til å indikere den siste i en fortløpende sekvens av nummerering av deler eller versjoner av en manifestasjon. @no
alternative label: alternativ kronologisk betegnelse for siste hefte eller del av en sekvens @no
sub property of: has last chronological designation of sequence
alternative label: autre désignation chronologique de la dernière livraison ou partie d’une séquence @fr
label: heeft laatste chronologische aanduiding van alternatieve reeks @nl
definition: Relateert een manifestatie aan een nomen dat is een aanduiding in de vorm van een datum of andere tijdspanne die gebruikt is om de laatste aan te geven in een opeenvolgende volgorde van nummering van de delen of iteraties van een manifestatie. @nl
label: له تسمية زمنية أخيرة لتسلسل بديل @ar
definition: يربط بين تجسيدة وتسمية في شكل تاريخ أو أي فترة زمنية مستخدمة لتشير إلى آخر التسلسل الرقمي للأجزاء أو الأعداد لتجسيدة. @ar
scope note: تشمل التسمية : السنة؛ السنة والشهر؛ الشهر واليوم والسنة. تسمية زمنية لتسلسل بديل يمكن أن تشتمل على تاريخ في تقويم مختلف. @ar
alternative label: بديل تسمية زمنية للعدد الأخير أو الجزء الأخير من تسلسل @ar
toolkit label: تسمية زمنية أخيرة لتسلسل بديل @ar
toolkit definition: تسمية في شكل تاريخ أو أي فترة زمنية مستخدمة لتشير إلى آخر التسلسل الرقمي للأجزاء أو الأعداد لتجسيدة. @ar
alternative label: designació cronològica alternativa del darrer número o darrera part d’una seqüència @ca
alternative label: alternativ kronologisk betegnelse for sidste nummer eller del af en rækkefølge @da
label: alternatiivse nummerduse viimane kronoloogiline tähistus @et
definition: Seostab kehastuse daatumist või muust ajavahemikust koosneva tähistusega, mis on kehastuse osade või seisude alternatiivse nummerduse viimane tähistus. @et
scope note: Tähistus koosneb aastaarvust, aastaarvust ja kuust või kuupäevast, kuust ja aastaarvust. Alternatiivseks kronoloogiliseks tähistuseks võib olla mõne teise kalendri daatum. @et
toolkit label: alternatiivse nummerduse viimane kronoloogiline tähistus @et
toolkit definition: Daatumist või muust ajavahemikust koosnev tähistus, mis on kehastuse osade või seisude alternatiivse nummerduse viimane tähistus. @et
alternative label: egy alternatív sorrendiség utolsó számának vagy részének jelölése: @hu
toolkit label: alternatív sorrendiségének kronológiai zárójelölése: @hu
toolkit definition: Egy nomen, amelynek megjelölése dátum vagy más időtartam formájában jelzi az utolsót egy megjelenési forma részeinek vagy iterációinak konkurens számozási sorrendjében. @hu

has last chronological designation of sequence
status: Published
definition: Relates a manifestation to a nomen that is a designation in the form of a date or other timespan that is used to indicate the last in a sequence of numbering of the parts or iterations of a manifestation.
type: Property
domain: C10007
lexical alias: lastChronologicalDesignationOfSequence.en
instruction number: 2.6.5
toolkit label: last chronological designation of sequence
toolkit definition: A nomen that is a designation in the form of a date or other timespan that is used to indicate the last in a sequence of numbering of the parts or iterations of a manifestation.
label: a pour dernière désignation chronologique d’une séquence @fr
definition: Met une manifestation en relation avec un nomen qui est une désignation sous forme de date ou d’un autre laps de temps servant à indiquer la dernière partie ou itération dans une séquence de numérotation des parties ou itérations d’une manifestation. @fr
toolkit label: dernière désignation chronologique d’une séquence @fr
toolkit definition: Nomen qui est une désignation sous forme de date ou d’un autre laps de temps servant à indiquer la dernière partie ou itération dans une séquence de numérotation des parties ou itérations d’une manifestation. @fr
toolkit label: última designación cronológica de secuencia @es
toolkit definition: Un nomen que es una designación en forma de fecha u otro período de tiempo que se utiliza para indicar el último en una secuencia de numeración de las partes o iteraciones de una manifestación. @es
scope note: A designation includes a year; year and month; month, day, and year.
toolkit label: laatste chronologische aanduiding van reeks @nl
toolkit definition: Een nomen dat is een aanduiding in de vorm van een datum of andere tijdspanne die gebruikt is om de laatste aan te geven in een opeenvolgende volgorde van nummering van de delen of iteraties van een manifestatie. @nl
label: có định danh biên niên của số hoặc phần cuối cùng của chuỗi @vi
definition: Liên kết biểu thị với định danh dưới hình thái ngày được trình bày trên số hoặc phần cuối cùng trong chuỗi đánh số. @vi
scope note: Định danh bao gồm năm; năm và tháng; tháng, ngày, và năm. @vi
toolkit label: định danh biên niên của số hoặc phần cuối cùng của chuỗi @vi
toolkit definition: Định danh dưới hình thái ngày được trình bày trên số hoặc phần cuối cùng trong chuỗi đánh số. @vi
scope note: Een aanduiding omvat een jaar; jaar en maand; maand, dag en jaar. @nl
label: har sidste kronologiske betegnelse af rækkefølge @da
definition: Relaterer en manifestation til en betegnelse i form af en dato eller anden tidsperiode, som anvendes til at indikere den sidste i en rækkefølgenummerering af delene eller iterationer af en manifestation. @da
scope note: Betegnelsen omfatter et år; år og måned; måned, dag og år. @da
toolkit label: sidste kronologiske betegnelse af rækkefølge @da
toolkit definition: Betegnelse i form af en dato eller anden tidsperiode, som anvendes til at indikere den sidste i en rækkefølgenummerering af delene eller iterationer af en manifestation. @da
label: hat chronologische Bezeichnung der letzten Ausgabe einer fortlaufenden Ressource @de
definition: Setzt eine Manifestation in Beziehung zu einer Bezeichnung in Form eines Datums oder eines anderen Zeitraums, die verwendet wird, um in einer Zählfolge der Ausgaben einer Manifestation auf die letzte hinzuweisen. @de
scope note: Darunter fällt ein Jahr; ein Monat und ein Jahr; ein Tag, ein Monat und ein Jahr. @de
toolkit label: Chronologische Bezeichnung der letzten Ausgabe einer fortlaufenden Ressource @de
toolkit definition: Eine Bezeichnung in Form eines Datums oder eines anderen Zeitraums, die verwendet wird, um in einer Zählfolge der Ausgaben einer Manifestation auf die letzte hinzuweisen. @de
label: té com a darrera designació cronològica d’una seqüència @ca
definition: Relaciona una manifestació amb una designació en forma d’una data o de qualsevol altre interval de temps que s’usa per indicar la darrera de les parts o les iteracions en una seqüència de numeració d’una manifestació. @ca
scope note: Una designació inclou un any; any i mes; dia, mes i any. @ca
toolkit label: darrera designació cronològica d’una seqüència @ca
toolkit definition: Designació en forma d’una data o de qualsevol altre interval de temps que s’usa per indicar la darrera de les parts o les iteracions en una seqüència de numeració d’una manifestació. @ca
definition: Liittää manifestaation nomeniin, joka on päivämäärästä tai muusta ajanjaksosta muodostuvaan määritteeseen, joka ilmaisee manifestaation osien tai iteraatioiden numerointijakson viimeiseen määritteen. @fi
toolkit label: numerointijakson viimeinen aikamäärite @fi
toolkit definition: Nomen, joka on päivämäärästä tai muusta ajanjaksosta muodostuva määrite, joka ilmaisee manifestaation osien tai iteraatioiden numerointijakson viimeisen määritteen. @fi
toolkit label: siste kronologiske betegnelse for sekvens @no
toolkit definition: En betegnelse i form av en dato eller et annet tidsrom som brukes til å indikere den siste i en sekvens av nummerering av deler eller versjoner av en manifestasjon. @no
label: έχει χρονολογικό προσδιορισμό του τελευταίου τεύχους ή μέρους της ακολουθίας @el
definition: Συνδέει μια εκδήλωση με έναν προσδιορισμό στη μορφή χρονολογίας που παρουσιάζεται στο τελευταίο τεύχος ή μέρος ενός περιοδικού που εκδίδεται σε μια αριθμητική ακολουθία. @el
scope note: Ο προσδιορισμός περιλαμβάνει ένα έτος; έτος και μήνα; μήνα, ημέρα και έτος. @el
toolkit label: χρονολογικός προσδιορισμός του τελευταίου τεύχους ή μέρους της ακολουθίας @el
toolkit definition: Ένας προσδιορισμός στη μορφή χρονολογίας που παρουσιάζεται στο τελευταίο τεύχος ή μέρος ενός περιοδικού που εκδίδεται σε μια αριθμητική ακολουθία. @el
scope note: Des exemples de désignation comprennent : année ; année et mois ; jour, mois et année. @fr
label: sorrendiségének kronológiai zárójelölése a következő: @hu
definition: Hozzákapcsol egy megjelenési formát egy nomenhez, amely megjelölésként dátum vagy más időtartam formájában jelzi az utolsót egy megjelenési forma részeinek vagy iterációinak számozási sorrendjében. @hu
scope note: Jelölés lehet év; év és hónap; hónap, nap és év. @hu
alternative label: chronological designation of last issue or part of sequence
scope note: Määrite sisältää vuoden; vuoden ja kuukauden; kuukauden, päivän ja vuoden. @fi
alternative label: numerointijakson viimeisen osan tai numeron aikamäärite @fi
label: numerointijakson viimeinen aikamäärite @fi
label: har siste kronologiske betegnelse for sekvens @no
definition: Relaterer en manifestasjon til en betegnelse i form av en dato eller et annet tidsrom som brukes til å indikere den siste i en sekvens av nummerering av deler eller versjoner av en manifestasjon. @no
scope note: En betegnelse inkluderer et år; år og måned; måned, dag og år. @no
alternative label: kronologisk betegnelse for siste hefte eller del av en sekvens @no
sub property of: has related nomen of manifestation
alternative label: désignation chronologique de la dernière livraison ou partie d’une séquence @fr
label: heeft laatste chronologische aanduiding van reeks @nl
definition: Relateert een manifestatie aan een nomen dat is een aanduiding in de vorm van een datum of andere tijdspanne die gebruikt is om de laatste aan te geven in een opeenvolgende volgorde van nummering van de delen of iteraties van een manifestatie. @nl
label: له تسمية زمنية أخيرة لتسلسل @ar
definition: يربط بين تجسيدة وتسمية في شكل تاريخ أو أي فترة زمنية أخرى ومستخدمة لتشير إلى التسلسل الرقمي الأخير للأجزاء أو للأعداد لتجسيدة. @ar
scope note: تشمل التسمية : السنة؛ السنة والشهر؛ الشهر واليوم والسنة. @ar
alternative label: تسمية زمنية لإصدارة أخيرة أو جزء أخير من تسلسل @ar
toolkit label: تسمية زمنية أخيرة لتسلسل @ar
toolkit definition: تسمية في شكل تاريخ أو أي فترة زمنية أخرى ومستخدمة لتشير إلى التسلسل الرقمي الأخير للأجزاء أو للأعداد لتجسيدة. @ar
alternative label: designació cronològica del darrer número o darrera part d’una seqüència @ca
alternative label: kronologisk betegnelse for sidste nummer eller del af rækkefølge @da
label: nummerduse viimane kronoloogiline tähistus @et
definition: Seostab kehastuse daatumist või muust ajavahemikust koosneva tähistusega, mis on kehastuse osade või seisude nummerduse viimane tähistus. @et
scope note: Tähistus koosneb aastaarvust, aastaarvust ja kuust või kuupäevast, kuust ja aastaarvust. @et
toolkit label: nummerduse viimane kronoloogiline tähistus @et
toolkit definition: Daatumist või muust ajavahemikust koosnev tähistus, mis on kehastuse osade või seisude nummerduse viimane tähistus. @et
alternative label: egy kronológiai sorrendiség utolsó számának vagy részének jelölése: @hu
toolkit label: sorrendiségének kronológiai zárójelölése: @hu

has playing speed
status: Published
definition: Relates a manifestation to a speed at which an audio carrier must be operated to produce the sound intended.
type: Property
domain: C10007
sub property of: has sound characteristic
lexical alias: playingSpeed.en
instruction number: 3.16.4
toolkit label: playing speed
toolkit definition: A speed at which an audio carrier must be operated to produce the sound intended.
label: a pour vitesse de lecture @fr
definition: Met une manifestation en relation avec une vitesse à laquelle un support matériel audio doit être utilisé pour produire le son prévu. @fr
toolkit label: vitesse de lecture @fr
toolkit definition: Vitesse à laquelle un support matériel audio doit être utilisé pour produire le son prévu. @fr
toolkit label: velocidad de reproducción @es
toolkit definition: La velocidad a la que se debe operar un soporte de audio para producir el sonido deseado. @es
label: har uppspelningshastighet @sv
toolkit label: uppspelningshastighet @sv
toolkit label: afspeelsnelheid @nl
toolkit definition: Een snelheid waarmee een geluidsdrager moet worden afgespeeld om het bedoelde geluid te produceren. @nl
label: có tốc độ chơi @vi
definition: Liên kết biểu thị với tốc độ mà vật mang audio phải vận hành để tạo ra âm thanh dự kiến. @vi
toolkit label: tốc độ chơi @vi
toolkit definition: Tốc độ mà vật mang audio phải vận hành để tạo ra âm thanh dự kiến. @vi
label: har omdrejningshastighed @da
definition: Relaterer en manifestation til en hastighed, som en lydbærer skal betjenes ved for at producere den ønskede lyd. @da
toolkit label: omdrejningshastighed @da
toolkit definition: Hastighed, som en lydbærer skal betjenes ved for at producere den ønskede lyd. @da
label: hat Abspielgeschwindigkeit @de
definition: Setzt eine Manifestation in Beziehung zu einer Geschwindigkeit, mit der ein Tonträger für die korrekte Wiedergabe abgespielt werden muss. @de
toolkit label: Abspielgeschwindigkeit @de
toolkit definition: Eine Geschwindigkeit, mit der ein Tonträger für die korrekte Wiedergabe abgespielt werden muss. @de
label: té com a velocitat de reproducció @ca
definition: Relaciona una manifestació amb una velocitat a la qual un suport físic àudio ha de funcionar per produir el so previst. @ca
toolkit label: velocitat de reproducció @ca
toolkit definition: Velocitat a la qual un suport físic àudio ha de funcionar per produir el so previst. @ca
definition: Liittää manifestaation nopeuteen, jolla äänitallenne on toistettava äänen tuottamiseksi tarkoitetulla tavalla. @fi
toolkit label: toistonopeus @fi
toolkit definition: Nopeus, jolla äänitallenne on toistettava äänen tuottamiseksi tarkoitetulla tavalla. @fi
toolkit label: avspillingshastighet @no
toolkit definition: En hastighet som kreves for at en lydbærer skal produsere lyd slik den var ment. @no
label: έχει ταχύτητα αναπαραγωγής @el
definition: Συνδέει μια εκδήλωση με μια ταχύτητα στην οποία ένας φορέας αποθήκευσης ήχου πρέπει να λειτουργεί για την παραγωγή του σκοπούμενου ήχου. @el
toolkit label: ταχύτητα αναπαραγωγής @el
toolkit definition: Μια ταχύτητα στην οποία ένας φορέας αποθήκευσης ήχου πρέπει να λειτουργεί για την παραγωγή του σκοπούμενου ήχου. @el
has element type: 5
label: lejátszási sebessége a következő: @hu
definition: Hozzákapcsol egy megjelenési formát egy sebességhez, amelyen egy hanghordozónak működnie kell, hogy a kívánt hangot elő tudják állítani. @hu
toolkit label: lejátszási sebessége: @hu
toolkit definition: Egy sebesség, amelyen egy hanghordozónak működnie kell, hogy a kívánt hangot elő tudják állítani. @hu
label: toistonopeus @fi
label: har avspillingshastighet @no
definition: Relaterer en manifestasjon til en hastighet som kreves for at en lydbærer skal produsere lyd slik den var ment. @no
label: heeft afspeelsnelheid @nl
definition: Relateert een manifestatie aan een snelheid waarmee een geluidsdrager moet worden afgespeeld om het bedoelde geluid te produceren. @nl
label: له سرعة تشغيل @ar
definition: يربط بين تجسيدة وسرعة يجب أن يشغل حامل الصوت بها لكي ينتج الصوت المطلوب. @ar
toolkit label: سرعة تشغيل @ar
toolkit definition: سرعة يجب أن يشغل حامل الصوت بها لكي ينتج الصوت المطلوب. @ar
label: mängimiskiirus @et
definition: Seostab kehastuse kiirusega, millega tuleb helikandjat käitada, et tekiks ettenähtud heli. @et
toolkit label: mängimiskiirus @et
toolkit definition: Kiirus, millega tuleb helikandjat käitada, et tekiks ettenähtud heli. @et
label: ha come velocità di riproduzione @it
definition: Correla una manifestazione a una velocità a cui un supporto audio deve essere utilizzato per produrre il suono desiderato. @it
toolkit label: velocità di riproduzione @it
toolkit definition: Velocità a cui un supporto audio deve essere utilizzato per produrre il suono desiderato. @it
label: atskaņošanas ātrums @lv
definition: Sasaista manifestāciju ar paredzēto atskaņošanas ātrumu skaņu ierakstam, kādā ierīcei jāatskaņo ierakstītais, lai iegūtu plānoto skaņu. @lv
toolkit label: atskaņošanas ātrums @lv
toolkit definition: Paredzētais atskaņošanas ātrums skaņu ierakstam, kādā ierīcei jāatskaņo ierakstītais, lai iegūtu plānoto skaņu. @lv
label: 有播放速度 @zh-hans
definition: 将一种载体表现与一种音频载体要产生所期望的声音必须操作的速度关联起来。 @zh-hans
toolkit label: 播放速度 @zh-hans
toolkit definition: 一种音频载体要产生所期望的声音必须操作的速度 @zh-hans
label: çalma hızı ile ilişkilidir @tr
definition: Bir gösterimi, sesin üretilmesi için bir ses taşıyıcısının çalıştırılması gereken bir hız ile ilişkilendirir. @tr
toolkit label: çalma hızı @tr
toolkit definition: Bir ses taşıyıcısının, amaçlanan sesi üretebilmesi için çalıştırılması gereken hız. @tr
label: tiene velocidad de reproducción @es

has details of playing speed
status: Published
type: Property
lexical alias: detailsOfPlayingSpeed.en
definition: Relates a manifestation to details of a speed at which an audio carrier must be operated to produce the sound intended.
domain: C10007
instruction number: 3.16.4.4
toolkit label: details of playing speed
toolkit definition: Details of a speed at which an audio carrier must be operated to produce the sound intended.
toolkit label: detalles de la velocidad de reproducción @es
toolkit definition: Detalles de la velocidad a la que se debe operar un portador de audio para producir el sonido deseado. @es
label: har details of playing speed @sv
toolkit label: detaljerad information om uppspelningshastighet @sv
toolkit label: details van afspeelsnelheid @nl
toolkit definition: Details van een snelheid waarmee een geluidsdrager moet worden afgespeeld om het bedoelde geluid te produceren. @nl
label: có chi tiết của tốc độ chơi @vi
definition: Liên kết biểu thị với chi tiết của tốc độ mà vật mang audio phải vận hành để tạo ra âm thanh dự kiến. @vi
toolkit label: chi tiết của tốc độ chơi @vi
toolkit definition: Chi tiết của tốc độ mà vật mang audio phải vận hành để tạo ra âm thanh dự kiến. @vi
label: har detaljer om omdrejningshastighed @da
definition: Relaterer en manifestation til detaljer om den hastighed, som en lydbærer skal betjenes ved for at producere den ønskede lyd. @da
toolkit label: detaljer om omdrejningshastighed @da
toolkit definition: Detaljer om den hastighed, som en lydbærer skal betjenes ved for at producere den ønskede lyd. @da
label: hat Details zur Abspielgeschwindigkeit @de
definition: Setzt eine Manifestation in Beziehung zu den Details zur Geschwindigkeit, mit der ein Tonträger für die korrekte Wiedergabe abgespielt werden muss. @de
toolkit label: Details zur Abspielgeschwindigkeit @de
toolkit definition: Details zur Geschwindigkeit, mit der ein Tonträger für die korrekte Wiedergabe abgespielt werden muss. @de
label: té com a particularitats de velocitat de reproducció @ca
definition: Relaciona una manifestació amb les particularitats d’una velocitat a la qual un suport físic àudio ha de funcionar per produir el so previst. @ca
toolkit label: particularitats de velocitat de reproducció @ca
toolkit definition: Particularitats d’una velocitat a la qual un suport físic àudio ha de funcionar per produir el so previst. @ca
definition: Liittää manifestaation tarkempiin tietoihin nopeudesta, jolla äänitallenne on toistettava äänen tuottamiseksi tarkoitetulla tavalla. @fi
toolkit label: toistonopeuden tarkemmat tiedot @fi
toolkit definition: Tarkemmat tiedot nopeudesta, jolla äänitallenne on toistettava äänen tuottamiseksi tarkoitetulla tavalla. @fi
toolkit label: detaljer vedrørende avspillingshastighet @no
toolkit definition: Detaljer vedrørende hastigheten som kreves for at en lydbærer skal produsere lyd slik den var ment. @no
label: έχει λεπτομέρειες της ταχύτητας αναπαραγωγής @el
definition: Συνδέει μια εκδήλωση με τις λεπτομέρειες μιας ταχύτητας στην οποία πρέπει να λειτουργεί ένας φορέας αποθήκευσης ήχου για την παραγωγή του σκοπούμενου ήχου. @el
toolkit label: λεπτομέρειες της ταχύτητας αναπαραγωγής @el
toolkit definition: Λεπτομέρειες μιας ταχύτητας στην οποία πρέπει να λειτουργεί ένας φορέας αποθήκευσης ήχου για την παραγωγή του σκοπούμενου ήχου. @el
label: a pour particularités d’une vitesse de lecture @fr
definition: Met une manifestation en relation avec des particularités d’une vitesse à laquelle un support matériel audio doit être utilisé pour produire le son prévu. @fr
toolkit label: particularités d’une vitesse de lecture @fr
toolkit definition: Particularités d’une vitesse à laquelle un support matériel audio doit être utilisé pour produire le son prévu. @fr
has element type: 6
label: lejátszási sebesség részletei a következők: @hu
definition: Hozzákapcsol egy megjelenési formát egy sebesség részleteihez, amelyen egy hanghordozónak működnie kell, hogy a kívánt hangot elő tudják állítani. @hu
toolkit label: lejátszási sebesség részletei: @hu
toolkit definition: Egy sebesség részletei, amelyen egy hanghordozónak működnie kell, hogy a kívánt hangot elő tudják állítani. @hu
label: toistonopeuden tarkemmat tiedot @fi
label: har detaljer vedrørende avspillingshastighet @no
definition: Relaterer en manifestasjon til detaljer vedrørende hastigheten som kreves for at en lydbærer skal produsere lyd slik den var ment. @no
label: heeft details van afspeelsnelheid @nl
definition: Relateert een manifestatie aan details van een snelheid waarmee een geluidsdrager moet worden afgespeeld om het bedoelde geluid te produceren. @nl
label: له تفاصيل سرعة تشغيل @ar
definition: يربط بين تجسيدة وتفاصيل سرعة يجب أن يتم تشغيل حامل الصوت بها لكي ينتج الصوت المطلوب. @ar
toolkit label: تفاصيل سرعة تشغيل @ar
toolkit definition: تفاصيل سرعة يجب أن يتم تشغيل حامل الصوت بها لكي ينتج الصوت المطلوب. @ar
label: mängimiskiiruse täpsustus @et
definition: Seostab kehastuse täpsemate andmetega kiiruse kohta, millega tuleb helikandjat käitada, et tekiks ettenähtud heli. @et
toolkit label: mängimiskiiruse täpsustus @et
toolkit definition: Täpsemad andmed kiiruse kohta, millega tuleb helikandjat käitada, et tekiks ettenähtud heli. @et
label: ha come particolari relativi alla velocità di riproduzione @it
definition: Correla una manifestazione ai particolari relativi a un velocità a cui un supporto audio deve essere utilizzato per produrre il suono desiderato. @it
toolkit label: particolari relativi alla velocità di riproduzione @it
toolkit definition: Particolari relativi a una velocità a cui un supporto audio deve essere utilizzato per produrre il suono desiderato. @it
label: detalizēti par atskaņošanas ātrumu @lv
definition: Sasaista manifestāciju ar sīkāku informāciju par paredzēto atskaņošanas ātrumu skaņu ierakstam kādā nesējam jāatskaņo ierakstītais, lai iegūtu plānoto skaņu. @lv
toolkit label: detalizēti par atskaņošanas ātrumu @lv
toolkit definition: Sīkāka informācija par paredzēto atskaņošanas ātrumu skaņu ierakstam kādā nesējam jāatskaņo ierakstītais, lai iegūtu plānoto skaņu. @lv
label: 有播放速度细节 @zh-hans
definition: 将一种载体表现与一种音频载体要产生所期望的声音必须操作的速度的细节关联起来。 @zh-hans
toolkit label: 播放速度细节 @zh-hans
toolkit definition: 一种音频载体要产生所期望的声音必须操作的速度的细节 @zh-hans
label: oynatma hızı ayrıntıları ile ilişkilidir @tr
definition: Bir gösterimi, amaçlanan sesi üretmek için bir ses taşıyıcısının çalıştırılması gereken hızın ayrıntılarıyla ilişkilendirir. @tr
toolkit label: oynatma hızının ayrıntıları @tr
toolkit definition: Hedeflenen sesi üretmek için bir ses taşıyıcısının çalıştırılması gereken hızın ayrıntıları. @tr
label: tiene detalles de la velocidad de reproducción @es
definition: Relaciona una manifestación con detalles de la velocidad a la que se debe operar un portador de audio para producir el sonido deseado. @es

has lithographer agent
status: Published
definition: Relates a manifestation to an agent who is responsible for creating a manifestation by preparing a stone or plate for lithographic printing.
type: Property
domain: C10007
lexical alias: lithographerAgent.en
toolkit label: lithographer agent
toolkit definition: An agent who is responsible for creating a manifestation by preparing a stone or plate for lithographic printing.
label: a pour agent lithographe @fr
definition: Met une manifestation en relation avec un agent qui est responsable de la création d’une manifestation en préparant une pierre ou une plaque pour l’impression lithographique. @fr
toolkit label: agent lithographe @fr
toolkit definition: Agent qui est responsable de la création d’une manifestation en préparant une pierre ou une plaque pour l’impression lithographique. @fr
toolkit label: agente litógrafo @es
toolkit definition: Un agente que se encarga de crear una manifestación preparando una piedra o plancha para impresión litográfica. @es
instruction number: 18.5
scope note: A lithographer includes a graphic artist creating a design directly on the surface from which printing will be done.
toolkit label: lithograaf-actor @nl
toolkit definition: Een actor die verantwoordelijk is voor het creëren van een manifestatie middels het voorbereiden van een steen of plaat voor lithografisch drukwerk. @nl
label: có người in đá @vi
definition: Liên kết biểu thị với tác nhân có liên quan tới chế tạo biểu thị theo trách nhiệm chuẩn bị đá hoặc khuôn in cho in đá. @vi
scope note: Người in đá bao gồm nghệ sỹ đồ hoạ tạo ra thiết kế trực tiếp trên bề mặt mà từ đó việc in tiến hành. @vi
toolkit label: người in đá @vi
toolkit definition: Tác nhân có liên quan tới chế tạo biểu thị theo trách nhiệm chuẩn bị đá hoặc khuôn in cho in đá. @vi
scope note: Een lithograaf omvat een grafisch kunstenaar die een ontwerp direct op het oppervlak maakt waarvan de afdruk gemaakt zal worden. @nl
label: har agent, som er litograf @da
definition: Relaterer en manifestation til en agent, som er involveret i fremstillingen af en manifestation ved at klargøre en sten eller plade til litografisk trykning. @da
toolkit label: agent, som er litograf @da
toolkit definition: Agent, som er involveret i fremstillingen af en manifestation ved at klargøre en sten eller plade til litografisk trykning. @da
label: hat Lithografin/Lithograf (Akteur) @de
definition: Setzt eine Manifestation in Beziehung zu einem Akteur, der für die Herstellung einer Manifestation verantwortlich ist, indem er einen Stein oder eine Platte für lithografischen Druck vorbereitet. @de
scope note: Darunter fallen Grafikerinnen/Grafiker, die ein Muster direkt auf der Oberfläche erstellen, von der aus gedruckt werden soll. @de
toolkit label: Lithografin/Lithograf (Akteur) @de
toolkit definition: Ein Akteur, der für die Herstellung einer Manifestation verantwortlich ist, indem er einen Stein oder eine Platte für lithografischen Druck vorbereitet. @de
label: té com a agent litògraf @ca
definition: Relaciona una manifestació amb un agent que és responsable de la creació d’una manifestació amb la preparació d’una pedra o una planxa per a la impressió litogràfica. @ca
scope note: Un litògraf inclou un artista gràfic que crea un disseny directament sobre la superfície a partir de la qual es farà la impressió. @ca
toolkit label: agent litògraf @ca
toolkit definition: Agent que és responsable de la creació d’una manifestació amb la preparació d’una pedra o una planxa per a la impressió litogràfica. @ca
definition: Liittää manifestaation toimijaan, joka on vastuussa manifestaation valmistamisesta valmistamalla litografiassa käytetyn kivilaatan tai muun painolaatan. @fi
toolkit label: litografi (toimija) @fi
toolkit definition: Toimija, joka on vastuussa manifestaation valmistamisesta valmistamalla litografiassa käytetyn kivilaatan tai muun painolaatan. @fi
scope note: En litograf omfatter en grafiker, som skaber et design direkte på overfladen, hvorfra trykning vil blive udført. @da
toolkit label: litograf (agent) @no
toolkit definition: En agent som er involvert i framstillingen av en manifestasjon ved å klargjøre en stein eller plate for litografisk trykk. @no
label: έχει λιθογράφο @el
definition: Συνδέει μια εκδήλωση με έναν φορέα που εμπλέκεται στην κατασκευή μιας εκδήλωσης μέσω της προετοιμασίας ενός λίθου ή μιας πλάκας για λιθογραφική εκτύπωση. @el
scope note: Ένας λιθογράφος περιλαμβάνει έναν καλλιτέχνη γραφικών που σχεδιάζει κατευθείαν πάνω στην επιφάνεια από την οποία θα γίνει η εκτύπωση. @el
toolkit label: λιθογράφος @el
toolkit definition: Ένας φορέας που εμπλέκεται στην κατασκευή μιας εκδήλωσης μέσω της προετοιμασίας ενός λίθου ή μιας πλάκας για λιθογραφική εκτύπωση. @el
scope note: Un lithographe comprend un artiste graphique créant un dessin directement sur la surface à partir de laquelle l’impression sera effectuée. @fr
has element type: 2
label: kőnyomatkészítő ágense a következő: @hu
definition: Hozzákapcsol egy megjelenési formát egy ágenshez, amely felelős egy megjelenési forma gyártásáért oly módon, hogy egy követ vagy lemezt készít elő litográfiai nyomtatáshoz, azaz kőnyomathoz. @hu
scope note: A litográfus egy grafikusművész, aki közvetlenül azon a felületen készít tervet, amelyről a nyomtatás történik. @hu
toolkit label: kőnyomatkészítő ágens: @hu
toolkit definition: Egy ágens, amely felelős egy megjelenési forma gyártásáért oly módon, hogy egy követ vagy lemezt készít elő litográfiai nyomtatáshoz, azaz kőnyomathoz. @hu
alternative label: lithographer
scope note: Litografi tarkoittaa myös graafikkoa, joka tekee piirroksen suoraan painamiseen käytettävälle pinnalle. @fi
alternative label: litografi @fi
label: litografi (toimija) @fi
label: har litograf (agent) @no
definition: Relaterer en manifestasjon til en agent som er involvert i framstillingen av en manifestasjon ved å klargjøre en stein eller plate for litografisk trykk. @no
scope note: En litograf inkluderer en grafiker som skaper et design direkte på overflaten som trykkingen vil bli gjort. @no
alternative label: litograf @no
alternative label: lithographe @fr
label: heeft lithograaf-actor @nl
definition: Relateert een manifestatie aan een actor die verantwoordelijk is voor het creëren van een manifestatie middels het voorbereiden van een steen of plaat voor lithografisch drukwerk. @nl
label: له وكيل طباع على الحجر @ar
definition: يربط بين تجسيدة ووكيل مسئول عن تصنيع تجسيدة بإعداد الحجر أو اللوح للطباعة الحجرية. @ar
scope note: يشمل الطباع على فنان الجرافيك الذي يصمم بشكل مباشر على السطح الذي سيتم منه الطباعة مباشرة. @ar
alternative label: طباع على الحجر @ar
toolkit label: وكيل طباع على الحجر @ar
toolkit definition: وكيل مسئول عن تصنيع تجسيدة بإعداد الحجر أو اللوح للطباعة الحجرية. @ar
alternative label: litògraf @ca
label: litograaf (tegija) @et
definition: Seostab kehastuse tegijaga, kes osaleb kehastuse valmistamises, valmistades ette kivi või plaadi litograafiliste tõmmiste jaoks. @et
scope note: Litograaf hõlmab ka graafikut, kes loob kujutise otse pinnale, millelt toimub trükkimine. @et
alternative label: litograaf @et
toolkit label: litograaf (tegija) @et
toolkit definition: Tegija, kes osaleb kehastuse valmistamises, valmistades ette kivi või plaadi litograafiliste tõmmiste jaoks. @et

has lithographer collective agent
status: Published
lexical alias: lithographerCollectiveAgent.en
definition: Relates a manifestation to a collective agent who is responsible for creating a manifestation by preparing a stone or plate for lithographic printing.
toolkit label: lithographer collective agent
toolkit definition: A collective agent who is responsible for creating a manifestation by preparing a stone or plate for lithographic printing.
type: Property
domain: C10007
has element type: 2
sub property of: has lithographer agent
scope note: A lithographer includes a graphic artist creating a design directly on the surface from which printing will be done.
label: litografi (yhteistoimija) @fi
definition: Liittää manifestaation yhteistoimijaan, joka on vastuussa manifestaation valmistamisesta valmistamalla litografiassa käytetyn kivilaatan tai muun painolaatan. @fi
scope note: Litografi tarkoittaa myös graafikkoa, joka tekee piirroksen suoraan painamiseen käytettävälle pinnalle. @fi
toolkit label: litografi (yhteistoimija) @fi
toolkit definition: Yhteistoimija, joka on vastuussa manifestaation valmistamisesta valmistamalla litografiassa käytetyn kivilaatan tai muun painolaatan. @fi
label: har litograf (kollektiv agent) @no
definition: Relaterer en manifestasjon til en kollektiv agent som er involvert i framstillingen av en manifestasjon ved å klargjøre en stein eller plate for litografisk trykk. @no
scope note: En litograf inkluderer en grafiker som skaper et design direkte på overflaten som trykkingen vil bli gjort. @no
toolkit label: litograf (kollektiv agent) @no
toolkit definition: En kollektiv agent som er involvert i framstillingen av en manifestasjon ved å klargjøre en stein eller plate for litografisk trykk. @no
label: a pour agent collectif lithographe @fr
definition: Met une manifestation en relation avec un agent collectif qui est responsable de la création d’une manifestation en préparant une pierre ou une plaque pour l’impression lithographique. @fr
scope note: Un lithographe comprend un artiste graphique créant un dessin directement sur la surface à partir de laquelle l’impression sera effectuée. @fr
toolkit label: agent collectif lithographe @fr
toolkit definition: Agent collectif qui est responsable de la création d’une manifestation en préparant une pierre ou une plaque pour l’impression lithographique. @fr
label: heeft lithograaf-collectieve actor @nl
definition: Relateert een manifestatie aan een collectieve actor die verantwoordelijk is voor het creëren van een manifestatie middels het voorbereiden van een steen of plaat voor lithografisch drukwerk. @nl
scope note: Een lithograaf omvat een grafisch kunstenaar die een ontwerp maakt direct op het oppervlak waarvan gedrukt zal worden. @nl
toolkit label: lithograaf-collectieve actor @nl
toolkit definition: Een collectieve actor die verantwoordelijk is voor het creëren van een manifestatie middels het voorbereiden van een steen of plaat voor lithografisch drukwerk. @nl
label: له وكيل جماعي طباع على الحجر @ar
definition: يربط بين تجسيدة ووكيل جماعي مسئول عن تصنيع تجسيدة بإعداد الحجر أو اللوح للطباعة الحجرية. @ar
scope note: يشمل الطباع على فنان الجرافيك الذي يصمم بشكل مباشر على السطح الذي سيتم منه الطباعة مباشرة. @ar
toolkit label: وكيل جماعي طباع على الحجر @ar
toolkit definition: وكيل جماعي مسئول عن تصنيع تجسيدة بإعداد الحجر أو اللوح للطباعة الحجرية. @ar
label: té com a agent col·lectiu litògraf @ca
definition: Relaciona una manifestació amb un agent col·lectiu que és responsable de la creació d’una manifestació amb la preparació d’una pedra o una planxa per a la impressió litogràfica. @ca
scope note: Un litògraf inclou un artista gràfic que crea un disseny directament sobre la superfície a partir de la qual es farà la impressió. @ca
toolkit label: agent col·lectiu litògraf @ca
toolkit definition: Agent col·lectiu que és responsable de la creació d’una manifestació amb la preparació d’una pedra o una planxa per a la impressió litogràfica. @ca
label: har kollektiv agent, som er litograf @da
definition: Relaterer en manifestation til en kollektiv agent, som er involveret i fremstillingen af en manifestation ved at klargøre en sten eller plade til litografisk trykning. @da
scope note: Litograf omfatter en grafiker, som skaber et design direkte på overfladen, hvorfra trykning vil blive udført. @da
toolkit label: kollektiv agent, som er litograf @da
toolkit definition: Kollektiv agent, som er involveret i fremstillingen af en manifestation ved at klargøre en sten eller plade til litografisk trykning. @da
label: litograaf (kollektiiv) @et
definition: Seostab kehastuse kollektiiviga, kes osaleb kehastuse valmistamises, valmistades ette kivi või plaadi litograafiliste tõmmiste jaoks. @et
scope note: Litograaf hõlmab ka graafikut, kes loob kujutise otse pinnale, millelt toimub trükkimine. @et
toolkit label: litograaf (kollektiiv) @et
toolkit definition: Kollektiiv, kes osaleb kehastuse valmistamises, valmistades ette kivi või plaadi litograafiliste tõmmiste jaoks. @et
label: hat Lithografin/Lithograf (Gemeinschaftlicher Akteur) @de
definition: Setzt eine Manifestation in Beziehung zu einem gemeinschaftlichen Akteur, der für die Herstellung einer Manifestation verantwortlich ist, indem er einen Stein oder eine Platte für lithografischen Druck vorbereitet. @de
scope note: Darunter fallen Grafikerinnen/Grafiker, die ein Muster direkt auf der Oberfläche erstellen, von der aus gedruckt werden soll. @de
toolkit label: Lithografin/Lithograf (Gemeinschaftlicher Akteur) @de
toolkit definition: Ein gemeinschaftlicher Akteur, der für die Herstellung einer Manifestation verantwortlich ist, indem er einen Stein oder eine Platte für lithografischen Druck vorbereitet. @de
label: kőnyomatkészítő kollektív ágense a következő: @hu
definition: Hozzákapcsol egy megjelenési formát egy kollektív ágenshez, amely felelős egy megjelenési forma gyártásáért oly módon, hogy egy követ vagy lemezt készít elő litográfiai nyomtatáshoz, azaz kőnyomathoz. @hu
scope note: A litográfus egy grafikusművész, aki közvetlenül azon a felületen készít tervet, amelyről a nyomtatás történik. @hu
toolkit label: kőnyomatkészítő kollektív ágens: @hu
toolkit definition: Egy kollektív ágens, amely felelős egy megjelenési forma gyártásáért oly módon, hogy egy követ vagy lemezt készít elő litográfiai nyomtatáshoz, azaz kőnyomathoz. @hu
label: ha come litografo agente collettivo @it
definition: Correla una manifestazione all'agente collettivo coinvolto nella manifattura di una manifestazione, tramite la preparazione di una pietra o lastra per l'impressione litografica. @it
scope note: Un litografo comprende un artista grafico che crea un disegno direttamente sulla superficie da cui viene effettuata l'impressione. @it
toolkit label: litografo agente collettivo @it
toolkit definition: Agente collettivo coinvolto nella manifattura di una manifestazione, tramite la preparazione di una pietra o lastra per l'impressione litografica. @it
label: litogrāfs (grupa) @lv
definition: Sasaista manifestāciju ar grupu, kas iesaistīta manifestācijas ražošanā, sagatavojot akmeni vai iespiedplati litogrāfiskai pavairošanai. @lv
toolkit label: litogrāfs (grupa) @lv
toolkit definition: Grupa, kas iesaistīta manifestācijas ražošanā, sagatavojot akmeni vai iespiedplati litogrāfiskai pavairošanai. @lv
scope note: Litogrāfs ir arī grafiķis, kas veido dizainu tieši uz virsmas, no kuras materiāls tiks drukāts. @lv
sub property of: has printmaker collective agent
label: 有平版制作者集体行为者 @zh-hans
definition: 将一种载体表现与通过制作用于平版印刷的石头或平版而对一种载体表现的创建负责的一个集体行为者关联起来。 @zh-hans
toolkit label: 平版制作者集体行为者 @zh-hans
toolkit definition: 通过制作用于平版印刷的石头或平版而对一种载体表现的创建负责的一个集体行为者 @zh-hans
scope note: 平版制作者包括直接在用于印刷的表面进行设计创作的平面美术家 @zh-hans
label: taş baskı sanatçısı kolektif temsilcisi ile ilişkilidir @tr
definition: Bir gösterimi, litografik baskı için bir taş veya levha hazırlayarak bir gösterim yaratmaktan sorumlu kolektif bir temsilciyle ilişkilendirir. @tr
toolkit label: Taş basmacı kolektif temsilcisi @tr

has lithographer corporate body
status: Published
lexical alias: lithographerCorporateBody.en
definition: Relates a manifestation to a corporate body who is responsible for creating a manifestation by preparing a stone or plate for lithographic printing.
toolkit label: lithographer corporate body
toolkit definition: A corporate body who is responsible for creating a manifestation by preparing a stone or plate for lithographic printing.
type: Property
domain: C10007
has element type: 2
sub property of: has lithographer collective agent
scope note: A lithographer includes a graphic artist creating a design directly on the surface from which printing will be done.
label: litografi (yhteisö) @fi
definition: Liittää manifestaation yhteisöön, joka on vastuussa manifestaation valmistamisesta valmistamalla litografiassa käytetyn kivilaatan tai muun painolaatan. @fi
scope note: Litografi tarkoittaa myös graafikkoa, joka tekee piirroksen suoraan painamiseen käytettävälle pinnalle. @fi
toolkit label: litografi (yhteisö) @fi
toolkit definition: Yhteisö, joka on vastuussa manifestaation valmistamisesta valmistamalla litografiassa käytetyn kivilaatan tai muun painolaatan. @fi
label: har litograf (korporasjon) @no
definition: Relaterer en manifestasjon til en korporasjon som er involvert i framstillingen av en manifestasjon ved å klargjøre en stein eller plate for litografisk trykk. @no
scope note: En litograf inkluderer en grafiker som skaper et design direkte på overflaten som trykkingen vil bli gjort. @no
toolkit label: litograf (korporasjon) @no
toolkit definition: En korporasjon som er involvert i framstillingen av en manifestasjon ved å klargjøre en stein eller plate for litografisk trykk. @no
label: a pour collectivité lithographe @fr
definition: Met une manifestation en relation avec une collectivité qui est responsable de la création d’une manifestation en préparant une pierre ou une plaque pour l’impression lithographique. @fr
scope note: Un lithographe comprend un artiste graphique créant un dessin directement sur la surface à partir de laquelle l’impression sera effectuée. @fr
toolkit label: collectivité lithographe @fr
toolkit definition: Collectivité qui est responsable de la création d’une manifestation en préparant une pierre ou une plaque pour l’impression lithographique. @fr
label: heeft lithograaf-corporatie @nl
definition: Relateert een manifestatie aan een corporatie die verantwoordelijk is voor het creëren van een manifestatie middels het voorbereiden van een steen of plaat voor lithografisch drukwerk. @nl
scope note: Een lithograaf omvat een grafisch kunstenaar die een ontwerp maakt direct op het oppervlak waarvan gedrukt zal worden. @nl
toolkit label: lithograaf-corporatie @nl
toolkit definition: Een corporatie die verantwoordelijk is voor het creëren van een manifestatie middels het voorbereiden van een steen of plaat voor lithografisch drukwerk. @nl
label: له هيئة طباع على الحجر @ar
definition: يربط بين تجسيدة وهيئة مسئولة عن تصنيع تجسيدة بإعداد الحجر أو اللوح للطباعة الحجرية. @ar
scope note: يشمل الطباع على فنان الجرافيك الذي يصمم بشكل مباشر على السطح الذي سيتم منه الطباعة مباشرة. @ar
toolkit label: هيئة طباع على الحجر @ar
toolkit definition: هيئة مسئولة عن تصنيع تجسيدة بإعداد الحجر أو اللوح للطباعة الحجرية. @ar
label: té com a entitat corporativa litògrafa @ca
definition: Relaciona una manifestació amb una entitat corporativa que és responsable de la creació d’una manifestació amb la preparació d’una pedra o una planxa per a la impressió litogràfica. @ca
scope note: Un litògraf inclou un artista gràfic que crea un disseny directament sobre la superfície a partir de la qual es farà la impressió. @ca
toolkit label: entitat corporativa litògrafa @ca
toolkit definition: Entitat corporativa que és responsable de la creació d’una manifestació amb la preparació d’una pedra o una planxa per a la impressió litogràfica. @ca
label: har korporation, som er litograf @da
definition: Relaterer en manifestation til en korporation, som er involveret i fremstillingen af en manifestation ved at klargøre en sten eller plade til litografisk trykning. @da
scope note: Litograf omfatter en grafiker, som skaber et design direkte på overfladen, hvorfra trykning vil blive udført. @da
toolkit label: korporation, som er litograf @da
toolkit definition: Korporation, som er involveret i fremstillingen af en manifestation ved at klargøre en sten eller plade til litografisk trykning. @da
label: litograaf (asutus) @et
definition: Seostab kehastuse asutusega, kes osaleb kehastuse valmistamises, valmistades ette kivi või plaadi litograafiliste tõmmiste jaoks. @et
scope note: Litograaf hõlmab ka graafikut, kes loob kujutise otse pinnale, millelt toimub trükkimine. @et
toolkit label: litograaf (asutus) @et
toolkit definition: Asutus, kes osaleb kehastuse valmistamises, valmistades ette kivi või plaadi litograafiliste tõmmiste jaoks. @et
label: hat Lithografin/Lithografen (Körperschaft) @de
definition: Setzt eine Manifestation in Beziehung zu einer Körperschaft, die für die Herstellung einer Manifestation verantwortlich ist, indem sie einen Stein oder eine Platte für lithografischen Druck vorbereitet. @de
scope note: Darunter fallen Grafikerinnen/Grafiker, die ein Muster direkt auf der Oberfläche erstellen, von der aus gedruckt werden soll. @de
toolkit label: Lithografin/Lithograf (Körperschaft) @de
toolkit definition: Eine Körperschaft, die für die Herstellung einer Manifestation verantwortlich ist, indem sie einen Stein oder eine Platte für lithografischen Druck vorbereitet. @de
label: kőnyomatkészítő testülete a következő: @hu
definition: Hozzákapcsol egy megjelenési formát egy testülethez, amely felelős egy megjelenési forma gyártásáért oly módon, hogy egy követ vagy lemezt készít elő litográfiai nyomtatáshoz, azaz kőnyomathoz. @hu
scope note: A litográfus egy grafikusművész, aki közvetlenül azon a felületen készít tervet, amelyről a nyomtatás történik. @hu
toolkit label: kőnyomatkészítő testület: @hu
toolkit definition: Egy testület, amely felelős egy megjelenési forma gyártásáért oly módon, hogy egy követ vagy lemezt készít elő litográfiai nyomtatáshoz, azaz kőnyomathoz. @hu
label: ha come litografo ente @it
definition: Correla una manifestazione all'ente coinvolto nella manifattura di una manifestazione, preparando una pietra o lastra per l'impressione litografica. @it
scope note: Un litografo comprende un artista grafico che crea un disegno direttamente sulla superficie da cui viene effettuata l'impressione. @it
toolkit label: litografo ente @it
toolkit definition: Ente coinvolto nella manifattura di una manifestazione, preparando una pietra o lastra per l'impressione litografica. @it
label: litogrāfs (institūcija) @lv
definition: Sasaista manifestāciju ar institūciju, kas iesaistīta manifestācijas ražošanā, sagatavojot akmeni vai iespiedplati litogrāfiskai pavairošanai. @lv
toolkit label: litogrāfs (institūcija) @lv
toolkit definition: Institūcija, kas iesaistīta manifestācijas ražošanā, sagatavojot akmeni vai iespiedplati litogrāfiskai pavairošanai. @lv
scope note: Litogrāfs ir arī grafiķis, kas veido dizainu tieši uz virsmas, no kuras materiāls tiks drukāts. @lv
sub property of: has printmaker corporate body
label: 有平版制作者团体 @zh-hans
definition: 将一种载体表现与通过制作用于平版印刷的石头或平版而对一种载体表现的创建负责的一个团体关联起来。 @zh-hans
toolkit label: 平版制作者团体 @zh-hans
toolkit definition: 通过制作用于平版印刷的石头或平版而对一种载体表现的创建负责的一个团体 @zh-hans
scope note: 平版制作者包括直接在用于印刷的表面进行设计创作的平面美术家 @zh-hans
label: taş baskı sanatçısı tüzel kişisi ile ilişkilidir @tr
definition: Bir gösterimi, litografik baskı için bir taş veya plaka hazırlayarak bir gösterim yaratmaktan sorumlu olan bir tüzel kişiyle ilişkilendirir. @tr
toolkit label: Taş basmacı tüzel kişiliği @tr

has lithographer family
status: Published
lexical alias: lithographerFamily.en
definition: Relates a manifestation to a family who is responsible for creating a manifestation by preparing a stone or plate for lithographic printing.
toolkit label: lithographer family
toolkit definition: A family who is responsible for creating a manifestation by preparing a stone or plate for lithographic printing.
type: Property
domain: C10007
has element type: 2
sub property of: has lithographer collective agent
scope note: A lithographer includes a graphic artist creating a design directly on the surface from which printing will be done.
label: litografi (suku) @fi
definition: Liittää manifestaation sukuun, joka on vastuussa manifestaation valmistamiseen valmistamalla litografiassa käytetyn kivilaatan tai muun painolaatan. @fi
scope note: Litografi tarkoittaa myös graafikkoa, joka tekee piirroksen suoraan painamiseen käytettävälle pinnalle. @fi
toolkit label: litografi (suku) @fi
toolkit definition: Suku, joka on vastuussa manifestaation valmistamisesta valmistamalla litografiassa käytetyn kivilaatan tai muun painolaatan. @fi
label: har litograf (familie) @no
definition: Relaterer en manifestasjon til en familie som er involvert i framstillingen av en manifestasjon ved å klargjøre en stein eller plate for litografisk trykk. @no
scope note: En litograf inkluderer en grafiker som skaper et design direkte på overflaten som trykkingen vil bli gjort. @no
toolkit label: litograf (familie) @no
toolkit definition: En familie som er involvert i framstillingen av en manifestasjon ved å klargjøre en stein eller plate for litografisk trykk. @no
label: a pour famille lithographe @fr
definition: Met une manifestation en relation avec une famille qui est responsable de la création d’une manifestation en préparant une pierre ou une plaque pour l’impression lithographique. @fr
scope note: Un lithographe comprend un artiste graphique créant un dessin directement sur la surface à partir de laquelle l’impression sera effectuée. @fr
toolkit label: famille lithographe @fr
toolkit definition: Famille qui est responsable de la création d’une manifestation en préparant une pierre ou une plaque pour l’impression lithographique. @fr
label: heeft lithograaf-familie @nl
definition: Relateert een manifestatie aan een familie die verantwoordelijk is voor het creëren van een manifestatie middels het voorbereiden van een steen of plaat voor lithografisch drukwerk. @nl
scope note: Een lithograaf omvat een grafisch kunstenaar die een ontwerp maakt direct op het oppervlak waarvan gedrukt zal worden. @nl
toolkit label: lithograaf-familie @nl
toolkit definition: Een familie die verantwoordelijk is voor het creëren van een manifestatie middels het voorbereiden van een steen of plaat voor lithografisch drukwerk. @nl
label: له عائلة طباع على الحجر @ar
definition: يربط بين تجسيدة وعائلة مسئولة عن تصنيع تجسيدة بإعداد الحجر أو اللوح للطباعة الحجرية. @ar
scope note: يشمل الطباع على فنان الجرافيك الذي يصمم بشكل مباشر على السطح الذي سيتم منه الطباعة مباشرة. @ar
toolkit label: عائلة طباع على الحجر @ar
toolkit definition: عائلة مسئولة عن تصنيع تجسيدة بإعداد الحجر أو اللوح للطباعة الحجرية. @ar
label: té com a família litògrafa @ca
definition: Relaciona una manifestació amb una família que és responsable de la creació d’una manifestació amb la preparació d’una pedra o una planxa per a la impressió litogràfica. @ca
scope note: Un litògraf inclou un artista gràfic que crea un disseny directament sobre la superfície a partir de la qual es farà la impressió. @ca
toolkit label: família litògrafa @ca
toolkit definition: Família que és responsable de la creació d’una manifestació amb la preparació d’una pedra o una planxa per a la impressió litogràfica. @ca
label: har familie, som er litograf @da
definition: Relaterer en manifestation til en familie, som er involveret i fremstillingen af en manifestation ved at klargøre en sten eller plade til litografisk trykning. @da
scope note: Litograf omfatter en grafiker, som skaber et design direkte på overfladen, hvorfra trykning vil blive udført. @da
toolkit label: familie, som er litograf @da
toolkit definition: Familie, som er involveret i fremstillingen af en manifestation ved at klargøre en sten eller plade til litografisk trykning. @da
label: litograaf (perekond) @et
definition: Seostab kehastuse perekonnaga, kes osaleb kehastuse valmistamises, valmistades ette kivi või plaadi litograafiliste tõmmiste jaoks. @et
scope note: Litograaf hõlmab ka graafikut, kes loob kujutise otse pinnale, millelt toimub trükkimine. @et
toolkit label: litograaf (perekond) @et
toolkit definition: Perekond, kes osaleb kehastuse valmistamises, valmistades ette kivi või plaadi litograafiliste tõmmiste jaoks. @et
label: hat Lithografin/Lithografen (Familie) @de
definition: Setzt eine Manifestation in Beziehung zu einer Familie, die für die Herstellung einer Manifestation verantwortlich ist, indem sie einen Stein oder eine Platte für lithografischen Druck vorbereitet. @de
scope note: Darunter fallen Grafikerinnen/Grafiker, die ein Muster direkt auf der Oberfläche erstellen, von der aus gedruckt werden soll. @de
toolkit label: Lithografin/Lithograf (Familie) @de
toolkit definition: Eine Familie, die für die Herstellung einer Manifestation verantwortlich ist, indem sie einen Stein oder eine Platte für lithografischen Druck vorbereitet. @de
label: kőnyomatkészítő családja a következő: @hu
definition: Hozzákapcsol egy megjelenési formát egy családhoz, amely felelős egy megjelenési forma gyártásáért oly módon, hogy egy követ vagy lemezt készít elő litográfiai nyomtatáshoz, azaz kőnyomathoz. @hu
scope note: A litográfus egy grafikusművész, aki közvetlenül azon a felületen készít tervet, amelyről a nyomtatás történik. @hu
toolkit label: kőnyomatkészítő család: @hu
toolkit definition: Egy család, amely felelős egy megjelenési forma gyártásáért oly módon, hogy egy követ vagy lemezt készít elő litográfiai nyomtatáshoz, azaz kőnyomathoz. @hu
label: ha come litografo famiglia @it
definition: Correla una manifestazione alla famiglia coinvolta nella manifattura di una manifestazione, preparando una pietra o lastra per l'impressione litografica. @it
scope note: Un litografo comprende un artista grafico che crea un disegno direttamente sulla superficie da cui viene effettuata la stampa. @it
toolkit label: litografo famiglia @it
toolkit definition: Famiglia coinvolta nella manifattura di una manifestazione, preparando una pietra o lastra per l'impressione litografica. @it
label: litogrāfs (dzimta/ģimene) @lv
definition: Sasaista manifestāciju ar dzimtu/ģimeni, kas iesaistīta manifestācijas ražošanā, sagatavojot akmeni vai iespiedplati litogrāfiskai pavairošanai. @lv
toolkit label: litogrāfs (dzimta/ģimene) @lv
toolkit definition: Dzimta/ģimene, kas iesaistīta manifestācijas ražošanā, sagatavojot akmeni vai iespiedplati litogrāfiskai pavairošanai. @lv
scope note: Litogrāfs ir arī grafiķis, kas veido dizainu tieši uz virsmas, no kuras materiāls tiks drukāts. @lv
sub property of: has printmaker family
label: 有平版制作者家族 @zh-hans
definition: 将一种载体表现与通过制作用于平版印刷的石头或平版而对一种载体表现的创建负责的一个家族关联起来。 @zh-hans
toolkit label: 平版制作者家族 @zh-hans
toolkit definition: 通过制作用于平版印刷的石头或平版而对一种载体表现的创建负责的一个家族 @zh-hans
scope note: 平版制作者包括直接在用于印刷的表面进行设计创作的平面美术家 @zh-hans
label: taş baskı sanatçısı ailesi ile ilişkilidir @tr
definition: Bir gösterimi, litografik baskı için bir taş veya plaka hazırlayarak bir gösterim yaratmaktan sorumlu aileyle ilişkilendirir. @tr
toolkit label: taş basmacı aile @tr

has lithographer person
status: Published
lexical alias: lithographerPerson.en
definition: Relates a manifestation to a person who is responsible for creating a manifestation by preparing a stone or plate for lithographic printing.
toolkit label: lithographer person
toolkit definition: A person who is responsible for creating a manifestation by preparing a stone or plate for lithographic printing.
type: Property
domain: C10007
has element type: 2
sub property of: has lithographer agent
scope note: A lithographer includes a graphic artist creating a design directly on the surface from which printing will be done.
label: litografi (henkilö) @fi
definition: Liittää manifestaation henkilöön, joka on vastuussa manifestaation valmistamisesta valmistamalla litografiassa käytetyn kivilaatan tai muun painolaatan. @fi
scope note: Litografi tarkoittaa myös graafikkoa, joka tekee piirroksen suoraan painamiseen käytettävälle pinnalle. @fi
toolkit label: litografi (henkilö) @fi
toolkit definition: Henkilö, joka on vastuussa manifestaation valmistamisesta valmistamalla litografiassa käytetyn kivilaatan tai muun painolaatan. @fi
label: har litograf (person) @no
definition: Relaterer en manifestasjon til en person som er involvert i framstillingen av en manifestasjon ved å klargjøre en stein eller plate for litografisk trykk. @no
scope note: En litograf inkluderer en grafiker som skaper et design direkte på overflaten som trykkingen vil bli gjort. @no
toolkit label: litograf (person) @no
toolkit definition: En person som er involvert i framstillingen av en manifestasjon ved å klargjøre en stein eller plate for litografisk trykk. @no
label: a pour personne lithographe @fr
definition: Met une manifestation en relation avec une personne qui est responsable de la création d’une manifestation en préparant une pierre ou une plaque pour l’impression lithographique. @fr
scope note: Un lithographe comprend un artiste graphique créant un dessin directement sur la surface à partir de laquelle l’impression sera effectuée. @fr
toolkit label: personne lithographe @fr
toolkit definition: Personne qui est responsable de la création d’une manifestation en préparant une pierre ou une plaque pour l’impression lithographique. @fr
label: heeft lithograaf-persoon @nl
definition: Relateert een manifestatie aan een persoon die verantwoordelijk is voor het creëren van een manifestatie middels het voorbereiden van een steen of plaat voor lithografisch drukwerk. @nl
scope note: Een lithograaf omvat een grafisch kunstenaar die een ontwerp maakt direct op het oppervlak waarvan gedrukt zal worden. @nl
toolkit label: lithograaf-persoon @nl
toolkit definition: Een persoon die verantwoordelijk is voor het creëren van een manifestatie middels het voorbereiden van een steen of plaat voor lithografisch drukwerk. @nl
label: له شخص طباع على الحجر @ar
definition: يربط بين تجسيدة وشخص مسئول عن تصنيع تجسيدة بإعداد الحجر أو اللوح للطباعة الحجرية. @ar
scope note: يشمل الطباع على فنان الجرافيك الذي يصمم بشكل مباشر على السطح الذي سيتم منه الطباعة مباشرة. @ar
toolkit label: شخص طباع على الحجر @ar
toolkit definition: شخص مسئول عن تصنيع تجسيدة بإعداد الحجر أو اللوح للطباعة الحجرية. @ar
label: té com a persona litògrafa @ca
definition: Relaciona una manifestació amb una persona que és responsable de la creació d’una manifestació amb la preparació d’una pedra o una planxa per a la impressió litogràfica. @ca
scope note: Un litògraf inclou un artista gràfic que crea un disseny directament sobre la superfície a partir de la qual es farà la impressió. @ca
toolkit label: persona litògrafa @ca
toolkit definition: Persona que és responsable de la creació d’una manifestació amb la preparació d’una pedra o una planxa per a la impressió litogràfica. @ca
label: har person, som er litograf @da
definition: Relaterer en manifestation til en person, som er involveret i fremstillingen af en manifestation ved at klargøre en sten eller plade til litografisk trykning. @da
scope note: Litograf omfatter en grafiker, som skaber et design direkte på overfladen, hvorfra trykning vil blive udført. @da
toolkit label: person, som er litograf @da
toolkit definition: Person, som er involveret i fremstillingen af en manifestation ved at klargøre en sten eller plade til litografisk trykning. @da
label: litograaf (isik) @et
definition: Seostab kehastuse isikuga, kes osaleb kehastuse valmistamises, valmistades ette kivi või plaadi litograafiliste tõmmiste jaoks. @et
scope note: Litograaf hõlmab ka graafikut, kes loob kujutise otse pinnale, millelt toimub trükkimine. @et
toolkit label: litograaf (isik) @et
toolkit definition: Isik, kes osaleb kehastuse valmistamises, valmistades ette kivi või plaadi litograafiliste tõmmiste jaoks. @et
label: hat Lithografin/Lithograf (Person) @de
definition: Setzt eine Manifestation in Beziehung zu einer Person, die für die Herstellung einer Manifestation verantwortlich ist, indem sie einen Stein oder eine Platte für lithografischen Druck vorbereitet. @de
scope note: Darunter fallen Grafikerinnen/Grafiker, die ein Muster direkt auf der Oberfläche erstellen, von der aus gedruckt werden soll. @de
toolkit label: Lithografin/Lithograf (Person) @de
toolkit definition: Eine Person, die für die Herstellung einer Manifestation verantwortlich ist, indem sie einen Stein oder eine Platte für lithografischen Druck vorbereitet. @de
label: kőnyomatkészítő személye a következő: @hu
definition: Hozzákapcsol egy megjelenési formát egy személyhez, aki felelős egy megjelenési forma gyártásáért oly módon, hogy egy követ vagy lemezt készít elő litográfiai nyomtatáshoz, azaz kőnyomathoz. @hu
scope note: A litográfus egy grafikusművész, aki közvetlenül azon a felületen készít tervet, amelyről a nyomtatás történik. @hu
toolkit label: kőnyomatkészítő személy: @hu
toolkit definition: Egy személy, aki felelős egy megjelenési forma gyártásáért oly módon, hogy egy követ vagy lemezt készít elő litográfiai nyomtatáshoz, azaz kőnyomathoz. @hu
label: ha come litografo persona @it
definition: Correla una manifestazione alla persona coinvolta nella manifattura di una manifestazione, tramite la preparazione di una pietra o lastra per l'impressione litografica. @it
scope note: Un litografo comprende un artista grafico che crea un disegno direttamente sulla superficie da cui viene effettuata l'impressione. @it
toolkit label: litografo persona @it
toolkit definition: Persona coinvolta nella manifattura di una manifestazione, tramite la preparazione di una pietra o lastra per l'impressione litografica. @it
label: litogrāfs (persona) @lv
definition: Sasaista manifestāciju ar personu, kura iesaistīta manifestācijas ražošanā, sagatavojot akmeni vai iespiedplati litogrāfiskai pavairošanai. @lv
toolkit label: litogrāfs (persona) @lv
toolkit definition: Persona, kura iesaistīta manifestācijas ražošanā, sagatavojot akmeni vai iespiedplati litogrāfiskai pavairošanai. @lv
scope note: Litogrāfs ir arī grafiķis, kas veido dizainu tieši uz virsmas, no kuras materiāls tiks drukāts. @lv
sub property of: has printmaker person
label: 有平版制作者个人 @zh-hans
definition: 将一种载体表现与通过制作用于平版印刷的石头或平版而对一种载体表现的创建负责的一个个人关联起来。 @zh-hans
toolkit label: 平版制作者个人 @zh-hans
toolkit definition: 通过制作用于平版印刷的石头或平版而对一种载体表现的创建负责的一个个人 @zh-hans
scope note: 平版制作者包括直接在用于印刷的表面进行设计创作的平面美术家 @zh-hans
label: taş baskı sanatçısı kişisi ile ilişkilidir @tr
definition: Bir gösterimi, taş veya levhayı litografik baskı için hazırlayarak bir gösterim yaratmakla sorumlu olan kişiyle ilişkilendirir. @tr
toolkit label: taş basmacı kişisi @tr

has manifestation copyright statement
status: Published
type: Property
lexical alias: manifestationCopyrightStatement.en
definition: Relates a manifestation to a manifestation statement about a date that is associated with a claim of protection under copyright or a similar regime.
scope note: A copyright date includes a phonogram date that is associated with a claim of protection for an audio recording.
domain: C10007
toolkit label: manifestation copyright statement
toolkit definition: A manifestation statement about a date that is associated with a claim of protection under copyright or a similar regime.
sub property of: has manifestation statement
has element type: 6
label: manifestaation copyright-merkintö @fi
definition: Liittää manifestaation manifestaatiomerkintöön, joka kertoo copyright-säädöksen tai vastaavien säädösten alaiseen copyright-suojaukseen liittyvän ajankohdan. @fi
scope note: Copyright-vuodet käsittävät phonogram-vuodet, jotka liittyvät äänitallenteiden copyright-suojaukseen. @fi
toolkit label: manifestaation copyright-merkintö @fi
toolkit definition: Manifestaatiomerkintö, joka kertoo copyright-säädöksen tai vastaavien säädösten alaiseen copyright-suojaukseen liittyvän ajankohdan. @fi
label: har manifestasjonsopplysning om copyright @no
definition: Relaterer en manifestasjon til en manifestasjonsopplysning om en dato som knyttes til et krav om beskyttelse under copyright eller et lignende regime. @no
scope note: Dato for copyright inkluderer dato for fonogram som krever beskyttelse for lydopptak. @no
toolkit label: manifestasjonsopplysning om copyright @no
toolkit definition: En manifestasjonsopplysning om en dato som knyttes til et krav om beskyttelse under copyright eller et lignende regime. @no
label: a pour mention de manifestation sur le copyright @fr
definition: Met une manifestation en relation avec une mention de manifestation relative à une date qui est associée à une revendication de protection en vertu du copyright ou d’un régime similaire. @fr
scope note: Une date de copyright comprend une date de phonogramme qui est associée à une revendication de protection pour un enregistrement audio. @fr
toolkit label: mention de manifestation sur le copyright @fr
toolkit definition: Mention de manifestation relative à une date qui est associée à une revendication de protection en vertu du copyright ou d’un régime similaire. @fr
label: heeft manifestatie-copyrightvermelding @nl
definition: Relateert een manifestatie aan een manifestatievermelding over een datum die geassocieerd is met een claim van bescherming onder copyright of soortgelijk beleid. @nl
scope note: Een copyrightdatum omvat een phonogramdatum, die geassocieerd is met een claim van bescherming voor een geluidsopname. @nl
toolkit label: manifestatie-copyrightvermelding @nl
toolkit definition: Een manifestatievermelding over een datum die geassocieerd is met een claim van bescherming onder copyright of soortgelijk beleid. @nl
label: له بيان حقوق نشر لتجسيدة @ar
definition: يربط بين تجسيدة وبيان تجسيدة خاص بتاريخ مرتبط بالحماية تحت حقوق النشر أو أي نظام مشابه. @ar
scope note: يشمل تاريخ حقوق النشر تواريخ التسجيل الصوتي المرتبطة بإعلان حماية التسجيلات الصوتية @ar
toolkit label: بيان حقوق نشر لتجسيدة @ar
toolkit definition: بيان تجسيدة خاص بتاريخ مرتبط بالحماية تحت حقوق النشر أو أي نظام مشابه. @ar
label: té com a menció de manifestació de copyright @ca
definition: Relaciona una manifestació amb una menció de manifestació sobre una data que s’associa amb una declaració de protecció en virtut del copyright o d’un règim similar. @ca
scope note: Una data de copyright inclou una data de fonograma que s’associa amb una declaració de protecció per a un enregistrament àudio. @ca
toolkit label: menció de manifestació de copyright @ca
toolkit definition: Menció de manifestació sobre una data que s’associa amb una declaració de protecció en virtut del copyright o d’un règim similar. @ca
label: har manifestations copyrightoplysning @da
definition: Relaterer en manifestation til en manifestationsoplysning om en dato, som er knyttet til et beskyttelseskrav under copyright eller et lignende system. @da
scope note: Copyrightdatoer omfatter fonogramdatoer, som er knyttet til beskyttelseskrav for lydoptagelser. @da
toolkit label: manifestations copyrightoplysning @da
toolkit definition: Manifestationsoplysning om en dato, som er knyttet til et beskyttelseskrav under copyright eller et lignende system. @da
label: kehastuse copyright'i andmed @et
definition: Seostab kehastuse kehastuse andmetega ajavahemiku kohta, mis on seotud autoriõiguse vms õigusrežiimi kaitsega. @et
scope note: Copyright'i aastad hõlmavad ka fonogrammi aastaid, mis on seotud helisalvestise õiguskaitsega. @et
toolkit label: kehastuse copyright'i andmed @et
toolkit definition: Kehastuse andmed ajavahemiku kohta, mis on seotud autoriõiguse vms õigusrežiimi kaitsega. @et
label: hat Copyright-Angabe einer Manifestation @de
definition: Setzt eine Manifestation in Beziehung zu einer Manifestationsangabe zu einem Datum, das mit einem Schutzanspruch nach dem Urheberrecht oder einem ähnlichen Regelwerk in Verbindung steht. @de
scope note: Darunter fallen Phonogramm-Daten, das heißt Datumsangaben, die mit einem Schutzanspruch für Audioaufnahmen in Verbindung stehen. @de
toolkit label: Copyright-Angabe einer Manifestation @de
toolkit definition: Eine Manifestationsangabe zu einem Datum, das mit einem Schutzanspruch nach dem Urheberrecht oder einem ähnlichen Regelwerk in Verbindung steht. @de
label: szerzői jogra vonatkozó megjelenésiforma-közlése a következő: @hu
definition: Hozzákapcsol egy megjelenési formát egy időpontot jelölő megjelenésiforma-közléshez, amely a szerzői jog vagy egy hasonló szabályrendszer alapján támasztott védettségi követeléshez kapcsolódik. @hu
scope note: szerzői jogra vonatkozó megjelenésiforma-közlés @hu
toolkit label: Egy időpontot jelölő megjelenésiforma-közlés, amely a szerzői jog vagy egy hasonló szabályrendszer alapján támasztott védettségi követeléshez kapcsolódik. @hu
toolkit definition: A szerzői jogra vonatkozó időpontok magukban foglalnak hangfelvételek védettségi követelésével társított időpontokat is. @hu
label: ha come formulazione di manifestazione del copyright @it
definition: Correla una manifestazione a una formulazione di manifestazione su una data associata a una dichiarazione di protezione sotto copyright o un regime simile. @it
scope note: Le date di copyright comprendono le date di phonogram associate a dichiarazioni di protezione per registrazioni audio. @it
toolkit label: formulazione di copyright della manifestazione @it
toolkit definition: Formulazione di manifestazione su una data associata a una dichiarazione di protezione sotto copyright o un regime simile. @it
label: manifestācijas autortiesību ziņas @lv
definition: Sasaista manifestāciju ar manifestācijas ziņām par datējumu, kas saistīts ar prasību par autortiesību aizsardzību vai līdzīgiem nosacījumiem. @lv
scope note: Autortiesību datējumi ietver fonogrammu datējumus, kas saistīti ar audioierakstu aizsardzības prasībām. @lv
toolkit label: manifestācijas autortiesību ziņas @lv
toolkit definition: Manifestācijas ziņas par datējumu, kas saistīts ar prasību par autortiesību aizsardzību vai līdzīgiem nosacījumiem. @lv
label: 有载体表现版权说明 @zh-hans
definition: 将一种载体表现与关于版权或其他类似管理体系下和保护声明有关的一个日期的一个载体表现说明关联起来。 @zh-hans
scope note: 版权日期包括与录音保护声明有关的录音版权日期 @zh-hans
toolkit label: 载体表现版权说明 @zh-hans
toolkit definition: 关于版权或其他类似管理体系下和保护声明有关的一个日期的一个载体表现说明 @zh-hans
label: gösterimin telif hakkı bildirimi ile ilişkilidir @tr
definition: Bir gösterimi, telif hakkı veya benzeri bir beyan kapsamında koruma talebiyle ilişkili bir tarih hakkındaki bir gösterim beyanıyla ilişkilendirir. @tr
scope note: Bir telif hakkı tarihi, bir ses kaydı için koruma talebiyle ilişkili bir fonogram tarihini içerir. @tr
toolkit label: gösterim telif hakkı beyanı @tr

has manifestation designation of sequence statement
status: Published
type: Property
lexical alias: manifestationDesignationOfSequenceStatement.en
definition: Relates a manifestation to a manifestation statement about the numbering of a sequence of manifestations of the individual parts or iterations of a manifestation or parts or issues of a work.
scope note: A statement includes an alphanumeric or chronological designation.
domain: C10007
toolkit label: manifestation designation of sequence statement
toolkit definition: A manifestation statement about the numbering of a sequence of manifestations of the individual parts or iterations of a manifestation or parts or issues of a work.
sub property of: has manifestation statement
has element type: 6
label: manifestaation merkintö numerointijakson määritteestä @fi
definition: Liittää manifestaation manifestaatiomerkintöön manifestaation yksittäisten osien tai iteraatioiden tai teoksen yksittäisten osien tai numeroiden manifestaatioiden numerointijaksosta. @fi
scope note: Merkintö sisältää aakkosnumeerisen määritteen tai aikamääritteen. @fi
toolkit label: manifestaation merkintö numerointijakson määritteestä @fi
toolkit definition: Manifestaatiomerkintö manifestaation yksittäisten osien tai iteraatioiden tai teoksen yksittäisten osien tai numeroiden manifestaatioiden numerointijaksosta. @fi
label: har manifestasjonsopplysning om betegnelse for sekvens @no
definition: Relaterer en manifestasjon til en manifestasjonsopplysning om betegnelse for en sekvens av en manifestasjon av en del, et hefte eller en versjon av et diakronisk verk. @no
scope note: Opplysningen inkluderer en alfanumerisk eller kronologisk betegnelse. @no
toolkit label: manifestasjonsopplysning om betegnelse for sekvens @no
toolkit definition: En manifestasjonsopplysning om betegnelse for en sekvens av en manifestasjon av en del, et hefte eller en versjon av et diakronisk verk. @no
label: a pour mention de manifestation sur la désignation d’une séquence @fr
definition: Met une manifestation en relation avec une mention de manifestation relative à la numérotation d’une séquence de manifestations des parties ou itérations individuelles d’une manifestation ou des parties ou livraisons d’une œuvre. @fr
scope note: Une mention comprend une désignation alphanumérique ou chronologique. @fr
toolkit label: mention de manifestation sur la désignation d’une séquence @fr
toolkit definition: Mention de manifestation relative à la numérotation d’une séquence de manifestations des parties ou itérations individuelles d’une manifestation ou des parties ou livraisons d’une œuvre. @fr
label: heeft manifestatie-aanduiding van volgorde-vermelding @nl
definition: Relateert een manifestatie aan een manifestatievermelding over de nummering van een volgorde van manifestaties van de individuele delen of iteraties van een manifestatie of delen of afleveringen van een werk. @nl
scope note: Een vermelding omvat een alfanumerieke of chronologische aanduiding. @nl
toolkit label: manifestatie-aanduiding van volgorde-vermelding @nl
toolkit definition: Een manifestatievermelding over de nummering van een volgorde van manifestaties van de individuele delen of iteraties van een manifestatie of delen of afleveringen van een werk. @nl
label: له تسمية تجسيدة لبيان تسلسل @ar
definition: يربط بين تجسيدة وبيان تجسيدة خاص بتسمية تسلسل تجسيدة لجزء أو عدد أو لعمل ممتد زمنيا. @ar
scope note: يشتمل البيان على تسميات هجائية رقمية أو زمنية. @ar
toolkit label: تسمية تجسيدة لبيان تسلسل @ar
toolkit definition: بيان تجسيدة خاص بتسمية تسلسل تجسيدة لجزء أو عدد أو لعمل ممتد زمنيًا. @ar
label: té com a menció de manifestació de designació d’una seqüència @ca
definition: Relaciona una manifestació amb una menció de manifestació sobre la numeració d’una seqüència de manifestacions de les parts individuals o iteracions d’una manifestació o les parts o números d’una obra. @ca
scope note: Una menció inclou una designació alfanumèrica o cronològica. @ca
toolkit label: menció de manifestació de designació d’una seqüència @ca
toolkit definition: Menció de manifestació sobre la numeració d’una seqüència de manifestacions de les parts individuals o iteracions d’una manifestació o les parts o números d’una obra. @ca
label: har manifestationsoplysning for rækkefølgebetegnelse @da
definition: Relaterer en manifestation til en manifestationsoplysning om betegnelsen af en rækkefølge for en manifestation af en del, nummer eller iteration af et diakronisk værk. @da
scope note: Oplysning omfatter en alfanummerisk eller kronologisk betegnelse @da
toolkit label: manifestationsoplysning for rækkefølgebetegnelse @da
toolkit definition: Manifestationsoplysning om betegnelsen af en rækkefølge for en manifestation af en del, nummer eller iteration af et diakronisk værk. @da
label: kehastuse andmed nummerduse tähistuse kohta @et
definition: Seostab kehastuse kehastuse andmetega diakroonilise teose osa, numbri või seisu kehastuse nummerduse tähistuse kohta. @et
scope note: Andmed sisaldavad tähtnumbrilist või kronoloogilist tähistust. @et
toolkit label: kehastuse andmed nummerduse tähistuse kohta @et
toolkit definition: Kehastuse andmed diakroonilise teose osa, numbri või seisu kehastuse nummerduse tähistuse kohta. @et
label: hat Manifestationsangabe zur Bezeichnung einer fortlaufenden Ressource @de
definition: Setzt eine Manifestation in Beziehung zu einer Manifestationsangabe, die die Zählung einzelner Ausgaben einer fortlaufenden Ressource oder einzelner Teile oder Ausgaben eines Werks enthält. @de
scope note: Darunter fallen alphanumerische oder chronologische Bezeichnungen. @de
toolkit label: Manifestationsangabe zur Bezeichnung einer fortlaufenden Ressource @de
toolkit definition: Eine Manifestationsangabe, die die Zählung einzelner Ausgaben einer fortlaufenden Ressource oder einzelner Teile oder Ausgaben eines Werks enthält. @de
label: sorrendiséget jelölő megjelenésiforma-közlése a következő: @hu
definition: Egy megjelenési formát hozzákapcsol egy sorrendiséget jelölő megjelenésiforma-közléshez, amely egy megjelenési forma részének, számának vagy egy diakronikus mű iterációjának sorrendiségét jelöli. @hu
scope note: sorrendiség-jelölő megjelenésiforma-közlés @hu
toolkit label: Egy megjelenésiforma-közlés a megjelenési forma sorrendiség-jelöléséről, amely egy rész, szám vagy egy diakronikus mű iterációja. @hu
toolkit definition: Egy közlés, amely egy alfanumerikus vagy kronológikus jelölést tartalmaz. @hu
label: ha come formulazione di manifestazione di designazione di una sequenza @it
definition: Correla una manifestazione a una formulazione di manifestazione relativa alla designazione di una sequenza di una manifestazione di una parte, fascicolo o iterazione di un'opera diacronica. @it
scope note: La formulazione comprende una designazione alfanumerica o cronologica. @it
toolkit label: formulazione designazione di una sequenza della manifestazione @it
toolkit definition: Formulazione di manifestazione relativa alla designazione di una sequenza di una manifestazione di una parte, fascicolo o iterazione di un'opera diacronica. @it
label: manifestācijas secības apzīmējuma ziņas @lv
definition: Sasaista manifestāciju ar manifestācijas ziņām par diahroniska darba daļu, laidienu vai iterāciju secību. @lv
scope note: Ziņas ietver burtciparu vai hronoloģisku apzīmējumu. @lv
toolkit label: manifestācijas secības apzīmējuma ziņas @lv
toolkit definition: Manifestācijas ziņas par diahroniska darba daļu, laidienu vai iterāciju secību. @lv
label: 有序列说明的载体表现标识 @zh-hans
definition: 将一种载体表现与关于一种载体表现个别部分或更新后整体或者一种作品的部分或期的载体表现的序列之编号的一个载体表现说明关联起来。 @zh-hans
scope note: 说明包括字母数字或年代标识 @zh-hans
toolkit label: 序列说明的载体表现标识 @zh-hans
toolkit definition: 关于一种载体表现个别部分或更新后整体或者一种作品的部分或期的载体表现的序列之编号的一个载体表现说明 @zh-hans
label: gösterimin sıralandırma bildirimi ile ilişkilidir @tr
definition: Bir gösterimi, bireysel parçaların bir gösterim dizisinin numaralandırılması veya bir gösterimin veya bir eserin bölümlerinin veya gösterimin yinelenmesiyle ilgili bir gösterim ifadesiyle ilişkilendirir. @tr
scope note: Bir bildirim, alfasayısal veya kronolojik bir belirteç içerir. @tr
toolkit label: dizi ifadesinin gösterim adı @tr

has manifestation dissertation statement
status: Published
type: Property
lexical alias: manifestationDissertationStatement.en
definition: Relates a manifestation to a manifestation statement about thesis or other dissertation information.
scope note: A statement includes any or all of a degree title, year of award, or granting institution.
domain: C10007
toolkit label: manifestation dissertation statement
toolkit definition: A manifestation statement about thesis or other dissertation information.
sub property of: has manifestation statement
has element type: 6
label: manifestaation väitöskirjamerkintö @fi
definition: Liittää manifestaation manifestaatiomerkintöön opinnäytteen tai väitöskirjan tiedoista. @fi
scope note: Merkintö sisältää jonkin tai kaikki seuraavista: akateeminen oppiarvo, oppiarvon myöntämisvuosi ja oppiarvon myöntävä laitos. @fi
toolkit label: manifestaation väitöskirjamerkintö @fi
toolkit definition: Manifestaatiomerkintö opinnäytteen tai väitöskirjan tiedoista. @fi
label: har manifestasjonsopplysning om doktoravhandling @no
definition: Relaterer en manifestasjon til en manifestasjonsopplysning om data knyttet til tesen og annen informasjon om avhandlingen. @no
scope note: Opplysningen inkluderer gradstittel eller gradstitlene, år for tildeling og tildelende institusjon. @no
toolkit label: manifestasjonsopplysning om doktoravhandling @no
toolkit definition: En manifestasjonsopplysning om data knyttet til tesen og annen informasjon om avhandlingen. @no
label: a pour mention de manifestation sur une thèse ou un mémoire @fr
definition: Met une manifestation en relation avec une mention de manifestation relative à de l’information sur une thèse ou un mémoire. @fr
scope note: Une mention comprend une partie ou la totalité des informations suivantes : nom de grade, année d’obtention ou institution conférant le grade. @fr
toolkit label: mention de manifestation sur une thèse ou un mémoire @fr
toolkit definition: Mention de manifestation relative à de l’information sur une thèse ou un mémoire. @fr
label: heeft manifestatie-proefschriftvermelding @nl
definition: Relateert een manifestatie aan een manifestatievermelding over proefschrift of andere dissertatie informatie. @nl
scope note: Een vermelding omvat een of alle van een graad. jaar van toekenning, en toekennende instelling @nl
toolkit label: manifestatie-proefschriftvermelding @nl
toolkit definition: Een manifestatievermelding over proefschrift of andere dissertatie informatie. @nl
label: له بيان تجسيدة أطروحة @ar
definition: يربط بين تجسيدة وبيان تجسيدة خاص ببيانات مرتبطة بأطروحة والمعلومات الأخرى عن الرسائل. @ar
scope note: يشتمل البيان على أي أو كل من الدرجة العلمية، وسنة الحصول، والجامعة المانحة. @ar
toolkit label: بيان تجسيدة أطروحة @ar
toolkit definition: بيان تجسيدة خاص ببيانات مرتبطة بأطروحة والمعلومات الأخرى عن الرسائل. @ar
label: té com a menció de manifestació de dissertació @ca
definition: Relaciona una manifestació amb una menció de manifestació sobre la tesi o altra informació de la dissertació. @ca
scope note: Una menció inclou, en tot o en part, un títol acadèmic, un any d’obtenció o una institució que concedeix títols acadèmics. @ca
toolkit label: menció de manifestació de tesi @ca
toolkit definition: Menció de manifestació sobre la tesi o altra informació de la dissertació. @ca
label: har manifestations afhandlingsoplysning @da
definition: Relaterer en manifestation til en manifestationsoplysning om data, som relaterer til speciale og anden information fra afhandlinger. @da
scope note: Oplysning omfatter hvilken som helst eller alle af: gradsbetegnelse, tildelingsårstal og tildelende organisation. @da
toolkit label: manifestations afhandlingsoplysning @da
toolkit definition: Manifestationsoplysning om data, som relaterer til speciale og anden information fra afhandlinger. @da
label: kehastuse andmed väitekirja kohta @et
definition: Seostab kehastuse kehastuse andmetega, mis puudutavad kraaditööd või dissertatsiooni. @et
scope note: Andmed sisaldavad kraadi nimetust, selle andmise aastat ja kraadi andnud asutuse nime, või vähemalt ühte neist. @et
toolkit label: kehastuse andmed väitekirja kohta @et
toolkit definition: Kehastuse andmed, mis puudutavad kraaditööd või dissertatsiooni. @et
label: hat Hochschulschriftenvermerk einer Manifestation @de
definition: Setzt eine Manifestation in Beziehung zu einer Manifestationsangabe, die Angaben zum Hochschulschriftenvermerk enthält. @de
scope note: Darunter fallen eine, mehrere oder alle der folgenden Angaben: akademischer Titel, Jahr der Vergabe oder verleihende Institution. @de
toolkit label: Hochschulschriftenvermerk einer Manifestation @de
toolkit definition: Eine Manifestationsangabe, die Angaben zum Hochschulschriftenvermerk enthält. @de
label: disszertációra vonatkozó megjelenésiforma-közlése a következő: @hu
definition: Hozzákapcsol egy megjelenési formát egy szakdolgozatról vagy disszertációról szóló információ megjelenésiforma-közléséhez. @hu
scope note: disszertációs megjelenésiforma-közlés @hu
toolkit label: Egy szakdolgozatról vagy disszertációról szóló információ megjelenésiforma-közlés. @hu
toolkit definition: Egy közlés, amely tartalmazza a fokozat címét, odaítélésének évét és a fokozatot kiadó intézményt. @hu
label: ha come formulazione di manifestazione su una dissertazione @it
definition: Correla una manifestazione a una formulazione di manifestazione sui dati relativi a una tesi e altre informazioni su una dissertazione. @it
scope note: La formulazione comprende, del tutto o in parte, il titolo accademico, l'anno in cui il titolo è stato conferito e l'istituzione o facoltà conferente. @it
toolkit label: formulazione di dissertazione della manifestazione @it
toolkit definition: Formulazione di manifestazione sui dati relativi a una tesi e altre informazioni su una dissertazione. @it
label: disertācijas manifestācijas ziņas @lv
definition: Sasaista manifestāciju ar manifestācijas ziņām par datiem, kas saistīti ar tēžu un citu disertācijas informāciju. @lv
scope note: Ziņas ietver daļēju vai pilnu informāciju par grāda nosaukumu, piešķiršanas gadu vai piešķīrējiestādi. @lv
toolkit label: disertācijas manifestācijas ziņas @lv
toolkit definition: Manifestācijas ziņas par datiem, kas saistīti ar tēžu un citu disertācijas informāciju. @lv
label: 有载体表现学位论文说明 @zh-hans
definition: 将一种载体表现与关于毕业论文或其他学位论文信息的一个载体表现说明关联起来。 @zh-hans
scope note: 说明包括学位名称、授予年或授予机构这些中的任何一个或者全部。 @zh-hans
toolkit label: 载体表现学位论文说明 @zh-hans
toolkit definition: 关于毕业论文或其他学位论文信息的一个载体表现说明 @zh-hans
label: gösterimin tez bildirimi ile ilişkilidir @tr
definition: Bir gösterimi, tez veya diğer tez bilgileriyle ilgili bir gösterim beyanıyla ilişkilendirir. @tr
scope note: Bir bildirim, bir derece unvanının, ödül yılının veya veren kurumun herhangi birini veya tamamını içerir. @tr
toolkit label: gösterimin tez beyanı @tr

has manifestation distribution statement
status: Published
type: Property
lexical alias: manifestationDistributionStatement.en
definition: Relates a manifestation to a manifestation statement about data relating to the distribution of a published manifestation.
scope note: A statement includes any or all of place or date of distribution or name of distributor.
domain: C10007
toolkit label: manifestation distribution statement
toolkit definition: A manifestation statement about data relating to the distribution of a published manifestation.
sub property of: has manifestation statement
has element type: 6
label: manifestaation jakelumerkintö @fi
definition: Liittää manifestaation manifestaatiomerkintöön julkaistun manifestaation jakeluun liittyvistä tiedoista. @fi
scope note: Merkintö sisältää jonkin tai kaikki seuraavista: jakelupaikka, jakeluaika ja jakelijan nimi. @fi
toolkit label: manifestaation jakelumerkintö @fi
toolkit definition: Manifestaatiomerkintö julkaistun manifestaation jakeluun liittyvistä tiedoista. @fi
label: har manifestasjonsopplysning om distribusjon @no
definition: Relaterer en manifestasjon til en manifestasjonsopplysning om data knyttet til distribusjonen av en publisert manifestasjon. @no
scope note: Opplysningen inkluderer alle steder og datoer for distribusjon og navn på distributør. @no
toolkit label: manifestasjonsopplysning om distribusjon @no
toolkit definition: En manifestasjonsopplysning om data knyttet til distribusjonen av en publisert manifestasjon. @no
label: a pour mention de manifestation sur la diffusion ou la distribution @fr
definition: Met une manifestation en relation avec une mention de manifestation relative à des données sur la diffusion ou la distribution d’une manifestation publiée. @fr
scope note: Une mention comprend une partie ou la totalité des informations suivantes : lieu et date de diffusion ou de distribution ou nom de diffuseur ou de distributeur. @fr
toolkit label: mention de manifestation sur la diffusion ou la distribution @fr
toolkit definition: Mention de manifestation relative à des données sur la diffusion ou la distribution d’une manifestation publiée. @fr
label: heeft manifestatie-distributievermelding @nl
definition: Relateert een manifestatie aan een manifestatievermelding over gegevens gerelateerd aam de verspreiding van een gepubliceerde manifestatie. @nl
scope note: Een vermelding omvat een of alle van plaats of datum van distributie of naam van distributeur @nl
toolkit label: manifestatie-distributievermelding @nl
toolkit definition: Een manifestatievermelding over gegevens gerelateerd aam de verspreiding van een gepubliceerde manifestatie. @nl
label: له بيان توزيع تجسيدة @ar
definition: يربط بين تجسيدة وبيان تجسيدة خاص ببيانات التوزيع لتجسيدة منشورة. @ar
scope note: يشتمل البيان على أي أو كل من مكان وتاريخ التوزيع والموزع. @ar
toolkit label: بيان توزيع تجسيدة @ar
toolkit definition: بيان تجسيدة خاص ببيانات التوزيع لتجسيدة منشورة. @ar
label: té com a menció de manifestació de distribució @ca
definition: Relaciona una manifestació amb una menció de manifestació sobre la distribució d’una manifestació publicada. @ca
scope note: Una menció inclou, en tot o en part, el lloc o la data de distribució o el nom de distribuïdor. @ca
toolkit label: menció de manifestació de distribució @ca
toolkit definition: Menció de manifestació sobre la distribució d’una manifestació publicada. @ca
label: har manifestations distributionsoplysning @da
definition: Relaterer en manifestation til en manifestationsoplysning om data, som relaterer til distributionen af en publiceret manifestation. @da
scope note: Oplysning omfatter hvilken som helst eller alle af: sted, dato for distribution og navn på distributør. @da
toolkit label: manifestations distributionsoplysning @da
toolkit definition: Manifestationsoplysning om data, som relaterer til distributionen af en publiceret manifestation. @da
label: kehastuse levitamisandmed @et
definition: Seostab kehastuse kehastuse andmetega, mis puudutavad avaldatud kehastuse levitamist. @et
scope note: Andmed sisaldavad levitamise kohta, daatumit ja levitaja nime, või vähemalt ühte neist. @et
toolkit label: kehastuse levitamisandmed @et
toolkit definition: Kehastuse andmed, mis puudutavad avaldatud kehastuse levitamist. @et
label: hat Vertriebsangabe einer Manifestation @de
definition: Setzt eine Manifestation in Beziehung zu einer Manifestationsangabe, die Daten zum Vertrieb einer veröffentlichten Manifestation enthält. @de
scope note: Darunter fallen eine, mehrere oder alle der folgenden Angaben: Vertriebsort, Vertriebsdatum oder Vertriebsname. @de
toolkit label: Vertriebsangabe einer Manifestation @de
toolkit definition: Eine Manifestationsangabe, die Daten zum Vertrieb einer veröffentlichten Manifestation enthält. @de
label: terjesztésre vonatkozó megjelenésiforma-közlése a következő: @hu
definition: Hozzákapcsol egy megjelenési formát egy kiadott megjelenési forma terjesztésével kapcsolatos adatokról szóló megjelenésiforma-közléshez. @hu
scope note: terjesztési megjelenésiforma-közlés @hu
toolkit label: Egy kiadott megjelenési forma terjesztésével kapcsolatos adatokról szóló megjelenésiforma-közlés. @hu
toolkit definition: Egy közlés, amely tartalmazza terjesztés valamennyi vagy összes helyét és terjesztő nevét. @hu
label: ha come formulazione di manifestazione di distribuzione @it
definition: Correla una manifestazione a una formulazione di manifestazione sui dati relativi alla distribuzione di una manifestazione pubblicata. @it
scope note: La formulaziome comprende, del tutto o in parte, il luogo e la data di distribuzione, e il nome del distributore. @it
toolkit label: formulazione di distribuzione della manifestazione @it
toolkit definition: Formulazione di manifestazione sui dati relativi alla distribuzione di una manifestazione pubblicata. @it
label: manifestācijas izplatīšanas ziņas @lv
definition: Sasaista manifestāciju ar manifestācijas ziņām par datiem, kas saistīti ar publicētās manifestācijas izplatīšanu. @lv
scope note: Ziņas ietver daļēju vai pilnu informāciju par izplatīšanas vietu un datējumu, un par izplatītāju. @lv
toolkit label: manifestācijas izplatīšanas ziņas @lv
toolkit definition: Manifestācijas ziņas par datiem, kas saistīti ar publicētās manifestācijas izplatīšanu. @lv
label: 有载体表现发行说明 @zh-hans
definition: 将一种载体表现与关于和一种出版载体表现的发行有关的数据的一个载体表现说明关联起来。 @zh-hans
scope note: 说明包括发行地或发行日期或发行者名称这些中的任何一个或者全部 @zh-hans
toolkit label: 载体表现发行说明 @zh-hans
toolkit definition: 关于和一种出版载体表现的发行有关的数据的一个载体表现说明 @zh-hans
label: gösterimin dağıtım bildirimi ile ilişkilidir @tr
definition: Bir gösterimin, yayınlanan bir gösterimin dağıtımıyla ilgili verilerle ilgili bir gösterim beyanıyla ilişkilendirir. @tr
scope note: Bir bildirim, dağıtım yerinin veya tarihinin veya distribütörün adının herhangi birini veya tamamını içerir. @tr
toolkit label: gösterim dağıtım beyanı @tr

has manifestation edition statement
status: Published
type: Property
lexical alias: manifestationEditionStatement.en
definition: Relates a manifestation to a manifestation statement about an edition to which a manifestation belongs.
scope note: A statement includes any or all of designation of edition or named revision of edition, or a statement of responsibility relating to an edition or revision.
domain: C10007
toolkit label: manifestation edition statement
toolkit definition: A manifestation statement about an edition to which a manifestation belongs.
sub property of: has manifestation statement
has element type: 6
label: manifestaation painosmerkintö @fi
definition: Liittää manifestaation manifestaatiomerkintöön painoksesta, johon manifestaatio kuuluu. @fi
scope note: Merkintö sisältää jonkin tai kaikki seuraavista: painoksen tai nimetyn uudistetun painoksen määrite sekä painokseen tai uudistettuun painokseen liittyvä vastuullisuusmerkintö. @fi
toolkit label: manifestaation painosmerkintö @fi
toolkit definition: Manifestaatiomerkintö painoksesta, johon manifestaatio kuuluu. @fi
label: har manifestasjonsopplysning om utgave @no
definition: Relaterer en manifestasjon til en manifestasjonsopplysning om en utgave som en manifestasjon tilhører. @no
scope note: Opplysningene inkluderer alle betegnelsene for utgave eller bestemt revisjon av utgave og en ansvarsangivelse som er knyttet til en utgave eller revisjon. @no
toolkit label: manifestasjonsopplysning om utgave @no
toolkit definition: En manifestasjonsopplysning om en utgave som en manifestasjon tilhører. @no
label: a pour mention de manifestation sur l’édition @fr
definition: Met une manifestation en relation avec une mention de manifestation relative à une édition à laquelle appartient une manifestation. @fr
scope note: Une mention comprend une partie ou la totalité des informations suivantes : désignation d’édition ou d’une révision nommée d’une édition ou mention de responsabilité relative à une édition ou à une révision. @fr
toolkit label: mention de manifestation sur l’édition @fr
toolkit definition: Mention de manifestation relative à une édition à laquelle appartient une manifestation. @fr
label: heeft manifestatie-editievermelding @nl
definition: Relateert een manifestatie aan een manifestatievermelding over een editie waartoe een manifestatie behoort. @nl
scope note: Een vermelding omvat een of alle van aanduiding van editie of benoemde herziening van editie, of een vermelding van verantwoordelijkheid met betrekking tot een editie of herziening. @nl
toolkit label: manifestatie-editievermelding @nl
toolkit definition: Een manifestatievermelding over een editie waartoe een manifestatie behoort. @nl
label: له بيان طبعة تجسيدة @ar
definition: يربط بين تجسيدة وبيان تجسيدة خاص عن طبعة التي تنتمي إليها تجسيدة. @ar
scope note: البيان يشتمل على أي أو كل من تسميات الطبعة أو المراجعة المسماة لطبعة، و بيان المسئولية المرتبط بطبعة أو مراجعة. @ar
toolkit label: بيان طبعة تجسيدة @ar
toolkit definition: بيان تجسيدة خاص عن طبعة التي تنتمي إليها تجسيدة. @ar
label: té com a menció de manifestació d’edició @ca
definition: Relaciona una manifestació amb una menció de manifestació sobre una edició a la qual pertany una manifestació. @ca
scope note: Una menció inclou, en tot o en part, la designació d’edició o una revisió explícita d’edició o una menció de responsabilitat relativa a una edició o una revisió. @ca
toolkit label: menció de manifestació d’edició @ca
toolkit definition: Menció de manifestació sobre una edició a la qual pertany una manifestació. @ca
label: har manifestations udgaveoplysning @da
definition: Relaterer en manifestation til en manifestationsoplysning om en udgave, hvortil en manifestation tilhører. @da
scope note: Oplysning omfatter hvilken som helst eller alle af: udgavebetegnelse, udgaverevision og en ophavsangivelse, som relaterer til en udgave eller revision. @da
toolkit label: manifestations udgaveoplysning @da
toolkit definition: Manifestationsoplysning om en udgave, hvortil en manifestation tilhører. @da
label: kehastuse editsiooniandmed @et
definition: Seostab kehastuse kehastuse andmetega editsiooni kohta, millesse kehastus kuulub. @et
scope note: Andmed sisaldavad editsiooni või editsiooni nimelise uusversiooni tähistust ja editsiooniga või uusversiooniga seotud vastutusandmeid, või vähemalt ühte neist. @et
toolkit label: kehastuse editsiooniandmed @et
toolkit definition: Kehastuse andmed editsiooni kohta, millesse kehastus kuulub. @et
label: hat Ausgabevermerk einer Manifestation @de
definition: Setzt eine Manifestation in Beziehung zu einer Manifestationsangabe, die eine Ausgabe bezeichnet, zu der eine Manifestation gehört. @de
scope note: Darunter fallen eine, mehrere oder alle der folgenden Angaben: Ausgabebezeichnung oder Ausgabezeichnung einer näher erläuterten Überarbeitung oder eine Verantwortlichkeitsangabe, die sich auf eine Ausgabe oder eine näher erläuterte Überarbeitung bezieht. @de
toolkit label: Ausgabevermerk einer Manifestation @de
toolkit definition: Eine Manifestationsangabe, die eine Ausgabe bezeichnet, zu der eine Manifestation gehört. @de
label: kiadásra vonatkozó megjelenésiforma-közlése a következő: @hu
definition: Hozzákapcsol egy megjelenési formát a megjelenési forma kiadásáról szóló megjelenésiforma-közléshez. @hu
scope note: kiadási megjelenésiforma-közlés @hu
toolkit label: Egy megjelenési forma kiadásáról szóló megjelenésiforma-közlés. @hu
toolkit definition: Egy közlés, amely tartalmazza kiadás valamennyi vagy összes jelölését vagy kiadás módosított megnevezését és terjesztő nevét. @hu
label: ha come formulazione di manifestazione dell'edizione @it
definition: Correla una manifestazione a una formulazione di manifestazione relativa a un'edizione a cui appartiene una manifestazione. @it
scope note: La formulazione comprende, del tutto o in parte, la designazione di edizione o revisione identificata di edizione, e una formulazione di responsabilità relativa a un'edizione o revisione di un'edizione. @it
toolkit label: formulazione di edizione della manifestazione @it
toolkit definition: Formulazione di manifestazione relativa a un'edizione a cui appartiene una manifestazione. @it
label: manifestācijas izdevuma ziņas @lv
definition: Sasaista manifestāciju ar manifestācijas ziņām par izdevumu, kuram manifestācija ir piederīga. @lv
scope note: Ziņas ietver daļēju vai pilnu informāciju par izdevumu vai izdevuma pārskatīšanu, un ziņas par atbildību saistībā ar izdevumu vai tā pārskatīšanu. @lv
toolkit label: manifestācijas izdevuma ziņas @lv
toolkit definition: Manifestācijas ziņas par izdevumu, kuram manifestācija ir piederīga. @lv
label: 有载体表现版本说明 @zh-hans
definition: 将一种载体表现与关于一种载体表现所属于的一个版本的一个载体表现说明关联起来。 @zh-hans
scope note: 说明包括版本或版本的命名修订的标识或者和版本或修订有关的责任说明这些中的任何一个或者全部。 @zh-hans
toolkit label: 载体表现版本说明 @zh-hans
toolkit definition: 关于一种载体表现所属于的一个版本的一个载体表现说明 @zh-hans
label: gösterimin basım bildirimi ile ilişkilidir @tr
definition: Bir gösterimi, bir gösterimin ait olduğu bir baskı hakkındaki bir gösterim ifadesiyle ilişkilendirir. @tr
scope note: Bir bildirim, baskının herhangi bir veya tüm belirtecini veya baskının adlandırılmış revizyonunu veya bir baskı veya revizyonla ilgili bir sorumluluk bildirimini içerir. @tr
toolkit label: Gösterim baskı beyanı @tr

has manifestation frequency statement
status: Published
type: Property
lexical alias: manifestationFrequencyStatement.en
definition: Relates a manifestation to a manifestation statement about an interval at which the manifestations of parts, issues, or iterations of a diachronic work are issued.
domain: C10007
toolkit label: manifestation frequency statement
toolkit definition: A manifestation statement about an interval at which the manifestations of parts, issues, or iterations of a diachronic work are issued.
sub property of: has manifestation statement
has element type: 6
label: manifestaation ilmestymistiheysmerkintö @fi
definition: Liittää manifestaation manifestaatiomerkintöön tiheydestä, jolla diakronisen teoksen osien, numeroiden tai iteraatioiden manifestaatiot ilmestyvät. @fi
toolkit label: manifestaation ilmestymistiheysmerkintö @fi
toolkit definition: Manifestaatiomerkintö tiheydestä, jolla diakronisen teoksen osien, numeroiden tai iteraatioiden manifestaatiot ilmestyvät. @fi
label: har manifestasjonsopplysning om frekvens @no
definition: Relaterer en manifestasjon til en manifestasjonsopplysning om et intervall som manifestasjoner av deler, hefter eller versjoner av et diakronisk verk utgis i. @no
toolkit label: manifestasjonsopplysning om frekvens @no
toolkit definition: En manifestasjonsopplysning om et intervall som manifestasjoner av deler, hefter eller versjoner av et diakronisk verk utgis i. @no
label: a pour mention de manifestation sur la périodicité @fr
definition: Met une manifestation en relation avec une mention de manifestation relative à l’intervalle de temps suivant lequel les manifestations de parties, livraisons ou itérations d’une œuvre diachronique sont publiées. @fr
toolkit label: mention de manifestation sur la périodicité @fr
toolkit definition: Mention de manifestation relative à l’intervalle de temps suivant lequel les manifestations de parties, livraisons ou itérations d’une œuvre diachronique sont publiées. @fr
label: heeft manifestatie-frequentievermelding @nl
definition: Relateert een manifestatie aan een manifestatievermelding over een interval waarmee de manifestatie van delen, afleveringen of iteraties van een diachronisch werk zijn uitgevaardigd. @nl
toolkit label: manifestatie-frequentievermelding @nl
toolkit definition: Een manifestatievermelding over een interval waarmee de manifestatie van delen, afleveringen of iteraties van een diachronisch werk zijn uitgevaardigd. @nl
label: له بيان تتابع تجسيدة @ar
definition: يربط بين تجسيدة وبيان تجسيدة خاص بمدة تصدر وفقًا لها التجسيدة الخاصة بجزء، أو عدد، أو لعمل ممتد زمنيًاً. @ar
toolkit label: بيان تتابع تجسيدة @ar
toolkit definition: بيان تجسيدة خاص بمدة تصدر وفقًا لها التجسيدة الخاصة بجزء، أو عدد، أو لعمل ممتد زمنيًاً. @ar
label: té com a menció de manifestació de periodicitat @ca
definition: Relaciona una manifestació amb una menció de manifestació sobre un interval en el qual es publiquen les manifestacions de les parts, els números o les iteracions d’una obra diacrònica. @ca
toolkit label: menció de manifestació de periodicitat @ca
toolkit definition: Menció de manifestació sobre un interval en el qual es publiquen les manifestacions de les parts, els números o les iteracions d’una obra diacrònica. @ca
label: har oplysning om manifestations hyppighed @da
definition: Relaterer en manifestation til en manifestationsoplysning om et interval, hvor manifestationerne af dele, numre eller iterationer af et diakronisk værk er udgivet. @da
toolkit label: oplysning om manifestations hyppighed @da
toolkit definition: Manifestationsoplysning om et interval, hvor manifestationerne af dele, numre eller iterationer af et diakronisk værk er udgivet. @da
label: kehastuse ilmumissageduse andmed @et
definition: Seostab kehastuse kehastuse andmetega intervalli kohta, millega diakroonilise teose osade, numbrite või seisude kehastused avaldatakse. @et
toolkit label: kehastuse ilmumissageduse andmed @et
toolkit definition: Kehastuse andmed intervalli kohta, millega diakroonilise teose osade, numbrite või seisude kehastused avaldatakse. @et
label: hat Angabe zur Erscheinungsfrequenz einer Manifestation @de
definition: Setzt eine Manifestation in Beziehung zu einer Manifestationsangabe die angibt, in welchem Intervall die Manifestationen von Teilen, Ausgaben oder Iterationen eines diachronen Werks erscheinen. @de
toolkit label: Angabe zur Erscheinungsfrequenz einer Manifestation @de
toolkit definition: Eine Manifestationsangabe die angibt, in welchem Intervall die Manifestationen von Teilen, Ausgaben oder Iterationen eines diachronen Werks erscheinen. @de
label: gyakoriságra vonatkozó megjelenésiforma-közlése a következő: @hu
definition: Hozzákapcsol egy megjelenési formát egy időközről szóló megjelenésiforma-közléshez, amely alatt egy diakronikus mű részeit, számait, iterációit kiadják. @hu
toolkit label: gyakorisági megjelenésiforma-közlés @hu
toolkit definition: Egy időközről szóló megjelenésiforma-közlés, amely alatt egy diakronikus mű részeit, számait, iterációit kiadják. @hu
label: ha come formulazione di manifestazione della periodicità @it
definition: Correla una manifestazione a una formulazione di manifestazione relativa alla cadenza con cui sono pubblicate le manifestazioni di parti, fascicoli, o iterazioni di un'opera diacronica. @it
toolkit label: formulazione di periodicità della manifestazione @it
toolkit definition: Formulazione di manifestazione relativa alla cadenza con cui sono pubblicate le manifestazioni di parti, fascicoli, o iterazioni di un'opera diacronica. @it
label: manifestācijas periodiskuma ziņas @lv
definition: Sasaista manifestāciju ar manifestācijas ziņām par intervālu/periodiskumu, kurā izdod diahroniskā darba daļas, laidienus vai iterācijas.. @lv
toolkit label: manifestācijas periodiskuma ziņas @lv
toolkit definition: Manifestācijas ziņas par intervālu/periodiskumu, kurā izdod diahroniskā darba daļas, laidienus vai iterācijas.. @lv
label: 有载体表现频率说明 @zh-hans
definition: 将一种载体表现与关于一种历时作品的部分、期或更新后的整体的载体表现发行的时间间隔的载体表现说明关联起来。 @zh-hans
toolkit label: 载体表现频率说明 @zh-hans
toolkit definition: 关于一种历时作品的部分、期或更新后的整体的载体表现发行的时间间隔的载体表现说明 @zh-hans
label: gösterimin yayın sıklığının bildirimi ile ilişkilidir @tr
definition: Bir gösterimi, artzamanlı bir çalışmanın parçalarının, sorunlarının veya yinelemelerinin ortaya çıkışlarının yayınlandığı bir aralık hakkında bir gösterim ifadesiyle ilişkilendirir. @tr
toolkit label: gösterim sıklığı beyanı @tr
toolkit definition: Bir artzamanlı eserin bölümlerinin, sayılarının veya yinelemelerinin gösterimlerinin yayımlandığı aralıkla ilgili bir gösterim bildirisi. @tr
label: tiene declaración de frecuencia de manifestación @es
definition: Relaciona una manifestación con un enunciado de manifestación sobre un intervalo en el que se emiten las manifestaciones de partes, temas o iteraciones de una obra diacrónica. @es
toolkit label: declaración de frecuencia de manifestación @es
toolkit definition: Un enunciado de manifestación sobre un intervalo en el que se emiten las manifestaciones de partes, temas o iteraciones de una obra diacrónica. @es
has subproperty: P30285

has manifestation identifier statement
status: Published
type: Property
lexical alias: manifestationIdentifierStatement.en
definition: Relates a manifestation to a manifestation statement about a code, number, or other string, usually independent of natural language and social naming conventions, used to identify a work, expression, or manifestation.
scope note: A statement includes any or all of fingerprint, plate and publisher number for notated music, ISSN of series or subseries, or other identifier for manifestation.
domain: C10007
toolkit label: manifestation identifier statement
toolkit definition: A manifestation statement about a code, number, or other string, usually independent of natural language and social naming conventions, used to identify a work, expression, or manifestation.
sub property of: has manifestation statement
has element type: 6
label: manifestaation tunnistemerkintö @fi
definition: Liittää manifestaation manifestaatiomerkintöön koodista, numerosta tai muusta merkkijonosta, joka on luonnollisesta kielestä ja kielen sosiaalisista konventioista riippumaton teoksen, ekspression tai manifestaation tunnistamiskeino. @fi
scope note: Merkintö sisältää jonkin tai kaikki seuraavista: sormenjälkitunniste, nuottiaineiston laatan ja kustantajan numero, sarjan tai alasarjan ISSN sekä muut manifestaation tunnisteet. @fi
toolkit label: manifestaation tunnistemerkintö @fi
toolkit definition: Manifestaatiomerkintö koodista, numerosta tai muusta merkkijonosta, joka on luonnollisesta kielestä ja kielen sosiaalisista konventioista riippumaton teoksen, ekspression tai manifestaation tunnistamiskeino. @fi
label: har manifestasjonsopplysning om identifikator @no
definition: Relaterer en manifestasjon til en manifestasjonsopplysning om en kode, et nummer eller annen streng som, oftest uavhengig av naturlig språk og sosiale navnekonvensjoner, brukes for å identifisere et verk, uttrykk eller en manifestasjon. @no
scope note: Opplysningene inkluderer alle fingeravtrykk, plate og utgivernummer for nedskrevet musikk, ISSN for serie og underserie og andre identifikatorer for manifestasjon. @no
toolkit label: manifestasjonsopplysning om identifikator @no
toolkit definition: En manifestasjonsopplysning om en kode, et nummer eller annen streng som, oftest uavhengig av naturlig språk og sosiale navnekonvensjoner, brukes for å identifisere et verk, uttrykk eller en manifestasjon. @no
label: a pour mention de manifestation sur un identifiant @fr
definition: Met une manifestation en relation avec une mention de manifestation relative à un code, à un nombre ou à une autre chaîne, généralement indépendante du langage naturel et des conventions sociales de dénomination, utilisée pour identifier une œuvre, une expression ou une manifestation. @fr
scope note: Une mention comprend une partie ou la totalité des informations suivantes : empreinte, cotage et numéro d’éditeur pour la musique notée, ISSN de collection ou de sous-collection ou tout autre identifiant de manifestation. @fr
toolkit label: mention de manifestation sur un identifiant @fr
toolkit definition: Mention de manifestation relative à un code, à un nombre ou à une autre chaîne, généralement indépendante du langage naturel et des conventions sociales de dénomination, utilisée pour identifier une œuvre, une expression ou une manifestation. @fr
label: heeft manifestatie-identificatievermelding @nl
definition: Relateert een manifestatie aan een manifestatievermelding over een code, nummer of andere string, meestal onafhankelijk van natuurlijke taal en sociale naamgevingsconventies, gebruikt om een werk, expressie of manifestatie te identificeren. @nl
scope note: Een vermelding omvat een of alle van vingerafdruk, plaat- en uitgeversnummer voor bladmuziek, ISSN van reeks of onderreeks, of andere identificatie voor manifestatie. @nl
toolkit label: manifestatie-identificatievermelding @nl
toolkit definition: Een manifestatievermelding over een code, nummer of andere string, meestal onafhankelijk van natuurlijke taal en sociale naamgevingsconventies, gebruikt om een werk, expressie of manifestatie te identificeren. @nl
label: له بيان معرف تجسيدة @ar
definition: يربط بين تجسيدة وبيان تجسيدة خاص برمز أو رقم أو أي رمز يستخدم عادة مختلف عن اللغة الطبيعية والمعنى الاجتماعي الدارج، ويستخدم عادة لتحديد عمل، أو تعبيرة، أو تجسيدة. @ar
scope note: يشتمل البيان على أي أو كل من البصمة واللوحة ورقم الناشر لنوتة موسيقية، الترقيم الدولي الموحد للدوريات، أو السلاسل الفرعية، وأي معرف آخر للتجسيدة. @ar
toolkit label: بيان معرف تجسيدة @ar
toolkit definition: بيان تجسيدة خاص برمز أو رقم أو أي رمز يستخدم عادة مختلف عن اللغة الطبيعية والمعنى الاجتماعي الدارج، ويستخدم عادة لتحديد عمل، أو تعبيرة، أو تجسيدة. @ar
label: té com a menció de manifestació d’identificador @ca
definition: Relaciona una manifestació amb una menció de manifestació sobre un codi, un número o qualsevol altra cadena, normalment independent del llenguatge natural i de les convencions lingüístiques socials, usada per identificar una obra, una expressió o una manifestació. @ca
scope note: Una menció inclou, en tot o en part, l’empremta, el número de planxa i el número d’editor de música notada, l’ISSN de col·lecció o subcol·lecció o qualsevol altre identificador de manifestació. @ca
toolkit label: menció de manifestació d’identificador @ca
toolkit definition: Menció de manifestació sobre un codi, un número o qualsevol altra cadena, normalment independent del llenguatge natural i de les convencions lingüístiques socials, usada per identificar una obra, una expressió o una manifestació. @ca
label: har manifestationsoplysning om identifikator @da
definition: Relaterer en manifestation til en manifestationsoplysning om en kode, nummer eller anden streng, sædvanligvis upåvirket af normalsprog og navngivningskonventioner brugt til at identificere et værk, udtryk eller manifestation. @da
scope note: Oplysning omfatter hvilken som helst eller alle af: fingeraftryk, plade- og editionsnummer for noteret musik, ISSN for serie eller underserie og anden identifikator for manifestation. @da
toolkit label: manifestationsoplysning om identifikator @da
toolkit definition: Manifestationsoplysning om en kode, nummer eller anden streng, sædvanligvis upåvirket af normalsprog og navngivningskonventioner brugt til at identificere et værk, udtryk eller manifestation. @da
label: kehastuse identifikaatori andmed @et
definition: Seostab kehastuse kehastuse andmetega teost, väljendust või kehastust identifitseeriva koodi, numbri või muu loomulikust keelest ja üldtuntud nimetamistavadest sõltumatu stringi kohta. @et
scope note: Andmed hõlmavad fingerprint-identifikaatorit, noodi trükiplaadi või kirjastajanumbrit, seeria või allseeria ISSNi ja muud kehastuse identifikaatorit, või vähemalt ühte neist. @et
toolkit label: kehastuse identifikaatori andmed @et
toolkit definition: Kehastuse andmed teost, väljendust või kehastust identifitseeriva koodi, numbri või muu loomulikust keelest ja üldtuntud nimetamistavadest sõltumatu stringi kohta. @et
label: hat Angaben zum Identifikator einer Manifestation @de
definition: Setzt eine Manifestation in Beziehung zu einer Manifestationsangabe, die aus einem Code, einer Nummer oder einer anderen Zeichenkette besteht, der/die normalerweise nicht in natürlicher Sprache und unabhängig von den sozialen Benennungskonventionen ist und zur Identifizierung eines Werks, einer Expression oder einer Manifestation verwendet wird. @de
scope note: Darunter fallen eine, mehrere oder alle der folgenden Angaben: Fingerprint, Druckplattennummer für Noten und Noten-Bestellnummern, ISSN für eine Reihe oder Unterreihe oder andere Identifikatoren einer Manifestation. @de
toolkit label: Angaben zum Identifikator einer Manifestation @de
toolkit definition: Eine Manifestationsangabe, die aus einem Code, einer Nummer oder einer anderen Zeichenkette besteht, der/die normalerweise nicht in natürlicher Sprache und unabhängig von den sozialen Benennungskonventionen ist und zur Identifizierung eines Werks, einer Expression oder einer Manifestation verwendet wird. @de
label: azonosítóra vonatkozó megjelenésiforma-közlése a következő: @hu
definition: Hozzákapcsol egy megjelenési formát egy kód-, szám-, vagy más típusú karakterláncból álló megjelenésiforma-közléshez, amely általában független a természetes nyelvektől és társadalmi névkonvencióktól, és egy mű, kifejezési forma, vagy megjelenési forma azonosítására használják. @hu
scope note: azonosító megjelenésiforma-közlés @hu
toolkit label: Egy kód-, szám-, vagy más típusú karakterláncból álló megjelenésiforma-közlés, amely általában független a természetes nyelvektől és társadalmi névkonvencióktól, és egy mű, kifejezési forma, vagy megjelenési forma azonosítására használják. @hu
toolkit definition: Egy közlés, amely tartalmaz valamennyi vagy minden ujjlenyomatot, zenei lejegyzés lemez- és kiadói számát, sorozat vagy alsorozat ISSN-jét és a megjelenési forma egyéb azonosítóját. @hu
label: ha come formulazione di manifestazione di identificatore @it
definition: Correla una manifestazione a una formulazione di manifestazione relativa a un codice, numero, o altra stringa, solitamente indipendente dal linguaggio naturale e dalle convenzioni sociali di denominazione, usata per identificare un'opera, espressione, o manifestazione. @it
scope note: La formulazione comprende, del tutto o in parte, l'impronta, il numero dell'editore e di lastra per la musica notata, l'ISSN delle serie e sottoserie, e altri identificatori per la manifestazione. @it
toolkit label: formulazione di identificatore della manifestazione @it
toolkit definition: Formulazione di manifestazione relativa a un codice, numero, o altra stringa, solitamente indipendente dal linguaggio naturale e dalle convenzioni sociali di denominazione, usata per identificare un'opera, espressione, o manifestazione. @it
label: manifestācijas identifikatora ziņas @lv
definition: Sasaista manifestāciju ar manifestācijas ziņām par kodu, numuru vai citu virkni, kas parasti ir neatkarīga no dabiskās valodas un sabiedrībā lietotā nosaukuma, ko izmanto, lai identificētu darbu, izteiksmi vai manifestāciju. @lv
scope note: Ziņas ietver daļēju vai pilnu informāciju par identificējošo zīmju virkni, plātnes (nošu) un izdevēja numuru, ISSN numuru sērijām vai apakšsērijām vai citu manifestācijas identifikatoru. @lv
toolkit label: manifestācijas identifikatora ziņas @lv
toolkit definition: Manifestācijas ziņas par kodu, numuru vai citu virkni, kas parasti ir neatkarīga no dabiskās valodas un sabiedrībā lietotā nosaukuma, ko izmanto, lai identificētu darbu, izteiksmi vai manifestāciju. @lv
label: 有载体表现标识符说明 @zh-hans
definition: 将一种载体表现与关于通常独立于自然语言和社会命名惯例、用以标识一种作品、内容表达或载体表现的代码、数字或其他串的一个载体表现说明关联起来。 @zh-hans
scope note: 说明包括指纹、乐谱的版号和出版者编号、丛编或分丛编的ISSN、或载体表现的其他标识符这些中的任何一个或者全部 @zh-hans
toolkit label: 载体表现标识符说明 @zh-hans
toolkit definition: 关于通常独立于自然语言和社会命名惯例、用以标识一种作品、内容表达或载体表现的代码、数字或其他串的一个载体表现说明 @zh-hans
label: gösterimin tanımlayıcısının bildirimi ile ilişkilidir @tr
definition: Bir gösterimi, bir eseri, ifadeyi veya gösterimi tanımlamak için kullanılan, genellikle doğal dilden ve sosyal adlandırma geleneklerinden bağımsız olarak, bir kod, sayı veya başka bir dizi hakkında bir gösterim ifadesiyle ilişkilendirir. @tr
scope note: Bir bildirim, parmak izinin herhangi birini veya tamamını, notalı müzik için plaka ve yayıncı numarasını, seri veya alt serilerin ISSN'sini veya gösterim için diğer tanımlayıcıları içerir. @tr
toolkit label: gösterimin tanımlayıcı beyanı @tr

has manifestation manufacture statement
status: Published
type: Property
lexical alias: manifestationManufactureStatement.en
definition: Relates a manifestation to a manifestation statement about data relating to the printing, duplicating, casting, or other method of manufacturing of a published manifestation.
scope note: A statement includes any or all of place or date of manufacture or name of manufacturer.
domain: C10007
toolkit label: manifestation manufacture statement
toolkit definition: A manifestation statement about data relating to the printing, duplicating, casting, or other method of manufacturing of a published manifestation.
sub property of: has manifestation statement
has element type: 6
label: manifestaation valmistusmerkintö @fi
definition: Liittää manifestaation manifestaatiomerkintöön julkaistun manifestaation painamiseen, monistamiseen, kirjasinten valamiseen tai muuhun valmistustapaan liittyvistä tiedoista. @fi
scope note: Merkintö sisältää jonkin tai kaikki seuraavista: valmistuspaikka, valmistusaika ja valmistajan nimi. @fi
toolkit label: manifestaation valmistusmerkintö @fi
toolkit definition: Manifestaatiomerkintö julkaistun manifestaation painamiseen, monistamiseen, kirjasinten valamiseen tai muuhun valmistustapaan liittyvistä tiedoista. @fi
label: har manifestasjonsopplysning for framstilling @no
definition: Relaterer en manifestasjon til en manifestasjonsopplysning om data knyttet til trykking, mangfoldiggjøring, rollebesettelse etc. av en publisert manifestasjon. @no
scope note: Opplysningene inkluderer alle steder og datoer for framstilling og navn på tilvirker. @no
toolkit label: manifestasjonsopplysning for framstilling @no
toolkit definition: En manifestasjonsopplysning om data knyttet til trykking, mangfoldiggjøring, rollebesettelse etc. av en publisert manifestasjon. @no
label: a pour mention de manifestation sur la fabrication @fr
definition: Met une manifestation en relation avec une mention de manifestation relative à des données sur l’impression, la reproduction, le moulage ou toute autre méthode de fabrication d’une manifestation publiée. @fr
scope note: Une mention comprend une partie ou la totalité des informations suivantes : lieu ou date de fabrication ou nom de fabricant. @fr
toolkit label: mention de manifestation sur la fabrication @fr
toolkit definition: Mention de manifestation relative à des données sur l’impression, la reproduction, le moulage ou toute autre méthode de fabrication d’une manifestation publiée. @fr
label: heeft manifestatie-vervaardigersvermelding @nl
definition: Relateert een manifestatie aan een manifestatievermelding over gegevens gerelateerd aan het drukken, vermenigvuldigen, gieten of andere methode van het vervaardigen van een gepubliceerde manifestatie. @nl
scope note: Een vermelding omvat een of alle van plaats en datum van vervaardiging en naam van vervaardiger. @nl
toolkit label: manifestatie-vervaardigersvermelding @nl
toolkit definition: Een manifestatievermelding over gegevens gerelateerd aan het drukken, vermenigvuldigen, gieten of andere methode van het vervaardigen van een gepubliceerde manifestatie. @nl
label: له بيان تصنيع لتجسيدة @ar
definition: يربط بين تجسيدة وبيان تجسيدة خاص بطباعة، أو نسخ، أو صب، إلخ. لتجسيدة منشورة. @ar
scope note: يشتمل البيان على أي أو كل من مكان وتاريخ الصناعة واسم الصانع. @ar
toolkit label: بيان تصنيع لتجسيدة @ar
toolkit definition: بيان تجسيدة خاص بطباعة، أو نسخ، أو صب، إلخ. لتجسيدة منشورة. @ar
label: té com a menció de manifestació de fabricació @ca
definition: Relaciona una manifestació amb una menció de manifestació sobre la impressió, la reproducció, el modelat o un altre mètode de fabricació d’una manifestació publicada. @ca
scope note: Una menció inclou, en tot o en part, el lloc o la data de fabricació o el nom de fabricant. @ca
toolkit label: menció de manifestació de fabricació @ca
toolkit definition: Menció de manifestació sobre la impressió, la reproducció, el modelat o un altre mètode de fabricació d’una manifestació publicada. @ca
label: kehastuse valmistamisandmed @et
definition: Seostab kehastuse kehastuse andmetega avaldatud kehastuse trükkimise, paljundamise, valamise vms kohta. @et
scope note: Andmed sisaldavad valmistamise kohta, daatumit ja valmistaja nime, või vähemalt ühte neist. @et
toolkit label: kehastuse valmistamisandmed @et
toolkit definition: Kehastuse andmed avaldatud kehastuse trükkimise, paljundamise, valamise vms kohta. @et
label: hat Herstellungsangabe einer Manifestation @de
definition: Setzt eine Manifestation in Beziehung zu einer Manifestationsangabe, die Daten zum Druck, zur Vervielfältigung, zum Guss oder zu einer anderen Herstellungsmethode einer veröffentlichten Manifestation enthält. @de
scope note: Darunter fallen eine, mehrere oder alle der folgenden Angaben: Herstellungsort, Herstellungsdatum oder Herstellername. @de
toolkit label: Herstellungsangabe einer Manifestation @de
toolkit definition: Eine Manifestationsangabe, die Daten zum Druck, zur Vervielfältigung, zum Guss oder zu einer anderen Herstellungsmethode einer veröffentlichten Manifestation enthält. @de
label: gyártásra vonatkozó megjelenésiforma-közlése a következő: @hu
definition: Egy megjelenési formát hozzákapcsol egy olyan megjelenésiforma-közléshez, amely egy közzétett megjelenési forma nyomtatásával, sokszorosításával, öntésével stb. kapcsolatos adatokat tartalmaz @hu
scope note: gyártási megjelenésiforma-közlés @hu
toolkit label: Egy megjelenésiforma-közlés, amely egy közzétett megjelenési forma nyomtatásával, sokszorosításával, öntésével stb. kapcsolatos adatokat tartalmaz @hu
toolkit definition: Egy közlés, amely tartalmazza gyártás valamennyi vagy összes helyét, dátumát és a gyártó nevét. @hu
label: ha come formulazione di manifestazione di manifattura @it
definition: Correla una manifestazione a una formulazione di manifestazione sui dati relativi alla stampa. duplicazione, fusione, etc. di una manifestazione pubblicata. @it
scope note: La formulazione comprende, del tutto o in parte, il luogo e la data della manifattura, e nome della manifattura. @it
toolkit label: formulazione di manifattura della manifestazione @it
toolkit definition: Formulazione di manifestazione sui dati relativi alla stampa. duplicazione, fusione, etc. di una manifestazione pubblicata. @it
label: manifestācijas ražošanas ziņas @lv
definition: Sasaista manifestāciju ar manifestācijas ziņām par datiem, kas saistīti ar publicētas manifestācijas drukāšanu, pavairošanu, salikšanu u.tml. @lv
scope note: Ziņas ietver daļēju vai pilnu informāciju par izgatavošanas vietu un datējumu un izgatavotāja nosaukumu. @lv
toolkit label: manifestācijas ražošanas ziņas @lv
toolkit definition: Manifestācijas ziņas par datiem, kas saistīti ar publicētas manifestācijas drukāšanu, pavairošanu, salikšanu u.tml. @lv
label: har manifestationsoplysning om producent @da
definition: Relaterer en manifestation til en manifestationsoplysning om data vedrørende trykning, kopiering, støbning, eller anden fremstillingsmetode for en publiceret manifestation. @da
scope note: Oplysning omfatter et eller alle sted for produktion eller navne på producent. @da
toolkit label: manifestationsoplysning om producent @da
toolkit definition: Manifestationsoplysning om data vedrørende trykning, kopiering, støbning, eller anden fremstillingsmetode for en publiceret manifestation. @da
label: 有载体表现生产说明 @zh-hans
definition: 将一种载体表现与关于和一种出版载体表现的印刷、复制、铸造或其他生产方法有关的数据的一个载体表现说明关联起来。 @zh-hans
scope note: 说明包括生产地或生产日期或生产者名称这些中的任何一个或者全部 @zh-hans
toolkit label: 载体表现生产说明 @zh-hans
toolkit definition: 关于和一种出版载体表现的印刷、复制、铸造或其他生产方法有关的数据的一个载体表现说明 @zh-hans
label: gösterimin üretim bildirimi ile ilişkilidir @tr
definition: Bir gösterimi, yayınlanan bir gösterimin basılması, çoğaltılması, dökümü veya başka bir üretim yöntemiyle ilgili veriler hakkında bir gösterim bildirimiyle ilişkilendirir. @tr
scope note: Bir bildirim, üretim yeri veya tarihinin veya üreticinin adının herhangi birini veya tamamını içerir. @tr
toolkit label: gösterim üretim beyanı @tr

has manifestation production statement
status: Published
type: Property
lexical alias: manifestationProductionStatement.en
definition: Relates a manifestation to a manifestation statement about data relating to the inscription, fabrication, construction, or other method of production of an unpublished manifestation.
scope note: A statement includes any or all of place or date of production or name of producer.
domain: C10007
toolkit label: manifestation production statement
toolkit definition: A manifestation statement about data relating to the inscription, fabrication, construction, or other method of production of an unpublished manifestation.
sub property of: has manifestation statement
has element type: 6
label: manifestaation tuotantomerkintö @fi
definition: Liittää manifestaation manifestaatiomerkintöön julkaisemattoman manifestaation kaivertamiseen, valmistamiseen, kokoamiseen tai muuhun tuotantotapaan liittyvistä tiedoista. @fi
scope note: Merkintö sisältää jonkin tai kaikki seuraavista: tuotantopaikka, tuotantoaika ja tuottajan nimi. @fi
toolkit label: manifestaation tuotantomerkintö @fi
toolkit definition: Manifestaatiomerkintö julkaisemattoman manifestaation kaivertamiseen, valmistamiseen, kokoamiseen tai muuhun tuotantotapaan liittyvistä tiedoista. @fi
label: har manifestasjonsopplysning om produksjon @no
definition: Relaterer en manifestasjon til en manifestasjonsopplysning om data knyttet til inskripsjon, fabrikasjon, konstruksjon etc. av en upublisert manifestasjon. @no
scope note: Opplysningen inkluderer alle steder og datoer for produksjon og navn på produsent. @no
toolkit label: manifestasjonsopplysning om produksjon @no
toolkit definition: En manifestasjonsopplysning om data knyttet til inskripsjon, fabrikasjon, konstruksjon etc. av en upublisert manifestasjon. @no
label: a pour mention de manifestation sur la production @fr
definition: Met une manifestation en relation avec une mention de manifestation relative à des données sur la scription, la fabrication, la construction ou toute autre méthode de production d’une manifestation non publiée. @fr
scope note: Une mention comprend une partie ou la totalité des informations suivantes : lieu ou date de production ou nom de producteur. @fr
toolkit label: mention de manifestation sur la production @fr
toolkit definition: Mention de manifestation relative à des données sur la scription, la fabrication, la construction ou toute autre méthode de production d’une manifestation non publiée. @fr
label: heeft manifestatie-productievermelding @nl
definition: Relateert een manifestatie aan een manifestatievermelding over gegevens gerelateerd aan de afschrijving, vervaardiging, constructie of andere methode van productie van een ongepubliceerde manifestatie. @nl
scope note: Een vermelding omvat een of alle van plaats en datum van productie en naam van producent. @nl
toolkit label: manifestatie-productievermelding @nl
toolkit definition: Een manifestatievermelding over gegevens gerelateerd aan de afschrijving, vervaardiging, constructie of andere methode van productie van een ongepubliceerde manifestatie. @nl
label: له بيان إنتاج لتجسيدة @ar
definition: يربط بين تجسيدة وبيان تجسيدة خاص بتسجيل، أو تصنيع، أو إنشاء، إلخ. لتجسيدة غير منشورة. @ar
scope note: يشتمل البيان على أي أو كل من مكان وتاريخ الإنتاج واسم المنتج. @ar
toolkit label: بيان إنتاج لتجسيدة @ar
toolkit definition: بيان تجسيدة خاص بتسجيل، أو تصنيع، أو إنشاء، إلخ. لتجسيدة غير منشورة. @ar
label: té com a menció de manifestació de producció @ca
definition: Relaciona una manifestació amb una menció de manifestació sobre dades relatives a la inscripció, la fabricació, la construcció o un altre mètode de producció d’una manifestació no publicada. @ca
scope note: Una menció inclou, en tot o en part, el lloc o la data de producció o el nom de productor. @ca
toolkit label: menció de manifestació de producció @ca
toolkit definition: Menció de manifestació sobre dades relatives a la inscripció, la fabricació, la construcció o un altre mètode de producció d’una manifestació no publicada. @ca
label: har manifestationsoplysning om produktion @da
definition: Relaterer en manifestation til en manifestationsoplysning om data, som relaterer til indskrift, fremstilling, konstruktion etc. af en upubliceret manifestation. @da
scope note: Oplysning omfatter hvilken som helst eller alle af: sted, dato for produktion og navn på producer. @da
toolkit label: manifestations produktionsoplysning @da
toolkit definition: Manifestationsoplysning om data, som relaterer til indskrift, fremstilling, konstruktion etc. af en upubliceret manifestation. @da
label: kehastuse tootmisandmed @et
definition: Seostab kehastuse kehastuse andmetega avaldamata kehastuse inskribeerimise, tootmise, ehitamise vms kohta. @et
scope note: Andmed sisaldavad tootmise kohta, daatumit ja tootja nime, või vähemalt ühte neist. @et
toolkit label: kehastuse tootmisandmed @et
toolkit definition: Kehastuse andmed avaldamata kehastuse inskribeerimise, tootmise, ehitamise vms kohta. @et
label: hat Entstehungsangabe einer Manifestation @de
definition: Setzt eine Manifestation in Beziehung zu einer Manifestationsangabe, die Daten zu der Beschriftung, der Fabrikation, der Konstruktion oder einer anderen Entstehungsmethode einer unveröffentlichten Manifestation enthält. @de
scope note: Darunter fallen eine, mehrere oder alle der folgenden Angaben: Entstehungsort, Entstehungsdatum oder Erzeugername. @de
toolkit label: Entstehungsangabe einer Manifestation @de
toolkit definition: Eine Manifestationsangabe, die Daten zu der Beschriftung, der Fabrikation, der Konstruktion oder einer anderen Entstehungsmethode einer unveröffentlichten Manifestation enthält. @de
label: előállításra vonatkozó megjelenésiforma- közlése a következő: @hu
definition: Egy megjelenési formát hozzákapcsol egy olyan megjelenésiforma-közléshez, amely egy közzé nem tett megjelenési forma bejegyzésével, elkészítésével, megépítésével stb. kapcsolatos adatokat tartalmaz @hu
scope note: készítési megjelenésiforma-közlés @hu
toolkit label: Egy megjelenésiforma-közlés, amely egy közzé nem tett megjelenési forma bejegyzésével, elkészítésével, megépítésével stb. kapcsolatos adatokat tartalmaz @hu
toolkit definition: Egy közlés, amely tartalmazza előállítás valamennyi vagy összes helyét, dátumát és az előállító nevét. @hu
label: ha come formulazione di manifestazione di produzione @it
definition: Correla una manifestazione a una formulazione di manifestazione sui dati relativi all'iscrizione, fabbricazione, costruzione, etc. di una manifestazione non pubblicata. @it
scope note: La formulazione comprende, del tutto o in parte, il luogo e la data di produzione, e il nome del produttore. @it
toolkit label: formulazione di produzione della manifestazione @it
toolkit definition: Formulazione di manifestazione sui dati relativi all'iscrizione, fabbricazione, costruzione, etc. di una manifestazione non pubblicata. @it
label: manifestācijas izgatavošanas ziņas @lv
definition: Sasaista manifestāciju ar manifestācijas ziņām par datiem, kas saistīti ar nepublicētas manifestācijas ierakstīšanu, izgatavošanu, izveidošanu u.tml. @lv
scope note: Ziņas ietver daļēju vai pilnu informāciju par izgatavošanas vietu un datējumu un izgatavotāja nosaukumu. @lv
toolkit label: manifestācijas izgatavošanas ziņas @lv
toolkit definition: Manifestācijas ziņas par datiem, kas saistīti ar nepublicētas manifestācijas ierakstīšanu, izgatavošanu, izveidošanu u.tml. @lv
label: 有载体表现制作说明 @zh-hans
definition: 将一种载体表现与关于和一种非出版载体表现的镌刻、制造、构建或其他制作方法有关的数据的一个载体表现说明关联起来。 @zh-hans
scope note: 说明包括制作地或制作日期或制作者名称这些中的任何一个或者全部 @zh-hans
toolkit label: 载体表现制作说明 @zh-hans
toolkit definition: 关于和一种非出版载体表现的镌刻、制造、构建或其他制作方法有关的数据的一个载体表现说明 @zh-hans
label: gösterimin yapım bildirimi ile ilişkilidir @tr
definition: Bir gösterimi, yayınlanmamış bir gösterimin yazımı, üretimi, inşası veya diğer üretim yöntemleriyle ilgili veriler hakkındaki bir gösterim beyanıyla ilişkilendirir. @tr
scope note: Bir bildirim üretim yeri veya tarihinin veya üreticinin adının herhangi birini veya tamamını içerir. @tr
toolkit label: gösterim üretim beyanı @tr

has manifestation publication statement
status: Published
type: Property
lexical alias: manifestationPublicationStatement.en
definition: Relates a manifestation to a manifestation statement about the publication, release, or issuing of a manifestation.
scope note: A statement includes any or all of place or date of publication or name of publisher.
domain: C10007
toolkit label: manifestation publication statement
toolkit definition: A manifestation statement about the publication, release, or issuing of a manifestation.
sub property of: has manifestation statement
has element type: 6
label: manifestaation julkaisumerkintö @fi
definition: Liittää manifestaation manifestaatiomerkintöön manifestaation kustantamiseen, julkaisemiseen, ilmestymiseen tms. liittyvistä tiedoista. @fi
scope note: Merkintö sisältää jonkin tai kaikki seuraavista: kustannuspaikka, julkaisuaika ja kustantajan nimi. @fi
toolkit label: manifestaation julkaisumerkintö @fi
toolkit definition: Manifestaatiomerkintö manifestaation kustantamiseen, julkaisemiseen, ilmestymiseen tms. liittyvistä tiedoista. @fi
label: har manifestasjonsopplysning om utgivelse @no
definition: Relaterer en manifestasjon til en manifestasjonsopplysning om utgivelse, tilgjengeliggjøring eller utstedelse av en manifestasjon. @no
scope note: Opplysningen inkluderer alle steder og datoer for utgivelse og navn på utgiver. @no
toolkit label: manifestasjonsopplysning om utgivelse @no
toolkit definition: En manifestasjonsopplysning om utgivelse, tilgjengeliggjøring eller utstedelse av en manifestasjon. @no
label: a pour mention de manifestation sur la publication @fr
definition: Met une manifestation en relation avec une mention de manifestation relative à la publication, à la mise à disposition ou à l’édition d’une manifestation. @fr
scope note: Une mention comprend une partie ou la totalité des informations suivantes : lieu ou date de publication ou nom d’éditeur. @fr
toolkit label: mention de manifestation sur la publication @fr
toolkit definition: Mention de manifestation relative à la publication, à la mise à disposition ou à l’édition d’une manifestation. @fr
label: heeft manifestatie-publicatievermelding @nl
definition: Relateert een manifestatie aan een manifestatievermelding over het uitgeven, uitbrengen of uitvaardigen van een manifestatie. @nl
scope note: Een vermelding omvat een of alle van plaats of datum van publicatie of naam van uitgever. @nl
toolkit label: manifestatie-publicatievermelding @nl
toolkit definition: Een manifestatievermelding over het uitgeven, uitbrengen of uitvaardigen van een manifestatie. @nl
label: له بيان نشر لتجسيدة @ar
definition: يربط بين تجسيدة وبيان تجسيدة خاص بالنشر أو الإصدار لتجسيدة. @ar
scope note: يشتمل البيان على أي أو كل من مكان وتاريخ النشر واسم الناشر. @ar
toolkit label: بيان نشر لتجسيدة @ar
toolkit definition: بيان تجسيدة خاص بالنشر أو الإصدار لتجسيدة. @ar
label: té com a menció de manifestació de publicació @ca
definition: Relaciona una manifestació amb una menció de manifestació sobre la publicació, la posada en circulació o l’emissió d’una manifestació. @ca
scope note: Una menció inclou, en tot o en part, el lloc o la data de publicació o el nom d’editor. @ca
toolkit label: menció de manifestació de publicació @ca
toolkit definition: Menció de manifestació sobre la publicació, la posada en circulació o l’emissió d’una manifestació. @ca
label: har manifestations publiceringsoplysning @da
definition: Relaterer en manifestation til en manifestationsoplysning om publiceringen, frigivelse eller udgivelse af en manifestation. @da
scope note: Oplysning omfatter hvilken som helst eller alle af: sted, dato for udgivelse og navn på udgiver. @da
toolkit label: manifestations publiceringsoplysning @da
toolkit definition: Manifestationsoplysning om publiceringen, frigivelse eller udgivelse af en manifestation. @da
label: kehastuse ilmumisandmed @et
definition: Seostab kehastuse kehastuse andmetega kehastuse avaldamise, väljalaskmise või väljaandmise kohta. @et
scope note: Andmed sisaldavad ilmumiskohta, ilmumisaastat ja kirjastaja nime, või vähemalt ühte neist. @et
toolkit label: kehastuse ilmumisandmed @et
toolkit definition: Kehastuse andmed kehastuse avaldamise, väljalaskmise või väljaandmise kohta. @et
label: hat Veröffentlichungsangabe einer Manifestation @de
definition: Setzt eine Manifestation in Beziehung zu einer Manifestationsangabe, die Informationen über die Veröffentlichung, das Release oder die Herausgabe einer Manifestation enthält. @de
scope note: Darunter fallen eine, mehrere oder alle der folgenden Angaben: Erscheinungsort, Erscheinungsdatum oder Verlagsname. @de
toolkit label: Veröffentlichungsangabe einer Manifestation @de
toolkit definition: Eine Manifestationsangabe, die Informationen über die Veröffentlichung, das Release oder die Herausgabe einer Manifestation enthält. @de
label: közzétételre vonatkozó megjelenésiforma-közlése a következő: @hu
definition: Hozzákapcsol egy megjelenési formát egy megjelenési forma kiadásához, kibocsájtásához vagy megjelentetéséről szóló megjelenésiforma-közléshez. @hu
scope note: megjelenési megjelenésiforma-közlés @hu
toolkit label: Egy megjelenési forma kiadásához, kibocsájtásához vagy megjelentetéséről szóló megjelenésiforma-közlés. @hu
toolkit definition: Egy közlés, amely tartalmazza a közzététel valamennyi vagy összes helyét, dátumát és a kiadó nevét. @hu
label: ha come formulazione di manifestazione di pubblicazione @it
definition: Correla una manifestazione a una formulazione di manifestazione sulla publicazione, diffusione o emissione di una manifestazione. @it
scope note: La formulazione comprende, del tutto o in parte, il luogo e la data di pubblicazione, e il nome dell'editore. @it
toolkit label: formulazione di pubblicazione della manifestazione @it
toolkit definition: Formulazione di manifestazione sulla publicazione, diffusione o emissione di una manifestazione. @it
label: manifestācijas izdošanas ziņas @lv
definition: Sasaista manifestāciju ar manifestācijas ziņām par manifestācijas publicēšanu, izlaidi vai izdošanu u.tml. @lv
scope note: Ziņas ietver daļēju vai pilnu informāciju par izgatavošanas vietu un datējumu un izgatavotāja nosaukumu. @lv
toolkit label: manifestācijas izdošanas ziņas @lv
toolkit definition: Manifestācijas ziņas par manifestācijas publicēšanu, izlaidi vai izdošanu u.tml. @lv
label: 有载体表现出版说明 @zh-hans
definition: 将一种载体表现与关于一种载体表现出版、发布或发行的一个载体表现说明关联起来。 @zh-hans
scope note: 说明包括出版地或出版日期或出版者名称这些中的任何一个或者全部 @zh-hans
toolkit label: 载体表现出版说明 @zh-hans
toolkit definition: 关于一种载体表现出版、发布或发行的一个载体表现说明 @zh-hans
label: gösterimin yayınlama bildirimi ile ilişkilidir @tr
definition: Bir gösterimi, bir gösterimin yayınlanması, gösterime sunulması veya yayınlanmasıyla ilgili bir gösterim beyanıyla ilişkilendirir. @tr
scope note: Bir bildirim, yayın yeri veya tarihinin veya yayıncının adının herhangi birini veya tamamını içerir. @tr
toolkit label: gösterim yayın beyanı @tr

has manifestation regional encoding statement
status: Published
type: Property
lexical alias: manifestationRegionalEncodingStatement.en
definition: Relates a manifestation to a manifestation statement about a designation for one or more regions of the world for which a videodisc or video game carrier has been encoded, indicating that playback is restricted to a device configured to decode it.
domain: C10007
toolkit label: manifestation regional encoding statement
toolkit definition: A manifestation statement about a designation for one or more regions of the world for which a videodisc or video game carrier has been encoded, indicating that playback is restricted to a device configured to decode it.
sub property of: has manifestation statement
has element type: 6
label: manifestaation merkintö aluekoodista @fi
definition: Liittää manifestaation manifestaatiomerkintöön määritteestä, jolla identifioidaan videolevyn tai videopelitallenteen käyttöalue ja estetään niiden käyttäminen toisella alueella myydyllä soittimella. @fi
toolkit label: manifestaation merkintö aluekoodista @fi
toolkit definition: Manifestaatiomerkintö määritteestä, jolla identifioidaan videolevyn tai videopelitallenteen käyttöalue ja estetään niiden käyttäminen toisella alueella myydyllä soittimella. @fi
label: har manifestasjonsopplysning om regionskode @no
definition: Relaterer en manifestasjon til en manifestasjonsopplysning om en betegnelse for en eller flere regioner i verden som en videoplate eller videospillbærer er kodet for og som indikerer at avspilling er avgrenset til en enhet som er konfigurert for å dekode den. @no
toolkit label: manifestasjonsopplysning om regionskode @no
toolkit definition: En manifestasjonsopplysning om en betegnelse for en eller flere regioner i verden som en videoplate eller videospillbærer er kodet for og som indikerer at avspilling er avgrenset til en enhet som er konfigurert for å dekode den. @no
label: a pour mention de manifestation sur un code de région @fr
definition: Met une manifestation en relation avec une mention de manifestation relative à une désignation d’une ou plusieurs régions du monde pour laquelle un vidéodisque ou un support matériel de jeu vidéo a été encodé, qui indique que sa lecture est limitée à un appareil configuré pour le décoder. @fr
toolkit label: mention de manifestation sur un code de région @fr
toolkit definition: Mention de manifestation relative à une désignation d’une ou plusieurs régions du monde pour laquelle un vidéodisque ou un support matériel de jeu vidéo a été encodé, qui indique que sa lecture est limitée à un appareil configuré pour le décoder. @fr
label: heeft manifestatie-regiocoderingsvermelding @nl
definition: Relateert een manifestatie aan een manifestatievermelding over een aanduiding voor één of meer regio's van de wereld waarvoor een videodisk of computerspeldrager gecodeerd is, om aan te geven dat het afspelen beperkt is tot een apparaat dat deze kan decoderen. @nl
toolkit label: manifestatie-regiocoderingsvermelding @nl
toolkit definition: Een manifestatievermelding over een aanduiding voor één of meer regio's van de wereld waarvoor een videodisk of computerspeldrager gecodeerd is, om aan te geven dat het afspelen beperkt is tot een apparaat dat deze kan decoderen. @nl
label: له بيان أكواد مناطق لتجسيدة @ar
definition: يربط بين تجسيدة وبيان تجسيدة خاص بتسمية منطقة أو أكثر من العالم التي تم تكويد حامل قرص الفيديو أو ألعاب الفيديو وفقًا له، ويوضح أن التشغيل مقيد بجهاز معد لفك الكود. @ar
toolkit label: بيان أكواد مناطق لتجسيدة @ar
toolkit definition: بيان تجسيدة خاص بتسمية منطقة أو أكثر من العالم التي تم تكويد حامل قرص الفيديو أو ألعاب الفيديو وفقًا له، ويوضح أن التشغيل مقيد بجهاز معد لفك الكود. @ar
label: té com a menció de manifestació de codificació de regional @ca
definition: Relaciona una manifestació amb una menció de manifestació sobre una designació d’una o més regions del món per a la qual s’ha codificat un suport físic de videodisc o videojoc, indicant que la reproducció és restringida a un dispositiu configurat per descodificar-lo. @ca
toolkit label: menció de manifestació de codificació de regional @ca
toolkit definition: Menció de manifestació sobre una designació d’una o més regions del món per a la qual s’ha codificat un suport físic de videodisc o videojoc, indicant que la reproducció és restringida a un dispositiu configurat per descodificar-lo. @ca
label: har manifestations regional kodningsoplysning @da
definition: Relaterer en manifestation til en manifestationsoplysning om en betegnelse for en eller flere regioner i verden, som en videodisk eller spillekonsol er kodet til, hvormed afspilning er forbeholdt en enhed, som er konfigureret til at afkode regionskoden. @da
toolkit label: manifestations regional kodningsoplysning @da
toolkit definition: Manifestationsoplysning om en betegnelse for en eller flere regioner i verden, som en videodisk eller spillekonsol er kodet til, hvormed afspilning er forbeholdt en enhed, som er konfigureret til at afkode regionskoden. @da
label: kehastuse regioonikoodi andmed @et
definition: Seostab kehastuse kehastuse andmetega tähistuse kohta, mis märgib üht või mitut maailma regiooni, mille jaoks videoplaat või videomängu kandja on kodeeritud, nii et taasesitus on võimalik ainult selle dekodeerimiseks sobiva seadmega. @et
toolkit label: kehastuse regioonikoodi andmed @et
toolkit definition: Kehastuse andme tähistuse kohta, mis märgib üht või mitut maailma regiooni, mille jaoks videoplaat või videomängu kandja on kodeeritud, nii et taasesitus on võimalik ainult selle dekodeerimiseks sobiva seadmega. @et
label: hat Angabe zum Regionalcode einer Manifestation @de
definition: Setzt eine Manifestation in Beziehung zu einer Manifestationsangabe, die die Region(en) der Welt angibt, für die eine Videodisk oder ein Videospiel-Datenträger kodiert ist, und der verhindert, dass die Disk von einem Wiedergabegerät, das in einer anderen Region verkauft wurde, abgespielt werden kann. @de
toolkit label: Angabe zum Regionalcode einer Manifestation @de
toolkit definition: Eine Manifestationsangabe, die die Region(en) der Welt angibt, für die eine Videodisk oder ein Videospiel-Datenträger kodiert ist, und der verhindert, dass die Disk von einem Wiedergabegerät, das in einer anderen Region verkauft wurde, abgespielt werden kann. @de
label: regionális kódolásra vonatkozó megjelenésiforma-közlése a következő: @hu
definition: Hozzákapcsol egy megjelenési formát egy megjelenésiforma-közléshez, amely vegy videolemez vagy videojáték-hordozó kódolásáról szól, a világ egy vagy több régiójának jelölésével, és azt jelzi, hogy a lejátszás egy dekódolásra konfigurált eszközre korlátozódik. @hu
toolkit label: regionális kódolási megjelenésiforma-közlés @hu
toolkit definition: Egy megjelenésiforma-közlés, amely vegy videolemez vagy videojáték-hordozó kódolásáról szól, a világ egy vagy több régiójának jelölésével, és azt jelzi, hogy a lejátszás egy dekódolásra konfigurált eszközre korlátozódik. @hu
label: ha come formulazione di manifestazione della codifica regionale @it
definition: Correla una manifestazione a una formulazione di manifestazione su una designazione per una o più regioni del mondo per le quali un supporto di video disco o videogioco è stato codificato e che indica che la lettura è limitata a un dispositivo configurato per la decodifica. @it
toolkit label: formulazione di codifica regionale della manifestazione @it
toolkit definition: Formulazione di manifestazione su una designazione per una o più regioni del mondo per le quali un supporto di video disco o videogioco è stato codificato e che indica che la lettura è limitata a un dispositivo configurato per la decodifica. @it
label: manifestācijas reģiona koda ziņas @lv
definition: Sasaista manifestāciju ar manifestācijas ziņām par apzīmējumu vienam vai vairākiem pasaules reģioniem, kuriem videodiska vai videospēļu nesējs ir kodēts, norādot, ka atskaņošana ir ierobežota īpaši konfigurētām ierīcēm. @lv
toolkit label: manifestācijas reģiona koda ziņas @lv
toolkit definition: Manifestācijas ziņas par apzīmējumu vienam vai vairākiem pasaules reģioniem, kuriem videodiska vai videospēļu nesējs ir kodēts, norādot, ka atskaņošana ir ierobežota īpaši konfigurētām ierīcēm. @lv
label: 有载体表现地区编码说明 @zh-hans
definition: 将一种载体表现与关于视盘或视频游戏载体被编码后表示对设置解码回放的设备限制的世界上一个或多个地区的标识的一个载体表现说明关联起来。 @zh-hans
toolkit label: 载体表现地区编码说明 @zh-hans
toolkit definition: 关于视盘或视频游戏载体被编码后表示对设置解码回放的设备限制的世界上一个或多个地区的标识的一个载体表现说明 @zh-hans
label: gösterimin bölgesel kodlanma bildirimi ile ilişkilidir @tr
definition: Bir gösterimi, bir video diskin veya video oyunu taşıyıcısının kodlandığı dünyanın bir veya daha fazla bölgesi için bir atama hakkında bir gösterim beyanıyla ilişkilendirir ve oynatmanın,bunun kodunu çözecek şekilde yapılandırılmış bir cihazla sınırlı olduğunu belirtir. @tr
toolkit label: gösterim bölgesel kodlama beyanı @tr
toolkit definition: Bir video disk veya video oyun taşıyıcısının kodlandığı, dünyanın bir veya daha fazla bölgesine yönelik bir tanımlamaya ilişkin bir gösterim bildirimi; bu, yalnızca onu çözmek üzere yapılandırılmış bir cihazda oynatılabileceğini belirtir. @tr
label: tiene declaración de codificación regional de manifestación @es
definition: Relaciona una manifestación con una declaración de manifestación sobre una designación para una o más regiones del mundo para las cuales se ha codificado un soporte de videodisco o videojuego, indicando que la reproducción está restringida a un dispositivo configurado para decodificarlo. @es
toolkit label: declaración de codificación regional de manifestación @es
toolkit definition: Una declaración de manifestación sobre una designación para una o más regiones del mundo para las cuales se ha codificado un soporte de videodisco o videojuego, indicando que la reproducción está restringida a un dispositivo configurado para decodificarlo. @es
has subproperty: P30290

has manifestation series statement
status: Published
type: Property
lexical alias: manifestationSeriesStatement.en
definition: Relates a manifestation to a manifestation statement about a series that is associated with a manifestation and a numbering of a manifestation within the series.
scope note: A manifestation series statement includes any or all of title of series, other title information of series, statement of responsibility relating to series, ISSN, or numbering within sequence.
domain: C10007
toolkit label: manifestation series statement
toolkit definition: A manifestation statement about a series that is associated with a manifestation and a numbering of a manifestation within the series.
sub property of: has manifestation statement
has element type: 6
label: manifestaation sarjamerkintö @fi
definition: Liittää manifestaation manifestaatiomerkintöön manifestaatioon liittyvästä sarjasta ja manifestaation numeroinnista sarjassa. @fi
scope note: Manifestaation sarjamerkintö sisältää jonkin tai kaikki seuraavista: sarjan päänimeke, sarjan muu nimeketieto, sarjaan liittyvä vastuullisuusmerkintö, ISSN ja sarjaan sisältyvä numerointi. @fi
toolkit label: manifestaation sarjamerkintö @fi
toolkit definition: Manifestaatiomerkintö manifestaatioon liittyvästä sarjasta ja manifestaation numeroinnista sarjassa. @fi
label: har manifestasjonsopplysning om serie @no
definition: Relaterer en manifestasjon til en manifestasjonsopplysning om en serie som er knyttet til manifestasjonen og en nummerering av en manifestasjon innen serien. @no
scope note: En manifestasjonsopplysning om serie inkluderer alle hovedtitler for serie, annen tittelinformasjon for serie, ansvarsangivelse knyttet til serie, ISSN og nummerering innen serie. @no
toolkit label: manifestasjonsopplysning om serie @no
toolkit definition: En manifestasjonsopplysning om en serie som er knyttet til manifestasjonen og en nummerering av en manifestasjon innen serien. @no
label: a pour mention de manifestation sur une collection @fr
definition: Met une manifestation en relation avec une mention de manifestation relative à une collection associée à une manifestation et à une numérotation d’une manifestation à l’intérieur de la collection. @fr
scope note: Une mention de manifestation sur une collection comprend une partie ou la totalité des informations suivantes : titre de collection, complément de titre de collection, mention de responsabilité relative à une collection, ISSN ou numérotation au sein d’une séquence. @fr
toolkit label: mention de manifestation sur une collection @fr
toolkit definition: Mention de manifestation relative à une collection associée à une manifestation et à une numérotation d’une manifestation à l’intérieur de la collection. @fr
label: heeft manifestatie-reeksvermelding @nl
definition: Relateert een manifestatie aan een manifestatievermelding over een reeks die geassocieerd is met een manifestatie en een nummering van een manifestatie binnen de reeks. @nl
scope note: Een manifestatie reeksvermelding omvat een of alle van hoofdtitel van de reeks, overige titelgegevens van de reeks; verantwoordelijkheidsvermelding gerelateerd aan de reeks; ISSN, en nummering binnen de reeks. @nl
toolkit label: manifestatie-reeksvermelding @nl
toolkit definition: Een manifestatievermelding over een reeks die geassocieerd is met een manifestatie en een nummering van een manifestatie binnen de reeks. @nl
label: له بيان سلسلة تجسيدة @ar
definition: يربط بين تجسيدة وبيان تجسيدة خاص بسلسلة ترتبط بالتجسيدة والترقيم الخاص بتجسيدة داخل السلسلة. @ar
scope note: يشتمل بيان تجسيدة سلسلة على أي أو كل من العنوان نفسه للسلسلة وأي بيانات أخرى لعنوان السلسلة، وبيان المسئولية المرتبط بالسلسلة، والترقيم الدولي الموحد للسلاسل، الترقيم داخل السلسلة. @ar
toolkit label: بيان سلسلة تجسيدة @ar
toolkit definition: بيان تجسيدة خاص بسلسلة ترتبط بالتجسيدة والترقيم الخاص بتجسيدة داخل السلسلة. @ar
label: té com a menció de manifestació de col·lecció @ca
definition: Relaciona una manifestació amb una menció de manifestació sobre una col·lecció que s’associa amb una manifestació i una numeració d’una manifestació dins la col·lecció. @ca
scope note: Una menció de manifestació de col·lecció inclou, en tot o en part, el títol de col·lecció, el complement de títol de col·lecció, la menció de responsabilitat relativa a la col·lecció, l’ISSN o la numeració dins d’una seqüència. @ca
toolkit label: menció de manifestació de col·lecció @ca
toolkit definition: Menció de manifestació sobre una col·lecció que s’associa amb una manifestació i una numeració d’una manifestació dins la col·lecció. @ca
label: har manifestations seriebetegnelse @da
definition: Relaterer en manifestation til en manifestationsoplysning om en serie, som er knyttet til en manifestation og en nummerering af en manifestation indenfor serie. @da
scope note: Manifestations seriebetegnelse omfatter hvilken som helst eller alle af: seriehovedtitel, anden titelinformation om serie, ophavsangivelse, som relaterer til serie; ISSN og nummerering indenfor serie. @da
toolkit label: manifestations seriebetegnelse @da
toolkit definition: Manifestationsoplysning om en serie, som er knyttet til en manifestation og en nummerering af en manifestation indenfor serie. @da
label: kehastuse seeriaandmed @et
definition: Seostab kehastuse kehastuse andmetega kehastusega seotud seeria ja kehastuse seeriasisese numbri kohta. @et
scope note: Kehastuse seeriaandmed sisaldavad seeria põhipealkirja, pealkirja täiendandmeid, seeriaga seotud vastutusandmeid, ISSNi ja seeriasisest numbrit, või vähemalt ühte neist. @et
toolkit label: kehastuse seeriaandmed @et
toolkit definition: Kehastuse andmed kehastusega seotud seeria ja kehastuse seeriasisese numbri kohta. @et
label: hat Gesamttitelangabe einer Manifestation @de
definition: Setzt eine Manifestation in Beziehung zu einer Manifestationsangabe, die Informationen über eine Reihe enthält, mit der eine Manifestation in Verbindung steht und die eine Zählung einer Manifestation innerhalb der Reihe aufweist. @de
scope note: Darunter fallen eine, mehrere oder alle der folgenden Angaben: Titel einer Reihe, Titelzusätze einer Reihe, Verantwortlichkeitsangaben, die sich auf eine Reihe beziehen, ISSNs oder eine Zählung innerhalb einer Reihe. @de
toolkit label: Gesamttitelangabe einer Manifestation @de
toolkit definition: Eine Manifestationsangabe, die Informationen über eine Reihe enthält, mit der eine Manifestation in Verbindung steht und die eine Zählung einer Manifestation innerhalb der Reihe aufweist. @de
label: sorozatra vonatkozó megjelenésiforma-közlése a következő: @hu
definition: Hozzákapcsol egy megjelenési formát egy megjelenési formával társított sorozatról és a megjelenési forma sorozaton belüli számozásáról szóló megjelenésiforma-közléshez. @hu
scope note: sorozati megjelenésiforma-közlés @hu
toolkit label: Egy megjelenési formával társított sorozatról és a megjelenési forma sorozaton belüli számozásáról szóló megjelenésiforma-közlés. @hu
toolkit definition: Egy sorozati megjelenésiforma-közlés, amely tartalmazza a sorozat bármely vagy összes főcímét; sorozat egyébcím-információját; sorozattal kapcsolatos felelősségi közlést; ISSN-t és sorozati számot. @hu
label: ha come formulazione di manifestazione della serie @it
definition: Correla una manifestazione a una formulazione di manifestazione su una serie associata alla manifestazione e alla numerazione di una manifestazione all'interno della serie. @it
scope note: La formulazione di manifestazione della serie comprende, del tutto o in parte, il titolo proprio della serie, altre informazioni del titolo della serie, formulazione di responsabilità relativa alla serie, ISSN e numerazione all'interno della serie. @it
toolkit label: formulazione di serie della manifestazione @it
toolkit definition: Formulazione di manifestazione relativa a una serie associata alla manifestazione e alla numerazione di una manifestazione all'interno della serie. @it
label: manifestācijas sērijas ziņas @lv
definition: Sasaista manifestāciju ar manifestācijas ziņām par sēriju, kas ir saistīta ar manifestāciju, un manifestācijas numerāciju sērijas ietvaros. @lv
scope note: Sērijas ziņas ietver daļēju vai pilnu informāciju par sērijas pamatnosaukumu, par citu sērijas nosaukumu; sērijas atbildības ziņām; ISSN vai sērijas numerāciju. @lv
toolkit label: manifestācijas sērijas ziņas @lv
toolkit definition: Manifestācijas ziņas par sēriju, kas ir saistīta ar manifestāciju, un manifestācijas numerāciju sērijas ietvaros. @lv
label: 有载体表现丛编说明 @zh-hans
definition: 将一种载体表现与关于和一种载体表现有关的一种丛编以及一种载体表现在丛编内的编号的一个载体表现说明关联起来。 @zh-hans
scope note: 载体表现丛编说明包括丛编题名、丛编其他题名信息、和丛编有关的责任说明、ISSN、或序列内的编号这些中的任何一个或者全部。 @zh-hans
toolkit label: 载体表现丛编说明 @zh-hans
toolkit definition: 关于和一种载体表现有关的一种丛编以及一种载体表现在丛编内的编号的一个载体表现说明 @zh-hans
label: gösterimin seri bildirimi ile ilişkilidir @tr
definition: Bir gösterimi, seri içindeki bir gösterimin numaralandırılmasıyla ilişkili bir seri hakkındaki bir gösterim ifadesiyle ilişkilendirir. @tr
scope note: Bir gösterim serisi bildirimi, serinin başlığının herhangi birini veya tamamını, serinin diğer başlık bilgilerini, seriyle ilgili sorumluluk bildirimini, ISSN'yi veya dizi içindeki numaralandırmayı içerir. @tr
toolkit label: gösterim dizilerinin beyanı @tr

has manifestation statement
status: Published
type: Property
lexical alias: manifestationStatement.en
definition: Relates a manifestation to a statement appearing in a manifestation and deemed to be significant for users to understand how the manifestation represents itself.
domain: C10007
toolkit label: manifestation statement
toolkit definition: A statement appearing in a manifestation and deemed to be significant for users to understand how the manifestation represents itself.
has element type: 6
label: manifestaatiomerkintö @fi
definition: Liittää manifestaation merkintöön, joka esiintyy manifestaatiossa ja jota pidetään tärkeänä, jotta käyttäjät ymmärtävät, kuinka manifestaatio edustaa itseään. @fi
toolkit label: manifestaatiomerkintö @fi
toolkit definition: Merkintö, joka esiintyy manifestaatiossa ja jota pidetään tärkeänä, jotta käyttäjät ymmärtävät, kuinka manifestaatio edustaa itseään. @fi
label: har manifestasjonsopplysning @no
definition: Relaterer en manifestasjon til en opplysning som framkommer i en manifestasjon som ansees å være viktig for brukerene for å forstå hvordan manifestasjonen framstår. @no
toolkit label: manifestasjonsopplysning @no
toolkit definition: En opplysning som framkommer i en manifestasjon som ansees å være viktig for brukerene for å forstå hvordan manifestasjonen framstår. @no
label: a pour mention de manifestation @fr
definition: Met une manifestation en relation avec une mention qui figure dans une manifestation et est jugée importante en ce qu'elle permet aux utilisateurs de comprendre comment la manifestation se représente elle-même. @fr
toolkit label: mention de manifestation @fr
toolkit definition: Mention qui figure dans une manifestation et est jugée importante en ce qu'elle permet aux utilisateurs de comprendre comment la manifestation se représente elle-même. @fr
label: heeft manifestatievermelding @nl
definition: Relateert een manifestatie aan een vermelding opgenomen in een manifestatie en die belangrijk gevonden wordt voor gebruikers om te begrijpen hoe de manifestatie zichzelf vertegenwoordigt. @nl
toolkit label: manifestatievermelding @nl
toolkit definition: Een vermelding opgenomen in een manifestatie en die belangrijk gevonden wordt voor gebruikers om te begrijpen hoe de manifestatie zichzelf vertegenwoordigt. @nl
label: له بيان تجسيدة @ar
definition: يربط بين تجسيدة وبيان ظاهر على تجسيدة يعد مهمًا للمستخدمين لفهم كيف تقدم التجسيدة نفسها. @ar
toolkit label: بيان تجسيدة @ar
toolkit definition: بيان ظاهر على تجسيدة يعد مهمًا للمستخدمين لفهم كيف تقدم التجسيدة نفسها. @ar
label: té com a menció de manifestació @ca
definition: Relaciona una manifestació amb una menció que figura en una manifestació i que es considera significativa perquè els usuaris entenguin com la manifestació es representa a si mateixa. @ca
toolkit label: menció de manifestació @ca
toolkit definition: Menció que figura en una manifestació i que es considera significativa perquè els usuaris entenguin com la manifestació es representa a si mateixa. @ca
label: har manifestationsoplysning @da
definition: Relaterer en manifestation til en oplysning, som vises i en manifestation og som anses for vigtig for brugernes forståelse af, hvordan manifestationen repræsenterer sig selv. @da
toolkit label: manifestationsoplysning @da
toolkit definition: Oplysning, som vises i en manifestation og som anses for vigtig for brugernes forståelse af, hvordan manifestationen repræsenterer sig selv. @da
label: kehastuse andmed @et
definition: Seostab kehastuse andmetega, mis esinevad kehastuses ja mida peetakse kasutajale oluliseks kehastuse olemusest arusaamiseks. @et
toolkit label: kehastuse andmed @et
toolkit definition: Andmed, mis esinevad kehastuses ja mida peetakse kasutajale oluliseks kehastuse olemusest arusaamiseks. @et
label: hat Manifestationsangabe @de
definition: Setzt eine Manifestation in Beziehung zu einer Angabe, die in der Manifestation erscheint und die für Benutzerinnen/Benutzer als wichtig erachtet wird, um zu verstehen, wie die Manifestation sich selbst darstellt. @de
toolkit label: Manifestationsangabe @de
toolkit definition: Eine Angabe, die in der Manifestation erscheint und die für Benutzerinnen/Benutzer als wichtig erachtet wird, um zu verstehen, wie die Manifestation sich selbst darstellt. @de
label: megjelenésiforma-közlése a következő: @hu
definition: Egy megjelenési forma egy megjelenési formán előforduló olyan közléshez, amelyet a felhasználók jelentősnek tartanak annak megértéséhez, hogy a megjelenési forma hogyan képviseli önmagát. @hu
toolkit label: megjelenésiforma-közlés @hu
toolkit definition: Egy olyan közlés a megjelenési formán, amelyet a felhasználók jelentősnek tartanak annak megértéséhez, hogy a megjelenési forma hogyan képviseli önmagát. @hu
label: ha come formulazione di manifestazione @it
definition: Correla una manifestazione a una formulazione che compare in una manifestazione, considerata come significativa per gli utenti per capire come la manifestazione si presenti. @it
toolkit label: formulazione di manifestazione @it
toolkit definition: Formulazione che compare in una manifestazione, considerata come significativa per gli utenti per capire come la manifestazione si presenti. @it
label: manifestācijas ziņas @lv
definition: Sasaista manifestāciju ar ziņām, kas atrodamas manifestācijā un ir uzskatāmas par būtiskām lietotājiem, lai saprastu, kā manifestācija pārstāv pati sevi. @lv
toolkit label: manifestācijas ziņas @lv
toolkit definition: Ziņas, kas atrodamas manifestācijā un ir uzskatāmas par būtiskām lietotājiem, lai saprastu, kā manifestācija pārstāv pati sevi. @lv
label: 有载体表现说明 @zh-hans
definition: 将一种载体表现与在一种载体表现中出现并被认为对使用者理解该载体表现呈现方式重要的一个说明关联起来。 @zh-hans
toolkit label: 载体表现说明 @zh-hans
toolkit definition: 在一种载体表现中出现并被认为对使用者理解该载体表现呈现方式重要的一个说明 @zh-hans
label: gösterim bildirimi ile ilişkilidir @tr
definition: Bir gösterimi, bir gösterimde görünen ve kullanıcıların gösterimin kendisini nasıl temsil ettiğini anlamaları için önemli olduğu düşünülen bir ifadeyle ilişkilendirir. @tr
toolkit label: gösterim beyanı @tr
toolkit definition: Bir gösterimde görünen ve kullanıcıların gösterimin kendisini nasıl temsil ettiğini anlamaları açısından önemli olduğu düşünülen bir bildirim. @tr
label: tiene declaración de manifestación @es
definition: Relaciona una manifestación con una declaración que aparece en una manifestación y se considera importante para que los usuarios comprendan cómo la manifestación se representa a sí misma. @es
toolkit label: declaración de manifestación @es
toolkit definition: Una declaración que aparece en una manifestación y se considera importante para que los usuarios comprendan cómo la manifestación se representa a sí misma. @es
has subproperty: has manifestation copyright statement
has subproperty: has manifestation designation of sequence statement
has subproperty: has manifestation dissertation statement
has subproperty: has manifestation distribution statement
has subproperty: has manifestation edition statement
has subproperty: has manifestation frequency statement
has subproperty: has manifestation identifier statement
has subproperty: has manifestation manufacture statement
has subproperty: has manifestation production statement
has subproperty: has manifestation publication statement
has subproperty: has manifestation regional encoding statement

has manifestation title and responsibility statement
status: Published
type: Property
lexical alias: manifestationTitleAndResponsibilityStatement.en
definition: Relates a manifestation to a manifestation statement about the titles of a manifestation and the names of agents who are responsible for the content of an expression that is embodied by a manifestation.
scope note: A manifestation title and responsibility statement includes any kind of title or statement of responsibility that is associated with the content of the manifestation, but does not include a title or statement of responsibility that is associated with an edition, revision or series that is related to the manifestation.
domain: C10007
toolkit label: manifestation title and responsibility statement
toolkit definition: A manifestation statement about the titles of a manifestation and the names of agents who are responsible for the content of an expression that is embodied by a manifestation.
sub property of: has manifestation statement
has element type: 6
label: manifestaation nimeke- ja vastuullisuusmerkintö @fi
definition: Liittää manifestaation manifestaatiomerkintöön manifestaation nimekkeistä ja manifestaatioon sisältyvän ekspression sisältöön vaikuttavien toimijoiden nimistä. @fi
scope note: Manifestaation nimeke- ja vastuullisuusmerkintö sisältää kaikenlaiset nimekkeet (ml. päänimekkeen, nimekkeen varianttimuodot ja muun nimeketiedon) sekä kaikenlaiset manifestaation sisältöön liittyvät vastuullisuusmerkinnöt. Manifestaation nimeke- ja vastuullisuusmerkintö ei sisällä sarjaan liittyviä nimekkeitä eikä sarjasta vastuussa olevien toimijoiden nimiä. @fi
toolkit label: manifestaation nimeke- ja vastuullisuusmerkintö @fi
toolkit definition: Manifestaatiomerkintö manifestaation nimekkeistä ja manifestaatioon sisältyvän ekspression sisältöön vaikuttavien toimijoiden nimistä. @fi
label: har manifestasjonsopplysning om tittel og ansvar @no
definition: Relaterer en manifestasjon til en manifestasjonsopplysning om titlene for en manifestasjon og navn på agentene som er ansvarlige for innholdet av uttrykket som er realisert i en manifestasjon. @no
scope note: En manifestasjonsopplysning om tittel og ansvar inkluderer alle typer tittel, inkludert hovedtittel, varianttittel eller annen tittelinformasjon, alle typer ansvarsangivelse knyttet til innholdet av manifestasjonen, men inkluderer ikke titler for tilknyttede serier eller navn på agenter som er ansvarlige for slike serier. @no
toolkit label: manifestasjonsopplysning om tittel og ansvar @no
toolkit definition: En manifestasjonsopplysning om titlene for en manifestasjon og navn på agentene som er ansvarlige for innholdet av uttrykket som er realisert i en manifestasjon. @no
label: a pour mention de manifestation sur les titres et les responsabilités @fr
definition: Met une manifestation en relation avec une mention de manifestation relative aux titres d’une manifestation et aux noms des agents responsables du contenu d’une expression matérialisée par une manifestation. @fr
scope note: Une mention de manifestation sur les titres et les responsabilités comprend tout type de titre ou de mention de responsabilité qui est associée au contenu de la manifestation, mais ne comprend pas un titre ou une mention de responsabilité qui est associée à une édition, une révision ou une collection qui est reliée à la manifestation. @fr
toolkit label: mention de manifestation sur les titres et les responsabilités @fr
toolkit definition: Mention de manifestation relative aux titres d’une manifestation et aux noms des agents responsables du contenu d’une expression matérialisée par une manifestation. @fr
label: heeft manifestatie-titel en verantwoordelijkheidsvermelding @nl
definition: Relateert een manifestatie aan een manifestatievermelding over de titels van een manifestatie en de namen van actoren die verantwoordelijk zijn voor de inhoud van de expressie verwezenlijkt in een manifestatie. @nl
scope note: Een manifestatietitel en verantwoordelijkheidsvermelding omvat elke soort titel of verantwoordelijkheidsvermelding dat geassocieerd is met de content van de manifestatie, maar die niet omvat een titel of verantwoordelijkheidsvermelding die geassocieerd is met een editie, herziening of serie die gerelateerd is aan de manifestatie. @nl
toolkit label: manifestatie-titel en verantwoordelijkheidsvermelding @nl
toolkit definition: Een manifestatievermelding over de titels van een manifestatie en de namen van actoren die verantwoordelijk zijn voor de inhoud van de expressie verwezenlijkt in een manifestatie. @nl
label: له بيان مسئولية عنوان تجسيدة @ar
definition: يربط بين تجسيدة وبيان تجسيدة خاص بعناوين التجسيدة وأسماء الوكلاء المسئولين عن محتوى التعبيرة المجسدة في تجسيدة. @ar
scope note: يشتمل العنوان وبيان المسئولية للتجسيدة على أي نوع من العناوين ويشمل العنوان نفسه، أشكال مختلفة للعنوان، وبيانات أخرى للعنوان، وأي بيان مسئولية مرتبط بمحتوى التجسيدة ولكن لا يشتمل على العناوين الأخري في السلسلة، أو اسماء الوكلاء المسئولين عن السلسلة. @ar
toolkit label: بيان مسئولية عنوان تجسيدة @ar
toolkit definition: بيان تجسيدة خاص بعناوين التجسيدة وأسماء الوكلاء المسئولين عن محتوى التعبيرة المجسدة في تجسيدة. @ar
label: té com a menció de manifestació de títol i responsabilitat @ca
definition: Relaciona una manifestació amb una menció de manifestació sobre els títols d’una manifestació i els noms dels agents que són responsables del contingut de l’expressió que es materialitza en una manifestació. @ca
scope note: Una menció de manifestació de títol i responsabilitat inclou qualsevol tipus de títol o menció de responsabilitat que s’associa amb el contingut de la manifestació, però no inclou un títol o una menció de responsabilitat que s’associa amb una edició, una revisió o una col·lecció que es relaciona amb la manifestació. @ca
toolkit label: menció de manifestació de títol i responsabilitat @ca
toolkit definition: Menció de manifestació sobre els títols d’una manifestació i els noms dels agents que són responsables del contingut de l’expressió que es materialitza en una manifestació. @ca
label: har manifestationstitel og ophavsangivelse @da
definition: Relaterer en manifestation til en manifestationsoplysning om titlerne på en manifestation og navnene på agenter, som er ansvarlige for indholdet af det udtryk, som er indeholdt i en manifestation. @da
scope note: Manifestationstitel og ophavsangivelse omfatter enhver form for titel, herunder en hovedtitel, en variant af titlen og anden titelinformation og enhver form for ophavsangivelse, som relaterer til indholdet af en manifestation, men omfatter ikke titler på relaterede serier eller navne på agenter, som er ophav for sådanne serier. @da
toolkit label: manifestationstitel og ophavsangivelse @da
toolkit definition: Manifestationsoplysning om titlerne på en manifestation og navnene på agenter, som er ansvarlige for indholdet af det udtryk, som er indeholdt i en manifestation. @da
label: kehastuse pealkirja- ja vastutusandmed @et
definition: Seostab kehastuse kehastuse andmetega, mis puudutavad kehastuse pealkirju ja kehastuses teostatud väljenduse sisu eest vastutavate tegijate nimesid. @et
scope note: Kehastuse pealkirja- ja vastutusandmed hõlmavad kõiki pealkirju, k.a põhipealkiri, variantpealkiri ja pealkirja täiendandmed, samuti kõiki kehastuse sisuga seotud vastutusandmeid, kuid ei hõlma seotud seeria pealkirju ega seeria eest vastutavate tegijate nimesid. @et
toolkit label: kehastuse pealkirja- ja vastutusandmed @et
toolkit definition: Kehastuse andmed, mis puudutavad kehastuse pealkirju ja kehastuses teostatud väljenduse sisu eest vastutavate tegijate nimesid. @et
label: hat Titel und Verantwortlichkeitsangabe einer Manifestation @de
definition: Setzt eine Manifestation in Beziehung zu einer Manifestationsangabe, die die Titel einer Manifestation und die Namen der Akteure enthält, die für den Inhalt der Expression, die durch eine Manifestation verkörpert ist, verantwortlich sind. @de
scope note: Darunter fallen alle Arten von Titeln (Haupttitel, abweichende Titel und Titelzusätze) oder Verantwortlichkeitsangaben, die mit dem Inhalt der Manifestation in Beziehung stehen. Darunter fallen keine Titel oder Verantwortlichkeitsangaben von in Beziehung stehenden Ausgaben, Überarbeitungen oder Reihen, die mit der Manifestation in Verbindung stehen. @de
toolkit label: Titel und Verantwortlichkeitsangabe einer Manifestation @de
toolkit definition: Eine Manifestationsangabe, die die Titel einer Manifestation und die Namen der Akteure enthält, die für den Inhalt der Expression, die durch eine Manifestation verkörpert ist, verantwortlich sind. @de
label: címre és felelősségre vonatkozó megjelenésiforma-közlése a következő: @hu
definition: Egy megjelenési formát hozzákapcsol egy olyan megjelenésiforma-közléshez, amely a megjelenési forma címét és azoknak az ágenseknek a nevét tartalmazza, akik/amelyek felelősek a megjelenési formába beépülő kifejezési forma tartalmáért. @hu
scope note: cím- és felelősségi megjelenésiforma-közlés @hu
toolkit label: Egy megjelenésiforma-közlés, amely tartalmazza a megjelenési forma címét és azoknak az ágenseknek a nevét, akik/amelyek felelősek a megjelenési formába beépülő kifejezési forma tartalmáért. @hu
toolkit definition: Egy megjelenési forma cím- és felelősségi közlése, amely magában foglal bármilyen címet, beleértve egy főcímet, egy címvariánst és egyébcím-információt és bármilyen felelősségi közlést, amely kapcsolatban van a megjelenési forma tartalmával, de nem foglalja magában a kapcsolódó sorozat címeit vagy a sorozatért felelős ágensek neveit. @hu
label: ha come formulazione di titolo e di responsabilità della manifestazione @it
definition: Correla una manifestazione a una formulazione di manifestazione relativa ai titoli di una manifestazione e ai nomi degli agenti responsabili del contenuto dell'espressione materializzata in una manifestazione. @it
scope note: La formulazione di titolo e di responsabilità della manifestazione comprende qualsiasi tipo di titolo, compreso un titolo proprio, una forma variante del titolo e altre informazioni sul titolo e qualsiasi tipo di formulazione di responsabilità relativa al contenuto della manifestazione, ma non comprende titoli di serie correlate o nomi di agenti responsabili di tali serie. @it
toolkit label: formulazione di titolo e responsabilità della manifestazione @it
toolkit definition: Formulazione di manifestazione relativa ai titoli di una manifestazione e ai nomi degli agenti responsabili del contenuto dell'espressione materializzata in una manifestazione. @it
label: manifestācijas nosaukums un atbildības ziņas @lv
definition: Sasaista manifestāciju ar manifestācijas ziņām par manifestācijas nosaukumiem un aģentu vārdiem/nosaukumiem, kuri ir atbildīgi par manifestācijā ietverto izteiksmes saturu. @lv
scope note: Manifestācijas nosaukums un atbildības ziņas ietver jebkura veida nosaukumu, ieskaitot pamatnosaukumu, atšķirīgo vārdu/nosaukuma un citu nosaukuma informāciju, vai jebkura veida atbildības ziņas, kas saistītas ar manifestācijas saturu, bet neietver saistīto sēriju nosaukumus vai to aģentu vārdus, kuri ir atbildīgi par šādām sērijām. @lv
toolkit label: manifestācijas nosaukums un atbildības ziņas @lv
toolkit definition: Manifestācijas ziņas par manifestācijas nosaukumiem un aģentu vārdiem/nosaukumiem, kuri ir atbildīgi par manifestācijā ietverto izteiksmes saturu. @lv
label: 有载体表现题名和责任说明 @zh-hans
definition: 将一种载体表现与关于一种载体表现的题名以及负责被一种载体表现所具体化的一种内容表达之内容的一个行为者的名称的一个载体表现说明关联起来。 @zh-hans
scope note: 载体表现题名和责任说明包括与该载体表现的内容有关的任何类型的题名或责任说明，但不包括与该载体表现所关联的版本、修订或丛编的题名或责任说明。 @zh-hans
toolkit label: 载体表现题名和责任说明 @zh-hans
toolkit definition: 关于一种载体表现的题名以及负责被一种载体表现所具体化的一种内容表达之内容的一个行为者的名称的一个载体表现说明 @zh-hans
label: gösterimin başlık ve sorumluluk bildirimi ile ilişkilidir @tr
definition: Bir gösterimin başlıkları ve bir gösterimin somutlaştırdığı bir anlatımın içeriğinden sorumlu olan temsilcilerin adları hakkında bir gösterim ifadesiyle ilişkilendirir. @tr
scope note: Bir gösterimin başlık ve sorumluluk bildirimi, gösterimin içeriğiyle ilişkilendirilen herhangi bir başlığı veya sorumluluk bildirimini içerir; ancak, gösterimle ilişkili bir baskı, revizyon veya seriye ait başlık veya sorumluluk bildirimini içermez. @tr
toolkit label: gösterim başlık ve sorumluluk beyanı @tr

has manufacturer agent
status: Published
definition: Relates a manifestation to an agent who is responsible for printing, duplicating, casting, or other method of manufacturing a published manifestation.
type: Property
domain: C10007
lexical alias: manufacturerAgent.en
instruction number: 21.5
toolkit label: manufacturer agent
toolkit definition: An agent who is responsible for printing, duplicating, casting, or other method of manufacturing a published manifestation.
label: a pour agent fabricant @fr
definition: Met une manifestation en relation avec un agent qui est responsable de l’impression, de la reproduction, du moulage ou de toute autre méthode de fabrication d’une manifestation publiée. @fr
toolkit label: agent fabricant @fr
toolkit definition: Agent qui est responsable de l’impression, de la reproduction, du moulage ou de toute autre méthode de fabrication d’une manifestation publiée. @fr
toolkit label: agente del fabricante @es
toolkit definition: Un agente responsable de imprimir, duplicar, moldear u otro método de fabricación de una manifestación publicada. @es
label: har tillverkare @sv
toolkit label: tillverkare @sv
sub property of: has creator agent of manifestation
toolkit label: vervaardiger-actor @nl
toolkit definition: Een actor die verantwoordelijk is voor het drukken, vermeerderen, gieten of andere methode van het vervaardigen van een gepubliceerde manifestatie. @nl
label: có nhà chế tạo @vi
definition: Liên kết biểu thị với tác nhân có trách nhiệm in, nhân bản, đúc, v.v..., biểu thị dưới hình thái xuất bản. @vi
toolkit label: nhà chế tạo @vi
toolkit definition: Tác nhân có trách nhiệm in, nhân bản, đúc, v.v..., biểu thị dưới hình thái xuất bản. @vi
label: har agent, som er producent @da
definition: Relaterer en manifestation til en agent, som er ansvarlig for trykning, duplikering, støbning etc. af en publiceret manifestation. @da
toolkit label: agent, som er producent @da
toolkit definition: Agent, som er ansvarlig for trykning, duplikering, støbning etc. af en publiceret manifestation. @da
label: hat Herstellerin/Hersteller (Akteur) @de
definition: Setzt eine Manifestation in Beziehung zu einem Akteur, der für den Druck, die Vervielfältigung, den Guss oder eine andere Herstellungsmethode einer veröffentlichten Manifestation verantwortlich ist. @de
toolkit label: Herstellerin/Hersteller (Akteur) @de
toolkit definition: Ein Akteur, der für den Druck, die Vervielfältigung, den Guss oder eine andere Herstellungsmethode einer veröffentlichten Manifestation verantwortlich ist. @de
label: té com a agent fabricant @ca
definition: Relaciona una manifestació amb un agent que és responsable de la impressió, la reproducció, el modelat o un altre mètode de fabricació d’una manifestació publicada. @ca
toolkit definition: Agent que és responsable de la impressió, la reproducció, el modelat o un altre mètode de fabricació d’una manifestació publicada. @ca
definition: Liittää manifestaation toimijaan, joka on vastuussa julkaistun manifestaation painamisesta, monistamisesta, kirjasinten valamisesta tai muusta valmistustavasta. @fi
toolkit label: valmistaja (toimija) @fi
toolkit definition: Toimija, joka on vastuussa julkaistun manifestaation painamisesta, monistamisesta, kirjasinten valamisesta tai muusta valmistustavasta. @fi
toolkit label: tilvirker (agent) @no
toolkit definition: En agent som er ansvarlig for å trykke, mangfoldiggjøre, etc. en publisert manifestasjon. @no
label: έχει κατασκευαστή @el
definition: Συνδέει μια εκδήλωση με έναν φορέα υπεύθυνο για την εκτύπωση, την αντιγραφή, τη χύτευση κ.λπ. μιας εκδήλωσης σε μια δημοσιευμένη μορφή. @el
toolkit label: κατασκευαστής @el
toolkit definition: Ένας φορέας υπεύθυνος για την εκτύπωση, την αντιγραφή, τη χύτευση κ.λπ. μιας εκδήλωσης σε μια δημοσιευμένη μορφή. @el
has element type: 2
label: gyártó ágense a következő: @hu
definition: Hozzákapcsol egy megjelenési formát egy ágenshez, amely felelős egy kiadott megjelenési forma nyomtatásáért, sokszorosításáért, öntéséért vagy egyéb módú gyártásáért. @hu
toolkit label: gyártó ágens: @hu
toolkit definition: Egy ágens, amely felelős egy kiadott megjelenési forma nyomtatásáért, sokszorosításáért, öntéséért vagy egyéb módú gyártásáért. @hu
alternative label: manufacturer
alternative label: valmistaja @fi
label: valmistaja (toimija) @fi
label: har tilvirker (agent) @no
definition: Relaterer en manifestasjon til en agent som er ansvarlig for å trykke, mangfoldiggjøre, etc. en publisert manifestasjon. @no
alternative label: tilvirker @no
alternative label: fabricant @fr
label: heeft vervaardiger-actor @nl
definition: Relateert een manifestatie aan een actor die verantwoordelijk is voor het drukken, vermeerderen, gieten of andere methode van het vervaardigen van een gepubliceerde manifestatie. @nl
label: له وكيل صانع @ar
definition: يربط بين تجسيدة ووكيل مسئول عن طباعة، أو نسخ، أو صب، أو أي طريقة أخرى لصناعة تجسيدة منشورة. @ar
alternative label: صانع @ar
toolkit label: وكيل صانع @ar
toolkit definition: وكيل مسئول عن طباعة، أو نسخ، أو صب، أو أي طريقة أخرى لصناعة تجسيدة منشورة. @ar
alternative label: producent @da
label: valmistaja (tegija) @et
definition: Seostab kehastuse tegijaga, kes vastutab avaldatud kehastuse trükkimise, paljundamise, valamise vms eest. @et
toolkit label: valmistaja (tegija) @et
toolkit definition: Tegija, kes vastutab avaldatud kehastuse trükkimise, paljundamise, valamise vms eest. @et
alternative label: gyártó: @hu
label: ha come manifattura agente @it
definition: Correla una manifestazione all'agente responsabile della stampa, riproduzione, fusione, etc. di una manifestazione pubblicata. @it
alternative label: manifattura @it
toolkit label: manifattura agente @it
toolkit definition: Agente responsabile della stampa, riproduzione, fusione, etc. di una manifestazione pubblicata. @it
label: ražotājs (aģents) @lv
definition: Sasaista manifestāciju ar aģentu, kas ir atbildīgs par resursa publicējamās formas drukāšanu, pavairošanu u.tml. @lv
toolkit label: ražotājs (aģents) @lv
toolkit definition: Aģents, kas ir atbildīgs par resursa publicējamās formas drukāšanu, pavairošanu u.tml. @lv
alternative label: Hersteller @de
alternative label: 生产者 @zh-hans
toolkit label: 生产者行为者 @zh-hans

has manufacturer collective agent
status: Published
lexical alias: manufacturerCollectiveAgent.en
definition: Relates a manifestation to a collective agent who is responsible for printing, duplicating, casting, or other method of manufacturing a published manifestation.
toolkit label: manufacturer collective agent
toolkit definition: A collective agent who is responsible for printing, duplicating, casting, or other method of manufacturing a published manifestation.
type: Property
domain: C10007
has element type: 2
sub property of: has creator collective agent of manifestation
sub property of: has manufacturer agent
label: valmistaja (yhteistoimija) @fi
definition: Liittää manifestaation yhteistoimijaan, joka on vastuussa julkaistun manifestaation painamisesta, monistamisesta, kirjasinten valamisesta tai muusta valmistustavasta. @fi
toolkit label: valmistaja (yhteistoimija) @fi
toolkit definition: Yhteistoimija, joka on vastuussa julkaistun manifestaation painamisesta, monistamisesta, kirjasinten valamisesta tai muusta valmistustavasta. @fi
label: har tilvirker (kollektiv agent) @no
definition: Relaterer en manifestasjon til en kollektiv agent som er ansvarlig for å trykke, mangfoldiggjøre, etc. en publisert manifestasjon. @no
toolkit label: tilvirker (kollektiv agent) @no
toolkit definition: En kollektiv agent som er ansvarlig for å trykke, mangfoldiggjøre, etc. en publisert manifestasjon. @no
label: a pour agent collectif fabricant @fr
definition: Met une manifestation en relation avec un agent collectif qui est responsable de l’impression, de la reproduction, du moulage ou de toute autre méthode de fabrication d’une manifestation publiée. @fr
toolkit label: agent collectif fabricant @fr
toolkit definition: Agent collectif qui est responsable de l’impression, de la reproduction, du moulage ou de toute autre méthode de fabrication d’une manifestation publiée. @fr
label: heeft vervaardiger-collectieve actor @nl
definition: Relateert een manifestatie aan een collectieve actor die verantwoordelijk is voor het drukken, vermeerderen, gieten of andere methode van het vervaardigen van een gepubliceerde manifestatie. @nl
toolkit label: vervaardiger-collectieve actor @nl
toolkit definition: Een collectieve actor die verantwoordelijk is voor het drukken, vermeerderen, gieten of andere methode van het vervaardigen van een gepubliceerde manifestatie. @nl
label: له وكيل جماعي صانع @ar
definition: يربط بين تجسيدة ووكيل جماعي مسئول عن طباعة، أو نسخ، أو صب، إلخ. تجسيدة منشورة. @ar
toolkit label: وكيل جماعي صانع @ar
toolkit definition: وكيل جماعي مسئول عن طباعة، أو نسخ، أو صب، إلخ. تجسيدة منشورة. @ar
label: té com a agent col·lectiu fabricant @ca
definition: Relaciona una manifestació amb un agent col·lectiu que és responsable de la impressió, la reproducció, el modelat o un altre mètode de fabricació d’una manifestació publicada. @ca
toolkit label: agent col·lectiu fabricant @ca
toolkit definition: Agent col·lectiu que és responsable de la impressió, la reproducció, el modelat o un altre mètode de fabricació d’una manifestació publicada. @ca
label: har kollektiv agent, som er producent @da
definition: Relaterer en manifestation til en kollektiv agent, som er ansvarlig for trykning, duplikering, støbning etc. af en publiceret manifestation. @da
toolkit label: kollektiv agent, som er producent @da
toolkit definition: Kollektiv agent, som er ansvarlig for trykning, duplikering, støbning etc. af en publiceret manifestation. @da
label: valmistaja (kollektiiv) @et
definition: Seostab kehastuse kollektiiviga, kes vastutab avaldatud kehastuse trükkimise, paljundamise, valamise vms eest. @et
toolkit label: valmistaja (kollektiiv) @et
toolkit definition: Kollektiiv, kes vastutab avaldatud kehastuse trükkimise, paljundamise, valamise vms eest. @et
label: hat Herstellerin/Hersteller (Gemeinschaftlicher Akteur) @de
definition: Setzt eine Manifestation in Beziehung zu einem gemeinschaftlichen Akteur, der für den Druck, die Vervielfältigung, den Guss oder eine andere Herstellungsmethode einer veröffentlichten Manifestation verantwortlich ist. @de
toolkit label: Herstellerin/Hersteller (Gemeinschaftlicher Akteur) @de
toolkit definition: Ein gemeinschaftlicher Akteur, der für den Druck, die Vervielfältigung, den Guss oder eine andere Herstellungsmethode einer veröffentlichten Manifestation verantwortlich ist. @de
label: gyártó kollektív ágense a következő: @hu
definition: Hozzákapcsol egy megjelenési formát egy kollektív ágenshez, amely felelős egy kiadott megjelenési forma nyomtatásáért, sokszorosításáért, öntéséért vagy egyéb módú gyártásáért. @hu
toolkit label: gyártó kollektív ágens: @hu
toolkit definition: Egy kollektív ágens, amely felelős egy kiadott megjelenési forma nyomtatásáért, sokszorosításáért, öntéséért vagy egyéb módú gyártásáért. @hu
label: ha come manifattura agente collettivo @it
definition: Correla una manifestazione all'agente collettivo responsabile della stampa, riproduzione, fusione, etc. di una manifestazione pubblicata. @it
toolkit label: manifattura agente collettivo @it
toolkit definition: Agente collettivo responsabile della stampa, riproduzione, fusione, etc. di una manifestazione pubblicata. @it
label: ražotājs (grupa) @lv
definition: Sasaista manifestāciju ar grupu, kas ir atbildīga par resursa publicējamās formas drukāšanu, pavairošanu u.tml. @lv
toolkit label: ražotājs (grupa) @lv
toolkit definition: Grupa, kas ir atbildīga par resursa publicējamās formas drukāšanu, pavairošanu u.tml. @lv
label: 有生产者集体行为者 @zh-hans
definition: 将一种载体表现与负责印刷、复制、铸造或其他方法生产一种出版载体表现的一个集体行为者关联起来。 @zh-hans
toolkit label: 生产者集体行为者 @zh-hans
toolkit definition: 负责印刷、复制、铸造或其他方法生产一种出版载体表现的一个集体行为者 @zh-hans
label: üretici kolektif temsilcisi ile ilişkilidir @tr
definition: Bir gösterimi, basımdan, çoğaltmadan, dökümden veya yayınlanmış bir gösterimi üretmenin başka bir yönteminden sorumlu olan kolektif temsilciyle ilişkilendirir. @tr
toolkit label: üretici kolektif temsilci @tr
toolkit definition: Yayınlanmış bir gösterimi basmak, çoğaltmak, yayınlamak veya diğer yöntemlerle üretmekten sorumlu kolektif bir temsilci. @tr
label: tiene agente colectivo del fabricante @es
definition: Relaciona una manifestación con un agente colectivo que es responsable de imprimir, duplicar, moldear u otro método de fabricación de una manifestación publicada. @es
toolkit label: agente colectivo del fabricante @es
toolkit definition: Un agente colectivo que es responsable de imprimir, duplicar, moldear u otro método de fabricación de una manifestación publicada. @es
has subproperty: has braille embosser collective agent
has subproperty: has manufacturer corporate body
has subproperty: has manufacturer family
has subproperty: has printer collective agent
has subproperty: P30390

has manufacturer corporate body
status: Published
lexical alias: manufacturerCorporateBody.en
definition: Relates a manifestation to a corporate body who is responsible for printing, duplicating, casting, or other method of manufacturing a published manifestation.
toolkit label: manufacturer corporate body
toolkit definition: A corporate body who is responsible for printing, duplicating, casting, or other method of manufacturing a published manifestation.
type: Property
domain: C10007
has element type: 2
sub property of: has creator corporate body of manifestation
sub property of: has manufacturer collective agent
label: valmistaja (yhteisö) @fi
definition: Liittää manifestaation yhteisöön, joka on vastuussa julkaistun manifestaation painamisesta, monistamisesta, kirjasinten valamisesta tai muusta valmistustavasta. @fi
toolkit label: valmistaja (yhteisö) @fi
toolkit definition: Yhteisö, joka on vastuussa julkaistun manifestaation painamisesta, monistamisesta, kirjasinten valamisesta tai muusta valmistustavasta. @fi
label: har tilvirker (korporasjon) @no
definition: Relaterer en manifestasjon til en korporasjon som er ansvarlig for å trykke, mangfoldiggjøre, etc. en publisert manifestasjon. @no
toolkit label: tilvirker (korporasjon) @no
toolkit definition: En korporasjon som er ansvarlig for å trykke, mangfoldiggjøre, etc. en publisert manifestasjon. @no
label: a pour collectivité fabricante @fr
definition: Met une manifestation en relation avec une collectivité qui est responsable de l’impression, de la reproduction, du moulage ou de toute autre méthode de fabrication d’une manifestation publiée. @fr
toolkit label: collectivité fabricante @fr
toolkit definition: Collectivité qui est responsable de l’impression, de la reproduction, du moulage ou de toute autre méthode de fabrication d’une manifestation publiée. @fr
label: heeft vervaardiger-corporatie @nl
definition: Relateert een manifestatie aan een corporatie die verantwoordelijk is voor het drukken, vermeerderen, gieten of andere methode van het vervaardigen van een gepubliceerde manifestatie. @nl
toolkit label: vervaardiger-corporatie @nl
toolkit definition: Een corporatie die verantwoordelijk is voor het drukken, vermeerderen, gieten of andere methode van het vervaardigen van een gepubliceerde manifestatie. @nl
label: له هيئة صانع @ar
definition: يربط بين تجسيدة وهيئة مسئولة عن طباعة، أو نسخ، أو صب، إلخ. تجسيدة منشورة. @ar
toolkit label: هيئة صانع @ar
toolkit definition: هيئة مسئول عن طباعة، أو نسخ، أو صب، إلخ. تجسيدة منشورة. @ar
label: té com a entitat corporativa fabricant @ca
definition: Relaciona una manifestació amb una entitat corporativa que és responsable de la impressió, la reproducció, el modelat o un altre mètode de fabricació d’una manifestació publicada. @ca
toolkit label: entitat corporativa fabricant @ca
toolkit definition: Entitat corporativa que és responsable de la impressió, la reproducció, el modelat o un altre mètode de fabricació d’una manifestació publicada. @ca
label: har korporation, som er producent @da
definition: Relaterer en manifestation til en korporation, som er ansvarlig for trykning, duplikering, støbning etc. af en publiceret manifestation. @da
toolkit label: korporation, som er producent @da
toolkit definition: Korporation, som er ansvarlig for trykning, duplikering, støbning etc. af en publiceret manifestation. @da
label: valmistaja (asutus) @et
definition: Seostab kehastuse asutusega, kes vastutab avaldatud kehastuse trükkimise, paljundamise, valamise vms eest. @et
toolkit label: valmistaja (asutus) @et
toolkit definition: Asutus, kes vastutab avaldatud kehastuse trükkimise, paljundamise, valamise vms eest. @et
label: hat Herstellerin/Hersteller (Körperschaft) @de
definition: Setzt eine Manifestation in Beziehung zu einer Körperschaft, die für den Druck, die Vervielfältigung, den Guss oder eine andere Herstellungsmethode einer veröffentlichten Manifestation verantwortlich ist. @de
toolkit label: Herstellerin/Hersteller (Körperschaft) @de
toolkit definition: Eine Körperschaft, die für den Druck, die Vervielfältigung, den Guss oder eine andere Herstellungsmethode einer veröffentlichten Manifestation verantwortlich ist. @de
label: gyártó testülete a következő: @hu
definition: Hozzákapcsol egy megjelenési formát egy testülethez, amely felelős egy kiadott megjelenési forma nyomtatásáért, sokszorosításáért, öntéséért vagy egyéb módú gyártásáért. @hu
toolkit label: gyártó testület: @hu
toolkit definition: Egy testület, amely felelős egy kiadott megjelenési forma nyomtatásáért, sokszorosításáért, öntéséért vagy egyéb módú gyártásáért. @hu
label: ha come manifattura ente @it
definition: Correla una manifestazione all'ente responsabile della stampa, riproduzione, fusione, etc. di una manifestazione pubblicata. @it
toolkit label: manifattura ente @it
toolkit definition: Ente responsabile della stampa, riproduzione, fusione, etc. di una manifestazione pubblicata. @it
label: ražotājs (institūcija) @lv
definition: Sasaista manifestāciju ar institūciju, kas ir atbildīga par resursa publicējamās formas drukāšanu, pavairošanu u.tml. @lv
toolkit label: ražotājs (institūcija) @lv
toolkit definition: Institūcija, kas ir atbildīga par resursa publicējamās formas drukāšanu, pavairošanu u.tml. @lv
label: 有生产者团体 @zh-hans
definition: 将一种载体表现与负责印刷、复制、铸造或其他方法生产一种出版载体表现的一个团体关联起来。 @zh-hans
toolkit label: 生产者团体 @zh-hans
toolkit definition: 负责印刷、复制、铸造或其他方法生产一种出版载体表现的一个团体 @zh-hans
label: üretici tüzel kişisi ile ilişkilidir @tr
definition: Bir gösterimi, yayımlanmış gösterimin basımı, çoğaltılması, döküm ve üretimi için başka yöntemlerden sorumlu tüzel kişiyle ilişkilendirir. @tr
toolkit label: Üretici tüzel kişi @tr
toolkit definition: Yayımlanmış gösterimin basımı, çoğaltılması, döküm ve üretimi için başka yöntemlerden sorumlu olan tüzel kişi. @tr
label: tiene cuerpo corporativo fabricante @es
definition: Relaciona una manifestación con un cuerpo corporativo que es responsable de imprimir, duplicar, moldear u otro método de fabricación de una manifestación publicada. @es
toolkit label: cuerpo corporativo fabricante @es
toolkit definition: Un cuerpo corporativo que es responsable de imprimir, duplicar, moldear u otro método de fabricación de una manifestación publicada. @es
has subproperty: has braille embosser corporate body
has subproperty: has printer corporate body
has subproperty: P30419

has manufacturer family
status: Published
lexical alias: manufacturerFamily.en
definition: Relates a manifestation to a family who is responsible for printing, duplicating, casting, or other method of manufacturing a published manifestation.
toolkit label: manufacturer family
toolkit definition: A family who is responsible for printing, duplicating, casting, or other method of manufacturing a published manifestation.
type: Property
domain: C10007
has element type: 2
sub property of: has creator family of manifestation
sub property of: has manufacturer collective agent
label: valmistaja (suku) @fi
definition: Liittää manifestaation sukuun, joka on vastuussa julkaistun manifestaation painamisesta, monistamisesta, kirjasinten valamisesta tai muusta valmistustavasta. @fi
toolkit label: valmistaja (suku) @fi
toolkit definition: Suku, joka on vastuussa julkaistun manifestaation painamisesta, monistamisesta, kirjasinten valamisesta tai muusta valmistustavasta. @fi
label: har tilvirker (familie) @no
definition: Relaterer en manifestasjon til en familie som er ansvarlig for å trykke, mangfoldiggjøre, etc. en publisert manifestasjon. @no
toolkit label: tilvirker (familie) @no
toolkit definition: En familie som er ansvarlig for å trykke, mangfoldiggjøre, etc. en publisert manifestasjon. @no
label: a pour famille fabricante @fr
definition: Met une manifestation en relation avec une famille qui est responsable de l’impression, de la reproduction, du moulage ou de toute autre méthode de fabrication d’une manifestation publiée. @fr
toolkit label: famille fabricante @fr
toolkit definition: Famille qui est responsable de l’impression, de la reproduction, du moulage ou de toute autre méthode de fabrication d’une manifestation publiée. @fr
label: heeft vervaardiger-familie @nl
definition: Relateert een manifestatie aan een familie die verantwoordelijk is voor het drukken, vermeerderen, gieten of andere methode van het vervaardigen van een gepubliceerde manifestatie. @nl
toolkit label: vervaardiger-familie @nl
toolkit definition: Een familie die verantwoordelijk is voor het drukken, vermeerderen, gieten of andere methode van het vervaardigen van een gepubliceerde manifestatie. @nl
label: له عائلة صانع @ar
definition: يربط بين تجسيدة وعائلة مسئولة عن طباعة، أو نسخ، أو صب، إلخ. تجسيدة منشورة. @ar
toolkit label: عائلة صانع @ar
toolkit definition: عائلة مسئولة عن طباعة، أو نسخ، أو صب، إلخ. تجسيدة منشورة. @ar
label: té com a família fabricant @ca
definition: Relaciona una manifestació amb una família que és responsable de la impressió, la reproducció, el modelat o un altre mètode de fabricació d’una manifestació publicada. @ca
toolkit label: família fabricant @ca
toolkit definition: Família que és responsable de la impressió, la reproducció, el modelat o un altre mètode de fabricació d’una manifestació publicada. @ca
label: har familie, som er producent @da
definition: Relaterer en manifestation til en familie, som er ansvarlig for trykning, duplikering, støbning etc. af en publiceret manifestation. @da
toolkit label: familie, som er producent @da
toolkit definition: Familie, som er ansvarlig for trykning, duplikering, støbning etc. af en publiceret manifestation. @da
label: valmistaja (perekond) @et
definition: Seostab kehastuse perekonnaga, kes vastutab avaldatud kehastuse trükkimise, paljundamise, valamise vms eest. @et
toolkit label: valmistaja (perekond) @et
toolkit definition: Perekond, kes vastutab avaldatud kehastuse trükkimise, paljundamise, valamise vms eest. @et
label: hat Herstellerin/Hersteller (Familie) @de
definition: Setzt eine Manifestation in Beziehung zu einer Familie, die für den Druck, die Vervielfältigung, den Guss oder eine andere Herstellungsmethode einer veröffentlichten Manifestation verantwortlich ist. @de
toolkit label: Herstellerin/Hersteller (Familie) @de
toolkit definition: Eine Familie, die für den Druck, die Vervielfältigung, den Guss oder eine andere Herstellungsmethode einer veröffentlichten Manifestation verantwortlich ist. @de
label: gyártó családja a következő: @hu
definition: Hozzákapcsol egy megjelenési formát egy családhoz, amely felelős egy kiadott megjelenési forma nyomtatásáért, sokszorosításáért, öntéséért vagy egyéb módú gyártásáért. @hu
toolkit label: gyártó család: @hu
toolkit definition: Egy család, amely felelős egy kiadott megjelenési forma nyomtatásáért, sokszorosításáért, öntéséért vagy egyéb módú gyártásáért. @hu
label: ha come manifattura famiglia @it
definition: Correla una manifestazione alla famiglia responsabile della stampa, riproduzione, fusione, etc. di una manifestazione pubblicata. @it
toolkit label: manifattura famiglia @it
toolkit definition: Famiglia responsabile della stampa, riproduzione, fusione, etc. di una manifestazione pubblicata. @it
label: ražotājs (dzimta/ģimene) @lv
definition: Sasaista manifestāciju ar dzimtu/ģimeni, kas ir atbildīga par resursa publicējamās formas drukāšanu, pavairošanu u.tml. @lv
toolkit label: ražotājs (dzimta/ģimene) @lv
toolkit definition: Dzimta/ģimene, kas ir atbildīga par resursa publicējamās formas drukāšanu, pavairošanu u.tml. @lv
label: 有生产者家族 @zh-hans
definition: 将一种载体表现与负责印刷、复制、铸造或其他方法生产一种出版载体表现的一个家族关联起来。 @zh-hans
toolkit label: 生产者家族 @zh-hans
toolkit definition: 负责印刷、复制、铸造或其他方法生产一种出版载体表现的一个家族 @zh-hans
label: üretici ailesi ile ilişkilidir @tr
definition: Bir gösterimi, basım, çoğaltma, döküm veya yayımlanmamış gösterimi üretmenin başka yöntemlerinden sorumlu aileyle ilişkilendirir. @tr
toolkit label: üretici aile @tr
toolkit definition: Basım, çoğaltma, döküm veya yayımlanmamış gösterimi üretmenin başka yöntemlerinden sorumlu aile. @tr
label: tiene familia fabricante @es
definition: Relaciona una manifestación con una familia que es responsable de imprimir, duplicar, fundir, etc. manufacturar mediante otro método una manifestación inédita. @es
toolkit label: familia fabricante @es
toolkit definition: Una familia que es responsable de imprimir, duplicar, fundir, etc. manufacturar mediante otro método una manifestación inédita. @es
has subproperty: has braille embosser family
has subproperty: has printer family
has subproperty: P30448

has manufacturer person
status: Published
lexical alias: manufacturerPerson.en
definition: Relates a manifestation to a person who is responsible for printing, duplicating, casting, or other method of manufacturing a published manifestation.
toolkit label: manufacturer person
toolkit definition: A person who is responsible for printing, duplicating, casting, or other method of manufacturing a published manifestation.
type: Property
domain: C10007
has element type: 2
sub property of: has creator person of manifestation
sub property of: has manufacturer agent
label: valmistaja (henkilö) @fi
definition: Liittää manifestaation henkilö, joka on vastuussa julkaistun manifestaation painamisesta, monistamisesta, kirjasinten valamisesta tai muusta valmistustavasta. @fi
toolkit label: valmistaja (henkilö) @fi
toolkit definition: Henkilö, joka on vastuussa julkaistun manifestaation painamisesta, monistamisesta, kirjasinten valamisesta tai muusta valmistustavasta. @fi
label: har tilvirker (person) @no
definition: Relaterer en manifestasjon til en person som er ansvarlig for å trykke, mangfoldiggjøre, kaste, etc. en publisert manifestasjon. @no
toolkit label: tilvirker (person) @no
toolkit definition: En person som er ansvarlig for å trykke, mangfoldiggjøre, kaste, etc. en publisert manifestasjon. @no
label: a pour personne fabricante @fr
definition: Met une manifestation en relation avec une personne qui est responsable de l’impression, de la reproduction, du moulage ou de toute autre méthode de fabrication d’une manifestation publiée. @fr
toolkit label: personne fabricante @fr
toolkit definition: Personne qui est responsable de l’impression, de la reproduction, du moulage ou de toute autre méthode de fabrication d’une manifestation publiée. @fr
label: heeft vervaardiger-persoon @nl
definition: Relateert een manifestatie aan een persoon die verantwoordelijk is voor het drukken, vermeerderen, gieten of andere methode van het vervaardigen van een gepubliceerde manifestatie. @nl
toolkit label: vervaardiger-persoon @nl
toolkit definition: Een persoon die verantwoordelijk is voor het drukken, vermeerderen, gieten of andere methode van het vervaardigen van een gepubliceerde manifestatie. @nl
label: له شخص صانع @ar
definition: يربط بين تجسيدة وشخص مسئول عن طباعة، أو نسخ، أو صب، إلخ. تجسيدة منشورة. @ar
toolkit label: شخص صانع @ar
toolkit definition: شخص مسئول عن طباعة، أو نسخ، أو صب، إلخ. تجسيدة منشورة. @ar
label: té com a persona fabricant @ca
definition: Relaciona una manifestació amb una persona que és responsable de la impressió, la reproducció, el modelat o un altre mètode de fabricació d’una manifestació publicada. @ca
toolkit label: persona fabricant @ca
toolkit definition: Persona que és responsable de la impressió, la reproducció, el modelat o un altre mètode de fabricació d’una manifestació publicada. @ca
label: har person, som er producent @da
definition: Relaterer en manifestation til en person, som er ansvarlig for trykning, duplikering, støbning etc. af en publiceret manifestation. @da
toolkit label: person, som er producent @da
toolkit definition: Person, som er ansvarlig for trykning, duplikering, støbning etc. af en publiceret manifestation. @da
label: valmistaja (isik) @et
definition: Seostab kehastuse isikuga, kes vastutab avaldatud kehastuse trükkimise, paljundamise, valamise vms eest. @et
toolkit label: valmistaja (isik) @et
toolkit definition: Isik, kes vastutab avaldatud kehastuse trükkimise, paljundamise, valamise vms eest. @et
label: hat Herstellerin/Hersteller (Person) @de
definition: Setzt eine Manifestation in Beziehung zu einer Person, die für den Druck, die Vervielfältigung, den Guss oder eine andere Herstellungsmethode einer veröffentlichten Manifestation verantwortlich ist. @de
toolkit label: Herstellerin/Hersteller (Person) @de
toolkit definition: Eine Person, die für den Druck, die Vervielfältigung, den Guss oder eine andere Herstellungsmethode einer veröffentlichten Manifestation verantwortlich ist. @de
label: gyártó személye a következő: @hu
definition: Hozzákapcsol egy megjelenési formát egy személyhez, aki felelős egy kiadott megjelenési forma nyomtatásáért, sokszorosításáért, öntéséért vagy egyéb módú gyártásáért. @hu
toolkit label: gyártó személy: @hu
toolkit definition: Egy személy, aki felelős egy kiadott megjelenési forma nyomtatásáért, sokszorosításáért, öntéséért vagy egyéb módú gyártásáért. @hu
label: ha come manifattura persona @it
definition: Correla una manifestazione alla persona responsabile della stampa, riproduzione, fusione, etc. di una manifestazione pubblicata. @it
toolkit label: manifattura persona @it
toolkit definition: Persona responsabile della stampa, riproduzione, fusione, etc. di una manifestazione pubblicata. @it
label: ražotājs (persona) @lv
definition: Sasaista manifestāciju ar personu, kura ir atbildīga par resursa publicējamās formas drukāšanu, pavairošanu u.tml. @lv
toolkit label: ražotājs (persona) @lv
toolkit definition: Persona, kura ir atbildīga par resursa publicējamās formas drukāšanu, pavairošanu u.tml. @lv
label: 有生产者个人 @zh-hans
definition: 将一种载体表现与负责印刷、复制、铸造或其他方法生产一种出版载体表现的一个个人关联起来。 @zh-hans
toolkit label: 生产者个人 @zh-hans
toolkit definition: 负责印刷、复制、铸造或其他方法生产一种出版载体表现的一个个人 @zh-hans
label: üretici kişisi ile ilişkilidir @tr
definition: Bir gösterimi basımdan, çoğaltmadan, rol dağıtımından veya başka bir yöntemle yayınlanmış bir gösteriminden sorumlu olan bir kişiyle ilişkilendirir. @tr
toolkit label: üretici kişi @tr
toolkit definition: Yayımlanmış bir eserin basımı, çoğaltılması, dökümü veya diğer üretim yöntemlerinden sorumlu olan kişi. @tr
label: tiene persona fabricante @es
definition: Relaciona una manifestación con una persona responsable de imprimir, duplicar, moldear u otro método de fabricación de una manifestación publicada. @es
toolkit label: persona fabricante @es
toolkit definition: Una persona responsable de imprimir, duplicar, moldear u otro método de fabricación de una manifestación publicada. @es
has subproperty: has braille embosser person
has subproperty: has printer person
has subproperty: P30361

has other title information
status: Published
definition: Relates a manifestation to a word, character, or group of words or characters that appears in conjunction with, and is subordinate to, a title proper of a manifestation.
type: Property
domain: C10007
lexical alias: otherTitleInformation.en
instruction number: 2.3.4
toolkit label: other title information
toolkit definition: A word, character, or group of words or characters that appears in conjunction with, and is subordinate to, a title proper of a manifestation.
label: a pour complément de titre @fr
definition: Met une manifestation en relation avec un mot, un caractère ou un groupe de mots ou de caractères qui figure conjointement avec un titre propre d’une manifestation et lui est subordonné. @fr
toolkit label: complément de titre @fr
toolkit definition: Mot, caractère ou groupe de mots ou de caractères qui figure conjointement avec un titre propre d’une manifestation et lui est subordonné. @fr
toolkit label: otra información del título @es
toolkit definition: Una palabra, carácter o grupo de palabras o caracteres que aparece en conjunto y está subordinado a un título propio de una manifestación. @es
label: har övrig titelinformation @sv
toolkit label: övrig titelinformation @sv
toolkit label: andere titelinformatie @nl
toolkit definition: Een woord, karakter of groep woorden en/of karakters die verschijnen samen met, en ondergeschikt zijn aan de hoofdtitel van een resource. @nl
label: có thông tin nhan đề khác @vi
definition: Liên kết biểu thị với từ, ký tự, hoặc nhóm từ hoặc ký tự, xuất hiện cùng với, và là dưới cấp của, nhan đề hợp thức của biểu hiện. @vi
toolkit label: thông tin nhan đề khác @vi
toolkit definition: Từ, ký tự, hoặc nhóm từ hoặc ký tự, xuất hiện cùng với, và là dưới cấp của, nhan đề hợp thức của biểu hiện. @vi
label: har anden titelinformation @da
definition: Relaterer en manifestation til et ord, tegn eller en gruppe af ord eller tegn, som optræder i forbindelse med, og er underordnet, en manifestations hovedtitel. @da
toolkit label: anden titelinformation @da
toolkit definition: Ord, tegn eller gruppe af ord eller tegn, som optræder i forbindelse med, og er underordnet, en manifestations hovedtitel. @da
label: hat Titelzusatz @de
definition: Setzt eine Manifestation in Beziehung zu einem Wort, einem Zeichen oder einer Gruppe von Wörtern oder Zeichen, die in Verbindung mit dem Haupttitel einer Manifestation erscheinen und diesem nachgeordnet sind. @de
toolkit label: Titelzusatz @de
toolkit definition: Ein Wort, ein Zeichen oder eine Gruppe von Wörtern oder Zeichen, die in Verbindung mit dem Haupttitel einer Manifestation erscheinen und diesem nachgeordnet sind. @de
label: té com a complement de títol @ca
definition: Relaciona una manifestació amb una paraula, caràcter o grup de paraules o de caràcters que figura en conjunció i subordinat al títol propi d’una manifestació. @ca
toolkit label: complement de títol @ca
toolkit definition: Paraula, caràcter o grup de paraules o de caràcters que figura en conjunció i subordinat al títol propi d’una manifestació. @ca
definition: Liittää manifestaation sanaan, merkkiin tai ryhmään sanoja ja/tai merkkejä, jotka esiintyvät manifestaation päänimekkeen kanssa ja sille alisteisina. @fi
toolkit label: muu nimeketieto @fi
toolkit definition: Sana, merkki tai ryhmä sanoja ja/tai merkkejä, jotka esiintyvät manifestaation päänimekkeen kanssa ja sille alisteisina. @fi
toolkit label: annen tittelinformasjon @no
toolkit definition: Et ord, et tegn eller en gruppe av ord eller tegn som opptrer i forbindelse med, og er underordnet, hovedtittelen til en manifestasjon. @no
label: έχει άλλες πληροφορίες σχετικές με τον τίτλο @el
definition: Συνδέει μια εκδήλωση με μια λέξη, έναν χαρακτήρα ή μια ομάδα λέξεων ή χαρακτήρων που εμφανίζονται σε συνδυασμό με και είναι υποδεέστεροι από έναν κύριο τίτλο μιας εκδήλωσης. @el
toolkit label: άλλες πληροφορίες σχετικές με τον τίτλο @el
toolkit definition: Μια λέξη, ένας χαρακτήρας ή μια ομάδα λέξεων ή χαρακτήρων που εμφανίζονται σε συνδυασμό με και είναι υποδεέστεροι από έναν κύριο τίτλο μιας εκδήλωσης. @el
has element type: 6
label: egyéb címinformációja a következő: @hu
definition: Hozzákapcsol egy megjelenési formát egy szóhoz, karakterhez, vagy szavak vagy karakterek egy csoportjához, amely egy megjelenési forma főcímével párosulva, vagy annak alávetve jelenik meg. @hu
toolkit label: egyéb címinformációja: @hu
toolkit definition: Egy szó, karakter, vagy szavak vagy karakterek egy csoportja, amely egy megjelenési forma főcímével párosulva, vagy annak alávetve jelenik meg. @hu
label: muu nimeketieto @fi
label: har annen tittelinformasjon @no
definition: Relaterer en manifestasjon til et ord, et tegn eller en gruppe av ord eller tegn som opptrer i forbindelse med, og er underordnet, hovedtittelen til en manifestasjon. @no
label: heeft andere titelinformatie @nl
definition: Relateert een manifestatie aan een woord, karakter of groep woorden en/of karakters die verschijnen samen met, en ondergeschikt zijn aan de hoofdtitel van een resource. @nl
label: له بيانات أخرى لعنوان @ar
definition: يربط بين تجسيدة وكلمة أو حرف أو مجموعة كلمات أو تمثيلات تظهر بمصاحبة، وكفرع من العنوان نفسه لتجسيدة. @ar
toolkit label: بيانات أخرى لعنوان @ar
toolkit definition: كلمة أو حرف أو مجموعة كلمات أو تمثيلات تظهر بمصاحبة، وكفرع من العنوان نفسه لتجسيدة. @ar
label: pealkirja täiendandmed @et
definition: Seostab kehastuse sõna, märgi või sõnade ja/või märkide rühmaga, mis on seotud kehastuse põhipealkirjaga ja allub sellele. @et
toolkit label: pealkirja täiendandmed @et
toolkit definition: Sõna, märk või sõnade ja/või märkide rühm, mis on seotud kehastuse põhipealkirjaga ja allub sellele. @et
label: ha come altre informazioni sul titolo @it
definition: Correla una manifestazione a una parola, carattere, o gruppo di parole e/o caratteri che compaiono unitamente e subordinatamente al titolo proprio di una manifestazione. @it
toolkit label: altre informazioni sul titolo @it
toolkit definition: Parola, carattere, o gruppo di parole e/o caratteri che compaiono unitamente e subordinatamente al titolo proprio di una manifestazione. @it
label: citas nosaukumziņas @lv
definition: Sasaista manifestāciju ar ziņām, kas saistītas ar pamatnosaukumu un ir pakļautas resursa pamatnosaukumam. @lv
toolkit label: citas nosaukumziņas @lv
toolkit definition: Ziņas, kas saistītas ar pamatnosaukumu un ir pakļautas resursa pamatnosaukumam. @lv
label: 有其他题名信息 @zh-hans
definition: 将一种载体表现与出现为和一种载体表现的正题名结合并从属于正题名的词、字符或者词或字符的组合关联起来。 @zh-hans
toolkit label: 其他题名信息 @zh-hans
toolkit definition: 出现为和一种载体表现的正题名结合并从属于正题名的词、字符或者词或字符的组合 @zh-hans
label: diğer başlık bilgisi ile ilişkilidir @tr
definition: Bir gösterimi, bir gösterimin uygun bir başlığıyla birlikte görünen ve ona tabi olan bir kelime, karakter ya da kelime grubu veya karakterlerle ilişkilendirir. @tr
toolkit label: diğer başlık bilgisi @tr
toolkit definition: Bir gösterimin uygun bir başlığıyla birlikte görünen ve ona tabi olan bir kelime, karakter ya da kelime veya karakter grubu. @tr
label: tiene otra información del título @es
definition: Relaciona una manifestación con una palabra, carácter o grupo de palabras o caracteres que aparece en conjunto y está subordinado a un título propio de una manifestación. @es

has other agent associated with manifestation (Deprecated)
status: Deprecated
definition: Relates a manifestation to an agent other than a producer, publisher, distributor, or manufacturer who is associated with a manifestation. (Deprecated)
type: Property
domain: C10007
lexical alias: otherAgentManifestation.en
instruction number: 21.6
toolkit label: other agent associated with manifestation (Deprecated)
toolkit definition: An agent other than a producer, publisher, distributor, or manufacturer who is associated with a manifestation. (Deprecated)
label: a pour autre agent associé à une manifestation @fr
definition: Met une manifestation en relation avec un agent, autre qu’un producteur, un éditeur, un diffuseur ou distributeur ou bien un fabricant, associé à une manifestation. @fr
scope note: Sont inclus les maquettistes de livres, les graveurs de planches, etc. @fr
toolkit label: autre agent associé à une manifestation @fr
toolkit definition: Agent, autre qu’un producteur, un éditeur, un diffuseur ou distributeur ou bien un fabricant, associé à une manifestation. @fr
toolkit label: otra persona, familia o entidad corporativa asociada con una manifestación @es
toolkit definition: Una persona, familia o entidad corporativa diferente a un productor, editor, distribuidor o fabricante que está asociada con una manifestación. @es
scope note: Book designers, platemakers, etc., are included. (Deprecated)
label: har övrig person, familj/släkt eller institution knuten till en manifestation @sv
toolkit label: övrig person, familj/släkt eller institution knuten till en manifestation @sv
sub property of: has related agent of manifestation
toolkit label: andere persoon, familie, of corporatie gelieërd aan een manifestatie @nl
toolkit definition: Een persoon, familie of corporatie anders dan een producent, uitgever, distributeur of vervaardiger geassocieerd met een manifestatie. @nl
label: có tác nhân khác liên quan với biểu thị @vi
definition: Liên kết biểu thị với tác nhân khác với nhà sản xuất, nhà xuất bản, nhà phân phối, hoặc nhà chế tạo, liên quan tới biểu thị. @vi
scope note: Người thiết kế sách, người tạo khuôn in, v.v... được bao gồm. @vi
toolkit label: biểu thị tác nhân khác @vi
toolkit definition: Tác nhân khác với nhà sản xuất, nhà xuất bản, nhà phân phối, hoặc nhà chế tạo, liên quan tới biểu thị. @vi
scope note: Boekontwerpers, platenmakers etc. zijn inbegrepen. @nl
label: har anden agent knyttet til en manifestation @da
definition: Relaterer en manifestation til en agent bortset fra producer, udgiver, distributør eller producent knyttet til en manifestation. @da
scope note: Bogdesignere, plademagere etc. er omfattet. @da
toolkit label: anden agent knyttet til en manifestation @da
toolkit definition: Agent bortset fra producer, udgiver, distributør eller producent knyttet til en manifestation. @da
label: hat sonstigen Akteur, der mit einer Manifestation in Verbindung steht @de
definition: Setzt eine Manifestation mit einem Akteur, außer einem Erzeuger, einem Verleger, einem Vertrieb oder einem Hersteller, der mit einer Manifestation in Verbindung steht, in Beziehung. @de
scope note: Dazu gehören Buchgestalter, Druckformenhersteller usw. @de
toolkit label: Sonstiger Akteur, der mit einer Manifestation in Verbindung steht @de
toolkit definition: Ein Akteur, außer ein Erzeuger, ein Verleger, ein Vertrieb oder ein Hersteller, der mit einer Manifestation in Verbindung steht. @de
label: té com a altre agent associat amb una manifestació @ca
definition: Relaciona una manifestació amb un agent diferent d’un productor, un editor, un distribuïdor o un fabricant, associada amb una manifestació. @ca
scope note: Inclou els grafistes, els gravadors de planxes, etc. @ca
toolkit label: altre agent associat amb una manifestació @ca
toolkit definition: Agent diferent d’un productor, un editor, un distribuïdor o un fabricant, associada amb una manifestació. @ca
label: manifestaatioon liittyvä muu toimija @fi
definition: Liittää manifestaation manifestaatioon liittyvään toimijaan, joka ei ole manifestaation tuottaja, kustantaja, jakaja tai valmistaja. @fi
toolkit label: manifestaatioon liittyvä muu toimija @fi
toolkit definition: Manifestaatioon liittyvä toimija, joka ei ole manifestaation tuottaja, kustantaja, jakaja tai valmistaja. @fi
toolkit label: annen agent som forbindes med manifestasjon av @no
toolkit definition: En agent som forbindes med en manifestasjon og som ikke er tilvirker, utgiver, distributør eller tilvirker. @no
label: έχει άλλον φορέα σχετικό με την εκδήλωση @el
definition: Συνδέει μια εκδήλωση με έναν φορέα άλλον από τον παραγωγό, τον εκδότη, τον διαθέτη ή τον κατασκευαστή που συνδέεται με μια εκδήλωση. . @el
scope note: Περιλαμβάνονται σχεδιαστές βιβλίου, κατασκευαστές μήτρας κ.λπ. @el
toolkit label: άλλος φορέας σχετικός με την εκδήλωση @el
toolkit definition: Ένας φορέας άλλος από τον παραγωγό, τον εκδότη, τον διαθέτη ή τον κατασκευαστή που συνδέεται με μια εκδήλωση. . @el
has element type: 3
label: van megjelenési formához kötődő más ágense @hu
definition: Egy megjelenési formát hozzákapcsol egy ágenshez (személyhez, családhoz vagy testülethez), aki/amely más, mint egy megjelenési formához kötődő producer, kiadó, terjesztő vagy gyártó. @hu
scope note: Könyvtervezőket, lemezkészítőket stb. is beleértve. @hu
toolkit label: egy megjelenési formához kötődő egyéb ágens @hu
toolkit definition: Egy ágens (személy, család vagy testület), aki/amely más, mint a megjelenési formával kapcsolatos producer, kiadó, terjesztő vagy gyártó. @hu
has subproperty: P30079

has material
status: Published
type: Property
lexical alias: material.en
definition: Relates a manifestation to a physical or chemical substance that is used to create a manifestation.
domain: C10007
toolkit label: material
toolkit definition: A physical or chemical substance that is used to create a manifestation.
has element type: 4
label: materiaali @fi
definition: Liittää manifestaation fysikaaliseen tai kemialliseen aineeseen, jota on käytetty manifestaation luomisessa. @fi
toolkit label: materiaali @fi
toolkit definition: Fysikaalinen tai kemiallinen aine, jota on käytetty manifestaation luomisessa. @fi
label: har materiale @no
definition: Relaterer en manifestasjon til en fysisk eller kjemisk substans som brukes til å lage en manifestasjon. @no
toolkit label: materiale @no
toolkit definition: En fysisk eller kjemisk substans som brukes til å lage en manifestasjon. @no
label: a pour matériau @fr
definition: Met une manifestation en relation avec une substance physique ou chimique qui est utilisée pour créer une manifestation. @fr
toolkit label: matériau @fr
toolkit definition: Substance physique ou chimique qui est utilisée pour créer une manifestation. @fr
label: heeft materiaal @nl
definition: Relateert een manifestatie aan een fysieke of chemische substantie die is gebruikt om een manifestatie te creëren. @nl
toolkit label: materiaal @nl
toolkit definition: Een fysieke of chemische substantie die is gebruikt om een manifestatie te creëren. @nl
label: له مادة @ar
definition: يربط بين تجسيدة ومادة فيزيائية أو كيميائية مستخدمة في إنشاء تجسيدة. @ar
toolkit label: مادة @ar
toolkit definition: مادة فيزيائية أو كيميائية مستخدمة في إنشاء تجسيدة. @ar
label: té com a material @ca
definition: Relaciona una manifestació amb una substància física o química que s’usa per crear una manifestació. @ca
toolkit definition: Substància física o química que s’usa per crear una manifestació. @ca
definition: Relaterer en manifestation til et fysisk eller kemisk stof, der anvendes til at skabe en manifestation. @da
toolkit definition: Fysisk eller kemisk stof, der anvendes til at skabe en manifestation. @da
label: materjal @et
definition: Seostab kehastuse füüsilise või keemilise ainega, mida on kasutatud kehastuse teostamiseks. @et
toolkit label: materjal @et
toolkit definition: Füüsiline või keemiline aine, mida on kasutatud kehastuse teostamiseks. @et
label: hat Material @de
definition: Setzt eine Manifestation in Beziehung zu einer physischen oder chemischen Substanz, die zur Erstellung einer Manifestation verwendet wird. @de
toolkit label: Material @de
toolkit definition: Eine physische oder chemische Substanz, die zur Erstellung einer Manifestation verwendet wird. @de
label: anyaga a következő: @hu
definition: Hozzákapcsol egy megjelenési formát egy olyan fizikai vagy kémiai anyaghoz, amelyet egy megjelenési forma létrehozásához használnak. @hu
toolkit label: anyaga: @hu
toolkit definition: Egy olyan fizikai vagy kémiai anyag, amelyet egy megjelenési forma létrehozásához használnak. @hu
label: ha come materiale @it
definition: Correla una manifestazione a una sostanza chimica o fisica utilizzata per creare una manifestazione. @it
toolkit definition: Sostanza chimica o fisica utilizzata per creare una manifestazione. @it
label: materiāls @lv
definition: Sasaista manifestāciju ar fizisku vai ķīmisku vielu, ko izmanto, lai radītu manifestāciju. @lv
toolkit label: materiāls @lv
toolkit definition: Fiziska vai ķīmiska viela, ko izmanto, lai radītu manifestāciju. @lv
label: 有材料 @zh-hans
definition: 将一种载体表现与被用于创建一种载体表现的一种物理或化学物质关联起来。 @zh-hans
toolkit label: 材料 @zh-hans
toolkit definition: 被用于创建一种载体表现的一种物理或化学物质 @zh-hans
label: materyal ile ilişkilidir @tr
definition: Bir gösterimi, gösterim oluşturmak için kullanılan fiziksel veya kimyasal bir madde ile ilişkilendirir. @tr
toolkit label: malzeme @tr
toolkit definition: Bir gösterim yaratmak için kullanılan fiziksel veya kimyasal madde. @tr
label: tiene material @es
definition: Relaciona una manifestación con una sustancia física o química que se utiliza para crear una manifestación. @es
toolkit definition: Una sustancia física o química que se utiliza para crear una manifestación. @es
has subproperty: has base material
has subproperty: has applied material
has subproperty: P30304

has note on title
status: Published
definition: Relates a manifestation to a note on manifestation that provides information on inaccuracies appearing in titles, complex changes in titles, or on other information relating to a title.
type: Property
domain: C10007
sub property of: has note on manifestation
lexical alias: noteOnTitle.en
instruction number: 2.17.2
toolkit label: note on title
toolkit definition: A note on manifestation that provides information on inaccuracies appearing in titles, complex changes in titles, or on other information relating to a title.
label: a pour note sur un titre @fr
definition: Met une manifestation en relation avec une note sur une manifestation qui fournit de l’information sur les inexactitudes figurant dans des titres, sur les changements de titres complexes ou sur toute autre information relative à un titre. @fr
toolkit label: note sur un titre @fr
toolkit definition: Note sur une manifestation qui fournit de l’information sur les inexactitudes figurant dans des titres, sur les changements de titres complexes ou sur toute autre information relative à un titre. @fr
toolkit label: nota en el título @es
toolkit definition: Una nota sobre manifestación que proporciona información sobre inexactitudes que aparecen en los títulos, cambios complejos en los títulos u otra información relacionada con un título. @es
label: har anmärkning om titel @sv
toolkit label: anmärkning om titel @sv
toolkit label: noot bij titel @nl
toolkit definition: Een noot bij manifestatie die informatie verschaft over onnauwkeurigheden in titels, complexe veranderingen in titels of andere informatie gerelateerd aan een titel. @nl
label: có ghi chú về nhan đề @vi
definition: Liên kết biểu thị với ghi chú cung cấp thông tin về nguồn mà từ đó nhan đề được lấy ra, về ngày mà nhan đề được xem, về không đúng, xoá, v.v..., hoặc về thông tin khác liên quan tới nhan đề. @vi
toolkit label: ghi chú về nhan đề @vi
toolkit definition: Ghi chú cung cấp thông tin về nguồn mà từ đó nhan đề được lấy ra, về ngày mà nhan đề được xem, về không đúng, xoá, v.v..., hoặc về thông tin khác liên quan tới nhan đề. @vi
label: har note om titel @da
definition: Relaterer en manifestation til en note om manifestation, som giver information om unøjagtigheder i titler, større ændringer i titler eller anden information, som relaterer til en titel. @da
toolkit label: note om titel @da
toolkit definition: Note om manifestation, som giver information om unøjagtigheder i titler, større ændringer i titler eller anden information, som relaterer til en titel. @da
label: hat Anmerkung zum Titel @de
definition: Setzt eine Manifestation in Beziehung zu einer Anmerkung zur Manifestation, die Informationen über Ungenauigkeiten in Titeln, unübersichtliche Änderungen in Titeln oder andere Informationen, die sich auf den Titel beziehen, enthält. @de
toolkit label: Anmerkung zum Titel @de
toolkit definition: Eine Anmerkung zur Manifestation, die Informationen über Ungenauigkeiten in Titeln, unübersichtliche Änderungen in Titeln oder andere Informationen, die sich auf den Titel beziehen, enthält. @de
label: té com a nota sobre títol @ca
definition: Relaciona una manifestació amb una nota sobre una manifestació que proporciona la informació sobre les incorreccions que figuren en els títols, els canvis complexos en els títols o sobre qualsevol altra informació relativa a un títol. @ca
toolkit label: nota sobre títol @ca
toolkit definition: Nota sobre una manifestació que proporciona la informació sobre les incorreccions que figuren en els títols, els canvis complexos en els títols o sobre qualsevol altra informació relativa a un títol. @ca
definition: Liittää manifestaation huomautukseen, joka sisältää tietoa nimekkeiden epätarkkuuksista, nimekkeiden vaihteluista tai muuta nimekkeeseen liittyvää tietoa. @fi
toolkit label: huomautus nimekkeestä @fi
toolkit definition: Huomautus, joka sisältää tietoa nimekkeiden epätarkkuuksista, nimekkeiden vaihteluista tai muuta nimekkeeseen liittyvää tietoa. @fi
toolkit label: note om tittel @no
toolkit definition: En note om manifestasjon som gir informasjon om unøyaktigheter som opptrer i titler, komplekse endringer i titler eller om annen informasjon som vedrører en tittel. @no
label: έχει σημείωση στον τίτλο @el
definition: Συνδέει μια εκδήλωση με μια σημείωση που παρέχει τις πληροφορίες για την πηγή άντλησης του τίτλου, για τη χρονολογία θέασης του τίτλου, για τις παραλλαγές των τίτλων, για τις ανακρίβειες, τις διαγραφές κ.λπ. ή για άλλες πληροφορίες που σχετίζονται με έναν τίτλο. @el
toolkit label: σημείωση στον τίτλο @el
toolkit definition: Μια σημείωση που παρέχει τις πληροφορίες για την πηγή άντλησης του τίτλου, για τη χρονολογία θέασης του τίτλου, για τις παραλλαγές των τίτλων, για τις ανακρίβειες, τις διαγραφές κ.λπ. ή για άλλες πληροφορίες που σχετίζονται με έναν τίτλο. @el
has element type: 6
label: A címről szóló megjegyzése a következő: @hu
definition: Hozzákapcsol egy megjelenési formát egy megjelenési formára tett megjegyzéshez, amely információt nyújt a címekben előforduló pontatlanságokról, bonyolult változásokról, vagy más, a címmel kapcsolatos információkról. @hu
toolkit label: címről szóló megjegyzése: @hu
toolkit definition: Egy megjelenési formára tett megjegyzés, amely információt nyújt a címekben előforduló pontatlanságokról, bonyolult változásokról, vagy más, a címmel kapcsolatos információkról. @hu
label: huomautus nimekkeestä @fi
label: har note om tittel @no
definition: Relaterer en manifestasjon til en note om manifestasjon som gir informasjon om unøyaktigheter som opptrer i titler, komplekse endringer i titler eller om annen informasjon som vedrører en tittel. @no
label: heeft noot bij titel @nl
definition: Relateert een manifestatie aan een noot bij manifestatie die informatie verschaft over onnauwkeurigheden in titels, complexe veranderingen in titels of andere informatie gerelateerd aan een titel. @nl
label: له تبصرة عن العنوان @ar
definition: يربط بين تجسيدة وتبصرة عن التجسيدة التي تعطي معلومات عن الأخطاء التي تظهر في العناوين، أو التغيرات المعقدة في العناوين، أو أي معلومات أخرى متعلقة بعنوان. @ar
toolkit label: تبصرة عن العنوان @ar
toolkit definition: تبصرة عن التجسيدة التي تعطي معلومات عن الأخطاء التي تظهر في العناوين، أو التغيرات المعقدة في العناوين، أو أي معلومات أخرى متعلقة بعنوان. @ar
label: märkus pealkirja kohta @et
definition: Seostab kehastuse märkusega, mis sisaldab infot pealkirjades esinevate vigade, pealkirja muutuste või muu pealkirjadega seotu kohta. @et
toolkit label: märkus pealkirja kohta @et
toolkit definition: Märkus, mis sisaldab infot pealkirjades esinevate vigade, pealkirja muutuste või muu pealkirjadega seotu kohta. @et
label: ha come nota sul titolo @it
definition: Correla una manifestazione a una nota sulla manifestazione che fornisce informazioni su inesattezze e variazioni nei titoli, o altre informazioni relative a un titolo. @it
toolkit label: nota sul titolo @it
toolkit definition: Nota sulla manifestazione che fornisce informazioni su inesattezze e variazioni nei titoli, o altre informazioni relative a un titolo. @it
label: piezīme par nosaukumu @lv
definition: Sasaista manifestāciju ar piezīmi par manifestāciju, kurā ir ziņas par neprecizitātēm nosaukumos, nozīmīgām izmaiņām virsrakstos vai citu informāciju, kas saistīta ar nosaukumu. @lv
toolkit label: piezīme par nosaukumu @lv
toolkit definition: Piezīme par manifestāciju, kurā ir ziņas par neprecizitātēm nosaukumos, nozīmīgām izmaiņām virsrakstos vai citu informāciju, kas saistīta ar nosaukumu. @lv
label: 有关于题名的附注 @zh-hans
definition: 将一种载体表现与提供关于题名出现不准确性、题名复杂变化或其他与题名相关信息的关于载体表现的附注关联起来。 @zh-hans
toolkit label: 关于题名的附注 @zh-hans
toolkit definition: 提供关于题名出现不准确性、题名复杂变化或其他与题名相关信息的关于载体表现的附注 @zh-hans
label: başlık hakkında not ile ilişkilidir @tr
definition: Bir gösterimi, başlıklarda görünen yanlışlıklar, başlıklardaki karmaşık değişiklikler veya bir başlıkla ilgili diğer bilgiler hakkında bilgi sağlayan bir gösterim notuyla ilişkilendirir. @tr
toolkit label: Başlık notu @tr
toolkit definition: Başlıklarda görünen yanlışlıklar, başlıklardaki karmaşık değişiklikler veya bir başlıkla ilgili diğer bilgiler hakkında bilgi sağlayan bir gösterim üzerine bir not @tr
label: tiene nota en el título @es

has note on copyright date
status: Published
definition: Relates a manifestation to a note on manifestation that provides information on a copyright date.
type: Property
domain: C10007
sub property of: has note on manifestation
lexical alias: noteOnCopyrightDate.en
instruction number: 2.17.10
toolkit label: note on copyright date
toolkit definition: A note on manifestation that provides information on a copyright date.
label: a pour note sur une date de copyright @fr
definition: Met une manifestation en relation avec une note sur une manifestation qui fournit de l’information sur une date de copyright. @fr
toolkit label: note sur une date de copyright @fr
toolkit definition: Note sur une manifestation qui fournit de l’information sur une date de copyright. @fr
toolkit label: nota sobre la fecha de copyright @es
toolkit definition: Una nota sobre manifestación que proporciona información sobre una fecha de copyright. @es
label: har anmärkning om copyrightår @sv
toolkit label: anmärkning om copyrightår @sv
toolkit label: noot bij copyrightdatum @nl
toolkit definition: Een noot bij manifestatie die informatie verschaft over een copyrightdatum. @nl
label: có ghi chú về ngày bản quyền @vi
definition: Liên kết biểu thị với ghi chú cung cấp thông tin về ngày bản quyền không được ghi như là phần của yếu tố ngày bản quyền. @vi
toolkit label: ghi chú về ngày bản quyền @vi
toolkit definition: Ghi chú cung cấp thông tin về ngày bản quyền không được ghi như là phần của yếu tố ngày bản quyền. @vi
label: har note om copyrightdato @da
definition: Relaterer en manifestation til en note om manifestation, som giver information om copyrightdato. @da
toolkit label: note om copyrightdato @da
toolkit definition: Note om manifestation, som giver information om copyrightdato. @da
label: hat Anmerkung zum Copyright-Datum @de
definition: Setzt eine Manifestation in Beziehung zu einer Anmerkung zur Manifestation, die Informationen über ein Copyright-Datum enthält. @de
toolkit label: Anmerkung zum Copyright-Datum @de
toolkit definition: Eine Anmerkung zur Manifestation, die Informationen über ein Copyright-Datum enthält. @de
label: té com a nota sobre data de copyright @ca
definition: Relaciona una manifestació amb una nota sobre una manifestació que proporciona la informació sobre una data de copyright. @ca
toolkit label: nota sobre data de copyright @ca
toolkit definition: Nota sobre una manifestació que proporciona la informació sobre una data de copyright. @ca
definition: Liittää manifestaation huomautukseen, joka sisältää tietoa copyright-vuodesta. @fi
toolkit label: huomautus copyright-vuodesta @fi
toolkit definition: Huomautus, joka sisältää tietoa copyright-vuodesta. @fi
toolkit label: note om tidspunkt for copyright @no
toolkit definition: En note om manifestasjon som gir informasjon om et tidspunkt for copyright. @no
label: έχει σημείωση στη χρονολογία του copyright @el
definition: Συνδέει μια εκδήλωση με μια σημείωση που παρέχει τις πληροφορίες για τις χρονολογίες copyright οι οποίες δεν καταχωρίζονται ως μέρος του στοιχείου της χρονολογίας του copyright. @el
toolkit label: σημείωσηστη χρονολογία copyright @el
toolkit definition: Μια σημείωση που παρέχει τις πληροφορίες για τις χρονολογίες copyright οι οποίες δεν καταχωρίζονται ως μέρος του στοιχείου της χρονολογίας του copyright. @el
has element type: 6
label: a copyright időpontról szóló megjegyzése a következő: @hu
definition: Hozzákapcsol egy megjelenési formát egy megjelenési formára tett megjegyzéshez, amely információt nyújt a copyright időpontjáról. @hu
toolkit label: copyright időpontról szóló megjegyzése: @hu
toolkit definition: Egy megjelenési formára tett megjegyzés, amely információt nyújt a copyright időpontjáról. @hu
label: huomautus copyright-vuodesta @fi
label: har note om tidspunkt for copyright @no
definition: Relaterer en manifestasjon til en note om manifestasjon som gir informasjon om et tidspunkt for copyright. @no
label: heeft noot bij copyrightdatum @nl
definition: Relateert een manifestatie aan een noot bij manifestatie die informatie verschaft over een copyrightdatum. @nl
label: له تبصرة عن تاريخ حق النشر @ar
definition: يربط بين تجسيدة وتبصرة عن التجسيدة التي تعطي معلومات عن تاريخ حقوق النشر. @ar
toolkit label: تبصرة عن تاريخ حق النشر @ar
toolkit definition: تبصرة عن التجسيدة التي تعطي معلومات عن تاريخ حقوق النشر. @ar
label: märkus copyright'i aasta kohta @et
definition: Seostab kehastuse märkusega, mis sisaldab infot copyright'i aasta kohta. @et
toolkit label: märkus copyright'i aasta kohta @et
toolkit definition: Märkus, mis sisaldab infot copyright'i aasta kohta. @et
label: ha come nota sulla data di copyright @it
definition: Correla una manifestazione a una nota sulla manifestazione che fornisce informazioni relative a una data di copyright. @it
toolkit label: nota sulla data di copyright @it
toolkit definition: Nota sulla manifestazione che fornisce informazioni relative a una data di copyright. @it
label: piezīme par autortiesību datējumu @lv
definition: Sasaista manifestāciju ar piezīmi par manifestāciju, kurā ir ziņas par autortiesību datējumu. @lv
toolkit label: piezīme par autortiesību datējumu @lv
toolkit definition: Piezīme par manifestāciju, kurā ir ziņas par autortiesību datējumu. @lv
label: 有版权日期附注 @zh-hans
definition: 将一种载体表现与提供版权日期信息的关于载体表现的附注关联起来。 @zh-hans
toolkit label: 版权日期附注 @zh-hans
toolkit definition: 提供版权日期信息的关于载体表现的附注 @zh-hans
label: telif tarihi hakkında not ile ilişkilidir @tr
definition: Bir gösterimi, telif hakkı tarihi hakkında bilgi sağlayan bir notla ilişkilendirir. @tr
toolkit label: Telif hakkı not @tr
toolkit definition: Gösterimin telif hakkı hakkında bilgi veren bir not. @tr
label: tiene nota sobre la fecha de copyright @es

has note on frequency (Deprecated)
status: Deprecated
definition: Relates a manifestation to a note providing details on the currency of the contents, on the frequency of release of issues or parts of a serial or the frequency of updates to an integrating resource, or on changes in frequency. (Deprecated)
type: Property
domain: C10007
sub property of: has note on manifestation
lexical alias: noteOnFrequency.en
instruction number: 2.17.12
toolkit label: note on frequency (Deprecated)
toolkit definition: A note providing details on the currency of the contents, on the frequency of release of issues or parts of a serial or the frequency of updates to an integrating resource, or on changes in frequency. (Deprecated)
label: a pour note sur la périodicité @fr
definition: Met une manifestation en relation avec une note qui fournit des précisions sur la fraîcheur du contenu, sur la périodicité des livraisons ou parties d’une publication en série ou la périodicité des mises à jour d’une ressource intégratrice, ou sur les changements de périodicité. @fr
toolkit label: note sur la périodicité @fr
toolkit definition: Note qui fournit des précisions sur la fraîcheur du contenu, sur la périodicité des livraisons ou parties d’une publication en série ou la périodicité des mises à jour d’une ressource intégratrice, ou sur les changements de périodicité. @fr
toolkit label: nota sobre la frecuencia @es
toolkit definition: Una nota que proporciona detalles sobre la frecuencia de salida de las entregas o partes de una publicación seriada, la frecuencia de actualizaciones de un recurso integrable, la actualidad de los contenidos, o cambios en la frecuencia. @es
label: har anmärkning om frekvens @sv
toolkit label: anmärkning om frekvens @sv
toolkit label: annotatie bij de verschijningsfrequentie @nl
toolkit definition: Een noot die gegevens verschaft over de actualiteit van de inhoud, over de verschijningsfrequentie van afleveringen of delen van een seriële publicatie, of de verschijningsfrequentie van updates voor een integrating resource, of over wijzigingen in verschijningsfrequentie. @nl
label: có ghi chú về tần số @vi
definition: Liên kết biểu thị với ghi chú cung cấp chi tiết về lưu hành nội dung, về tần số phát hành các số hoặc phần của ấn phẩm nhiều kỳ hoặc tần số cập nhật của nguồn lực tích hợp, hoặc về thay đổi về tần số. @vi
toolkit label: ghi chú về tần số @vi
toolkit definition: Ghi chú cung cấp chi tiết về lưu hành nội dung, về tần số phát hành các số hoặc phần của ấn phẩm nhiều kỳ hoặc tần số cập nhật của nguồn lực tích hợp, hoặc về thay đổi về tần số. @vi
label: har note om frekvens @da
definition: Relaterer en manifestation til en note, der giver detaljer om dækningsperioden, om udgivelsesfrekvensen for numre eller dele af et periodikum eller opdateringsfrekvensen for en integrerende ressource eller ændringer i frekvens. @da
toolkit label: note om frekvens @da
toolkit definition: Note, der giver detaljer om dækningsperioden, om udgivelsesfrekvensen for numre eller dele af et periodikum eller opdateringsfrekvensen for en integrerende ressource eller ændringer i frekvens. @da
label: hat Anmerkung zur Erscheinungsfrequenz @de
definition: Setzt eine Manifestation mit einer Anmerkung, die Einzelheiten zur Aktualität der Inhalte, zur Erscheinungsfrequenz von Ausgaben oder Teilen einer fortlaufenden Ressource oder zur Erscheinungsfrequenz von Aktualisierungen einer integrierenden Ressource oder zu Veränderungen in der Erscheinungsfrequenz liefert, in Beziehung. @de
toolkit label: Anmerkung zur Erscheinungsfrequenz @de
toolkit definition: Eine Anmerkung, die Einzelheiten zur Aktualität der Inhalte, zur Erscheinungsfrequenz von Ausgaben oder Teilen einer fortlaufenden Ressource oder zur Erscheinungsfrequenz von Aktualisierungen einer integrierenden Ressource oder zu Veränderungen in der Erscheinungsfrequenz liefert. @de
label: té com a nota sobre periodicitat @ca
definition: Relaciona una manifestació amb una nota que proporciona la informació sobre l’actualitat del contingut, la periodicitat del lliurament dels números o les parts d’una publicació en sèrie o la periodicitat de les actualitzacions d’un recurs integrant, o sobre els canvis en la periodicitat. @ca
toolkit label: nota sobre periodicitat @ca
toolkit definition: Nota que proporciona la informació sobre l’actualitat del contingut, la periodicitat del lliurament dels números o les parts d’una publicació en sèrie o la periodicitat de les actualitzacions d’un recurs integrant, o sobre els canvis en la periodicitat. @ca
label: huomautus ilmestymistiheydestä @fi
definition: Liittää manifestaation huomautukseen, joka sisältää tietoja sisällön ajantasaisuudesta, sarja-aineiston numeroiden tai osien julkaisemisen tiheydestä, päivittyvän aineiston päivitystiheydestä tai ilmestymistiheyden muutoksista. @fi
toolkit label: huomautus ilmestymistiheydestä @fi
toolkit definition: Huomautus, joka sisältää tietoja sisällön ajantasaisuudesta, sarja-aineiston numeroiden tai osien julkaisemisen tiheydestä, päivittyvän aineiston päivitystiheydestä tai ilmestymistiheyden muutoksista. @fi
toolkit definition: En note som gir detaljer om innholdets oppdatering, om frekvensen for utgivelse av hefter eller deler av et periodikum eller frekvensen for oppdateringer av en integrerende ressurs, eller om endringer i frekvens. @no
label: έχει σημείωση στη συχνότητα @el
definition: Συνδέει μια εκδήλωση με μια σημείωση που παρέχει τις λεπτομέρειες για την επικαιρότητα των περιεχομένων, για τη συχνότητα της κυκλοφορίας των τευχών ή των μερών ενός περιοδικού ή για τη συχνότητα των ενημερώσεων του ενσωματωμένου πόρου ή του πόρου διαρκούς ενημέρωσης/ανανέωσης ή για τις αλλαγές στη συχνότητα. @el
toolkit label: σημείωση στη συχνότητα @el
toolkit definition: Μια σημείωση που παρέχει τις λεπτομέρειες για την επικαιρότητα των περιεχομένων, για τη συχνότητα της κυκλοφορίας των τευχών ή των μερών ενός περιοδικού ή για τη συχνότητα των ενημερώσεων του ενσωματωμένου πόρου ή του πόρου διαρκούς ενημέρωσης/ανανέωσης ή για τις αλλαγές στη συχνότητα. @el
has element type: 6
label: van megjegyzése gyakoriságról @hu
definition: Egy megjelenési formát hozzákapcsol egy megjegyzéshez, amely részletekkel szolgál egy folytatódó dokumentum vagy periodika tartalmának az érvényességéről, a folytatódó dokumentum vagy periodika számainak vagy részeinek a megjelenési gyakoriságáról, vagy egy integráló forrásba való frissítés gyakoriságáról, vagy a gyakoriság változásairól. @hu
toolkit label: megjegyzés gyakoriságról @hu
toolkit definition: Egy megjegyzés, amely részleteket közöl a tartalom jelenidejűségéről vagy aktualitásáról, egy periodika számainak vagy részeinek megjelentetési gyakoriságáról, vagy egy integráló forrás frissítésének gyakoriságáról, vagy a gyakoriság változásairól. @hu
has subproperty: P30056

has note on manufacture statement
status: Published
definition: Relates a manifestation to a note on manifestation that provides information on the manufacture of a manifestation.
type: Property
domain: C10007
sub property of: has note on manifestation
lexical alias: noteOnManufactureStatement.en
instruction number: 2.17.9
toolkit label: note on manufacture statement
toolkit definition: A note on manifestation that provides information on the manufacture of a manifestation.
label: a pour note sur une mention de fabrication @fr
definition: Met une manifestation en relation avec une note sur une manifestation qui fournit de l’information sur la fabrication d’une manifestation. @fr
toolkit label: note sur une mention de fabrication @fr
toolkit definition: Note sur une manifestation qui fournit de l’information sur la fabrication d’une manifestation. @fr
toolkit label: nota en la declaración de fabricación @es
toolkit definition: Una nota sobre manifestación que proporciona información sobre la fabricación de una manifestación. @es
label: har anmärkning om tillverkningsuppgift @sv
toolkit label: anmärkning om tillverkningsuppgift @sv
toolkit label: noot bij vervaardigingsvermelding @nl
toolkit definition: Een noot bij manifestatie die informatie verschaft over de vervaardiging van een manifestatie. @nl
label: có ghi chú về thông tin chế tạo @vi
definition: Liên kết biểu thị với ghi chú cung cấp chi tiết về địa điểm chế tạo, nhà chế tạo, hoặc ngày chế tạo, hoặc thông tin về thay đổi trong địa điểm chế tạo, nhà chế tạo, hoặc tên nhà chế tạo. @vi
toolkit label: ghi chú về thông tin chế tạo @vi
toolkit definition: Ghi chú cung cấp chi tiết về địa điểm chế tạo, nhà chế tạo, hoặc ngày chế tạo, hoặc thông tin về thay đổi trong địa điểm chế tạo, nhà chế tạo, hoặc tên nhà chế tạo. @vi
label: har note om fremstillingsoplysning @da
definition: Relaterer en manifestation til en note om manifestation, som giver information om fremstillingen af en manifestation. @da
toolkit label: note om fremstillingsoplysning @da
toolkit definition: Note om manifestation, som giver information om fremstillingen af en manifestation. @da
label: hat Anmerkung zur Herstellungsangabe @de
definition: Setzt eine Manifestation in Beziehung zu einer Anmerkung zur Manifestation, die Informationen über die Herstellung einer Manifestation enthält. @de
toolkit label: Anmerkung zur Herstellungsangabe @de
toolkit definition: Eine Anmerkung zur Manifestation, die Informationen über die Herstellung einer Manifestation enthält. @de
label: té com a nota sobre menció de fabricació @ca
definition: Relaciona una manifestació amb una nota sobre una manifestació que proporciona la informació sobre la fabricació d’una manifestació. @ca
toolkit label: nota sobre menció de fabricació @ca
toolkit definition: Nota sobre una manifestació que proporciona la informació sobre la fabricació d’una manifestació. @ca
definition: Liittää manifestaation huomautukseen, joka sisältää tietoja manifestaation valmistuksesta. @fi
toolkit label: huomautus valmistusmerkinnöstä @fi
toolkit definition: Huomautus, joka sisältää tietoja manifestaation valmistuksesta. @fi
toolkit label: note om framstillingsangivelse @no
toolkit definition: En note om manifestasjon som gir informasjon om framstillingen av en manifestasjon. @no
label: έχει σημείωση στη μνεία κατασκευής @el
definition: Συνδέει μια εκδήλωση με μια σημείωση που παρέχει τις λεπτομέρειες για τον τόπο της κατασκευής, τον κατασκευαστή ή τη χρονολογία της κατασκευής ή τις πληροφορίες για τις αλλαγές σε έναν τόπο κατασκευής, σε έναν κατασκευαστή ή στο όνομα ενός κατασκευαστή. @el
toolkit label: σημείωση στη μνεία κατασκευής @el
toolkit definition: Μια σημείωση που παρέχει τις λεπτομέρειες για τον τόπο της κατασκευής, τον κατασκευαστή ή τη χρονολογία της κατασκευής ή τις πληροφορίες για τις αλλαγές σε έναν τόπο κατασκευής, σε έναν κατασκευαστή ή στο όνομα ενός κατασκευαστή. @el
has element type: 6
label: gyártási közlésről szóló megjegyzése a következő: @hu
definition: Hozzákapcsol egy megjelenési formát egy megjelenési formára tett megjegyzéshez, amely információt nyújt egy megjelenési forma gyártásáról. @hu
toolkit label: gyártási közlésről szóló megjegyzése: @hu
toolkit definition: Egy megjelenési formára tett megjegyzés, amely információt nyújt egy megjelenési forma gyártásáról. @hu
label: huomautus valmistusmerkinnöstä @fi
label: har note om framstillingsangivelse @no
definition: Relaterer en manifestasjon til en note om manifestasjon som gir informasjon om framstillingen av en manifestasjon. @no
label: heeft noot bij vervaardigingsvermelding @nl
definition: Relateert een manifestatie aan een noot bij manifestatie die informatie verschaft over de vervaardiging van een manifestatie. @nl
label: له تبصرة عن بيان التصينع @ar
definition: يربط بين تجسيدة وتبصرة عن التجسيدة التي تعطي معلومات عن الصانع الخاص بتجسيدة. @ar
toolkit label: تبصرة عن بيان التصينع @ar
toolkit definition: تبصرة عن التجسيدة التي تعطي معلومات عن الصانع الخاص بتجسيدة. @ar
label: märkus valmistamisandmete kohta @et
definition: Seostab kehastuse märkusega, mis sisaldab infot kehastuse valmistamise kohta. @et
toolkit label: märkus valmistamisandmete kohta @et
toolkit definition: Märkus, mis sisaldab infot kehastuse valmistamise kohta. @et
label: ha come nota sulla formulazione di manifattura @it
definition: Correla una manifestazione a una nota sulla manifestazione che fornisce informazioni sulla manifattura di una manifestazione. @it
toolkit label: nota sulla formulazione di manifattura @it
toolkit definition: Nota sulla manifestazione che fornisce informazioni sulla manifattura di una manifestazione. @it
label: piezīme par ražošanas ziņām @lv
definition: Sasaista manifestāciju ar piezīmi par manifestāciju, kurā ir ziņas par manifetācijas ražošanu. @lv
toolkit label: piezīme par ražošanas ziņām @lv
toolkit definition: Piezīme par manifestāciju, kurā ir ziņas par manifetācijas ražošanu. @lv
label: 有关于生产说明的附注 @zh-hans
definition: 将一种载体表现与提供关于载体表现生产信息的关于载体表现的附注关联起来。 @zh-hans
toolkit label: 关于生产说明的附注 @zh-hans
toolkit definition: 提供关于载体表现生产信息的关于载体表现的附注 @zh-hans
label: üretim bildirimi hakkında not ile ilişkilidir @tr
definition: Bir gösterimi, bir gösterimin üretimi hakkında bilgi sağlayan gösterime ilişkin bir not ile ilişkilendirir. @tr
toolkit label: üretim bildirimi hakkında not @tr
toolkit definition: Bir gösterimin üretimi hakkında bilgi sağlayan gösterim üzerine bir not. @tr
label: tiene nota en la declaración de fabricación @es

has note on carrier
status: Published
type: Property
domain: C10007
lexical alias: noteOnCarrier.en
definition: Relates a manifestation to a note on manifestation that provides information on attributes of a carrier of a manifestation.
instruction number: 3.21
toolkit label: note on carrier
toolkit definition: A note on manifestation that provides information on attributes of a carrier of a manifestation.
label: a pour note sur un support matériel @fr
definition: Met une manifestation en relation avec une note sur une manifestation qui fournit de l’information sur les attributs d’un support matériel d’une manifestation. @fr
toolkit label: note sur un support matériel @fr
toolkit definition: Note sur une manifestation qui fournit de l’information sur les attributs d’un support matériel d’une manifestation. @fr
toolkit label: nota en el portador @es
toolkit definition: Una nota sobre manifestación que proporciona información sobre los atributos de un portador de una manifestación. @es
label: har anmärkning om bärare @sv
toolkit label: anmärkning om bärare @sv
toolkit label: noot bij drager @nl
toolkit definition: Een noot die informatie geeft over de eigenschappen van de drager of dragers van de manifestatie. @nl
label: có ghi chú về vật mang tin @vi
definition: Liên kết biểu thị với ghi chú cung cấp thông tin về thuộc tính của vật mang tin hoặc các vật mang tin của biểu thị. @vi
toolkit label: ghi chú về vật mang tin @vi
toolkit definition: Ghi chú cung cấp thông tin về thuộc tính của vật mang tin hoặc các vật mang tin của biểu thị. @vi
label: har note om bærer @da
definition: Relaterer en manifestation til en note om manifestation, som giver information om attibutterne til en bærer af en manifestation. @da
toolkit label: note om bærer @da
toolkit definition: Note om manifestation, som giver information om attibutterne til en bærer af en manifestation. @da
label: hat Anmerkung zum Datenträger @de
definition: Setzt eine Manifestation in Beziehung zu einer Anmerkung zur Manifestation, die Informationen über die Merkmale eines Datenträgers einer Manifestation enthält. @de
toolkit label: Anmerkung zum Datenträger @de
toolkit definition: Eine Anmerkung zur Manifestation, die Informationen über die Merkmale eines Datenträgers einer Manifestation enthält. @de
label: té com a nota sobre suport físic @ca
definition: Relaciona una manifestació amb una nota sobre una manifestació que proporciona la informació sobre els atributs d’un suport físic d’una manifestació. @ca
toolkit label: nota sobre suport físic @ca
toolkit definition: Nota sobre una manifestació que proporciona la informació sobre els atributs d’un suport físic d’una manifestació. @ca
definition: Liittää manifestaation manifestaation huomaukseen, joka sisältää tietoja tallenteen attribuuteista. @fi
toolkit label: huomautus tallenteesta @fi
toolkit definition: Manifestaation huomaus, joka sisältää tietoja tallenteen attribuuteista. @fi
toolkit definition: En note om manifestasjon som gir informasjon om attributtene til bæreren eller bærerne av en manifestasjon. @no
label: έχει σημείωση στον φορέα αποθήκευσης @el
definition: Συνδέει μια εκδήλωση με μια σημείωση που παρέχει πληροφορίες σχετικά με τις ιδιότητες ενός φορέα ή φορέων αποθήκευσης μιας εκδήλωσης. @el
toolkit label: σημείωση στον φορέα αποθήκευσης @el
toolkit definition: Μια σημείωση που παρέχει πληροφορίες σχετικά με τις ιδιότητες ενός φορέα ή φορέων αποθήκευσης μιας εκδήλωσης. @el
has element type: 6
label: hordozóra vonatkozó megjegyzése a következő: @hu
definition: Hozzákapcsol egy megjelenési formát egy megjelenési formára tett megjegyzéshez, amely információt nyújt egy megjelenési forma hordozójának ismérveiről. @hu
toolkit label: megjegyzés a hordozóról @hu
toolkit definition: Egy megjelenési formára tett megjegyzés, amely információt nyújt egy megjelenési forma hordozójának ismérveiről. @hu
sub property of: has note on manifestation
label: huomautus tallenteesta @fi
definition: Relaterer en manifestasjon til en note om manifestasjon som gir informasjon om attributtene til bæreren eller bærerne av en manifestasjon. @no
label: heeft noot bij drager @nl
definition: Relateert een manifestatie aan een noot die informatie geeft over de eigenschappen van de drager of dragers van de manifestatie. @nl
label: له تبصرة عن حامل @ar
definition: يربط بين تجسيد وتبصرة عن تجسيدة تعطي معلومات عن سمات الحامل الخاص بتجسيدة. @ar
toolkit label: تبصرة عن حامل @ar
toolkit definition: تبصرة عن تجسيدة تعطي معلومات عن سمات الحامل الخاص بتجسيدة. @ar
label: märkus kandja kohta @et
definition: Seostab kehastuse märkusega, mis sisaldab infot kehastuse kandja omaduste kohta. @et
toolkit label: märkus kandja kohta @et
toolkit definition: Märkus, mis sisaldab infot kehastuse kandja omaduste kohta. @et
label: ha come nota sul supporto @it
definition: Correla una manifestazione a una nota su una manifestazione che fornisce informazioni sugli attributi del supporto di una manifestazione. @it
toolkit label: nota sul supporto @it
toolkit definition: Nota su una manifestazione che fornisce informazioni sugli attributi del supporto di una manifestazione. @it
label: piezīme par nesēju @lv
definition: Sasaista manifestāciju ar piezīmi par manifestācijas nesēja vai nesēju īpašībām. @lv
toolkit label: piezīme par nesēju @lv
toolkit definition: Piezīme par manifestācijas nesēja vai nesēju īpašībām. @lv
label: 有关于载体的附注 @zh-hans
definition: 将一种载体表现与提供关于一种载体表现的载体的属性之信息的一个关于载体表现的附注关联起来。 @zh-hans
toolkit label: 关于载体的附注 @zh-hans
toolkit definition: 提供关于一种载体表现的载体的属性之信息的一个关于载体表现的附注 @zh-hans
label: taşıyıcı hakkında not ile ilişkilidir @tr
definition: Bir gösterimi, bir gösterimin taşıyıcısının nitelikleri hakkında bilgi sağlayan gösterimle ilgili bir notla ilişkilendirir. @tr
toolkit label: taşıyıcı hakkında not @tr
toolkit definition: Bir gösterimin taşıyıcısının nitelikleri hakkında bilgi sağlayan gösterim üzerine bir not. @tr
label: tiene nota en el portador @es
definition: Relaciona una manifestación con una nota sobre manifestación que proporciona información sobre los atributos de un portador de una manifestación. @es
has subproperty: has note on changes in carrier characteristics

has note on changes in carrier characteristics
status: Published
definition: Relates a manifestation to a note on manifestation that provides information on variations in the carrier characteristics that are found on manifestations of parts, issues, or iterations of a diachronic work.
type: Property
domain: C10007
sub property of: has note on carrier
lexical alias: noteOnChangesInCarrierCharacteristics.en
instruction number: 3.21.4
toolkit label: note on changes in carrier characteristics
toolkit definition: A note on manifestation that provides information on variations in the carrier characteristics that are found on manifestations of parts, issues, or iterations of a diachronic work.
label: a pour note sur les changements dans les caractéristiques du support matériel @fr
definition: Met une manifestation en relation avec une note sur une manifestation qui fournit de l’information sur les variantes dans les caractéristiques du support matériel qui sont constatées sur les manifestations de parties, livraisons ou itérations d’une œuvre diachronique. @fr
toolkit label: note sur les changements dans les caractéristiques du support matériel @fr
toolkit definition: Note sur une manifestation qui fournit de l’information sur les variantes dans les caractéristiques du support matériel qui sont constatées sur les manifestations de parties, livraisons ou itérations d’une œuvre diachronique. @fr
toolkit label: nota sobre cambios en las características del portador @es
toolkit definition: Una nota sobre una manifestación que proporciona información sobre variaciones en las características del portador que se encuentran en manifestaciones de partes, ediciones o iteraciones de una obra diacrónica. @es
label: har anmärkning om förändringar i bäraregenskaper @sv
toolkit label: anmärkning om förändringar i bäraregenskaper @sv
toolkit label: noot bij wijzigingen in kenmerken van drager @nl
toolkit definition: Een noot bij manifestatie die informatie verschaft betreffende wijzigingen in de kenmerken van de drager die zich voordoen bij manifestaties van delen, afleveringen of iteraties van een diachronisch werk. @nl
label: có ghi chú về thay đổi của đặc trưng vật mang tin @vi
definition: Liên kết biểu thị với ghi chú về thay đổi trong đặc trưng của vật mang tin xuất hiện trong số hoặc phần tiếp theo của biểu thị được công bố trong các phần kế tiếp hoặc giữa các lần lặp của tài nguyên tích hợp. @vi
toolkit label: ghi chú về thay đổi của đặc trưng vật mang tin @vi
toolkit definition: Ghi chú về thay đổi trong đặc trưng của vật mang tin xuất hiện trong số hoặc phần tiếp theo của biểu thị được công bố trong các phần kế tiếp hoặc giữa các lần lặp của tài nguyên tích hợp. @vi
label: har note om ændringer i bærerkarakteristika @da
definition: Relaterer en manifestation til en note om ændringer i bærerens karakteristika, der optræder i efterfølgende numre eller dele af en manifestation, der er udgivet i successive dele, eller mellem iterationer af en integrerende ressource. @da
toolkit label: note om ændringer i bærerkarakteristika @da
toolkit definition: Note om ændringer i bærerens karakteristika, der optræder i efterfølgende numre eller dele af en manifestation, der er udgivet i successive dele, eller mellem iterationer af en integrerende ressource. @da
label: hat Anmerkung zu Änderungen der Datenträgereigenschaften @de
definition: Setzt eine Manifestation in Beziehung zu einer Anmerkung zur Manifestation, die Informationen zu Veränderungen in den Datenträgereigenschaften enthält, die bei Manifestationen von Teilen, Ausgaben oder Iterationen eines diachronen Werks vorkommen. @de
toolkit label: Anmerkung zu Änderungen der Datenträgereigenschaften @de
toolkit definition: Eine Anmerkung zur Manifestation, die Informationen zu Veränderungen in den Datenträgereigenschaften enthält, die bei Manifestationen von Teilen, Ausgaben oder Iterationen eines diachronen Werks vorkommen. @de
label: té com a nota sobre canvis de característiques de suport físic @ca
definition: Relaciona una manifestació amb una nota sobre una manifestació que proporciona la informació sobre variacions en les característiques del suport físic que es troben en les manifestacions de les parts, els números o les iteracions d’una obra diacrònica. @ca
toolkit label: nota sobre canvis de característiques de suport físic @ca
toolkit definition: Nota sobre una manifestació que proporciona la informació sobre variacions en les característiques del suport físic que es troben en les manifestacions de les parts, els números o les iteracions d’una obra diacrònica. @ca
definition: Liittää manifestaation huomautukseen tallenteen ominaisuuksien muutoksista diakronisen teoksen osien, numeroiden tai iteraatioiden manifestaatioissa. @fi
toolkit label: huomautus muutoksista tallenteen ominaisuuksissa @fi
toolkit definition: Huomautus tallenteen ominaisuuksien muutoksista diakronisen teoksen osien, numeroiden tai iteraatioiden manifestaatioissa. @fi
toolkit label: note om endringer i bæreregenskapene @no
toolkit definition: En note om manifestasjon som gir informasjon om variasjoner i bæreregenskapene som finnes i manifestasjoner av deler, hefter eller versjoner av et diakronisk verk. @no
label: έχει σημείωση στα χαρακτηριστικά του φορέα αποθήκευσης @el
definition: Συνδέει μια εκδήλωση με μια σημείωση για τις αλλαγές στα χαρακτηριστικά του φορέα αποθήκευσης που εμφανίζονται σε διαδοχικά τεύχη ή μέρη μιας εκδήλωσης τα οποία εκδίδονται σε διαδοχικά μέρη ή μεταξύ επαναλήψεων ενός ενσωματωμένου πόρου ή πόρου διαρκούς ενημέρωσης/ανανέωσης. @el
toolkit label: σημείωση σε αλλαγές στα χαρακτηριστικά του φορέα αποθήκευσης @el
toolkit definition: Μια σημείωση σχετικά με τις αλλαγές στα χαρακτηριστικά του φορέα αποθήκευσης που εμφανίζονται σε διαδοχικά τεύχη ή μέρη μιας εκδήλωσης τα οποία εκδίδονται σε διαδοχικά μέρη ή μεταξύ επαναλήψεων ενός ενσωματωμένου πόρου ή πόρου διαρκούς ενημέρωσης/ανανέωσης. @el
has element type: 6
label: a hordozójellemzők változásairól szóló megjegyzése a következő: @hu
definition: Hozzákapcsol egy megjelenési formát egy megjelenési formára tett megjegyzéshez, amely információt nyújt egy diakronikus mű részeinek, számainak, vagy iterációinak a hordozó jellemzőiben történt változásokról. @hu
toolkit label: a hordozójellemzők változásairól szóló megjegyzése: @hu
toolkit definition: Egy megjegyzés a hordozó jellemzőinek változásairól, amelyek egymást követő részekben megjelentetett megjelenési forma rákövetkező számaiban vagy részeiben, vagy egy integráló forrás iterációi között fordulnak elő. @hu
label: huomautus muutoksista tallenteen ominaisuuksissa @fi
label: har note om endringer i bæreregenskapene @no
definition: Relaterer en manifestasjon til en note om manifestasjon som gir informasjon om variasjoner i bæreregenskapene som finnes i manifestasjoner av deler, hefter eller versjoner av et diakronisk verk. @no
label: heeft noot bij wijzigingen in kenmerken van drager @nl
definition: Relateert een manifestatie aan een noot bij manifestatie die informatie verschaft betreffende wijzigingen in de kenmerken van de drager die zich voordoen bij manifestaties van delen, afleveringen of iteraties van een diachronisch werk. @nl
label: له تبصرة عن التغييرات في سمات الحامل @ar
definition: يربط بين تجسيدة وتبصرة عن التجسيدة التي تعطي معلومات عن التغيرات في سمات الحامل التي توجد على تجسيدات الأجزاء، أو الأعداد، أو إعادة الإصدار الخاص بعمل مستمر. @ar
toolkit label: تبصرة عن التغييرات في سمات الحامل @ar
toolkit definition: تبصرة عن التجسيدة التي تعطي معلومات عن التغيرات في سمات الحامل التي توجد على تجسيدات الأجزاء، أو الأعداد، أو إعادة الإصدار الخاص بعمل مستمر. @ar
label: märkus muutuste kohta kandja tunnustes @et
definition: Seostab kehastuse märkusega kandja tunnuste varieerumise kohta diakroonilise teose osade, numbrite või seisude kehastustes. @et
toolkit label: märkus muutuste kohta kandja tunnustes @et
toolkit definition: Märkus kandja tunnuste varieerumise kohta diakroonilise teose osade, numbrite või seisude kehastustes. @et
label: ha come nota sui cambiamenti nelle caratteristiche del supporto @it
definition: Correla una manifestazione a una nota sulla manifestazione che fornisce informazioni sulle variazioni nelle caratteristiche del supporto che si trovano nelle manifestazioni di parti, fascicoli o iterazioni di un'opera diacronica. @it
toolkit label: nota sui cambiamenti nelle caratteristiche del supporto @it
toolkit definition: Nota sulla manifestazione che fornisce informazioni sulle variazioni nelle caratteristiche del supporto che si trovano nelle manifestazioni di parti, fascicoli o iterazioni di un'opera diacronica. @it
label: piezīme par izmaiņām nesēja raksturojumā @lv
definition: Sasaista manifestāciju ar piezīmi par manifestāciju, kurā ir ziņas par izmaiņām nesēja raksturojumā, kas sastopamas diahroniska darba manifestāciju daļās, laidienos vai atkārtojumos. @lv
toolkit label: piezīme par izmaiņām nesēja raksturojumā @lv
toolkit definition: Piezīme par manifestāciju, kurā ir ziņas par izmaiņām nesēja raksturojumā, kas sastopamas diahroniska darba manifestāciju daļās, laidienos vai atkārtojumos. @lv
label: 有载体特征变化附注 @zh-hans
definition: 将一种载体表现与提供历时作品的部分、期或更新后整体的载体表现上发现的载体特征变异信息的关于载体表现的附注关联起来。 @zh-hans
toolkit label: 载体特征变化附注 @zh-hans
toolkit definition: 提供历时作品的部分、期或更新后整体的载体表现上发现的载体特征变异信息的关于载体表现的附注 @zh-hans
label: taşıyıcı özelliklerindeki değişiklikler hakkında not ile ilişkilidir @tr
definition: Bir gösterimi, diyakronik eserin parça, yayın ya da sürüm gösterimlerinde bulunan taşıyıcı özelliklerindeki farklılıklar hakkında bilgi sağlayan gösterime ilişkin bir not ile ilişkilendirir. @tr
toolkit label: taşıyıcı özelliklerindeki değişiklikler hakkında not @tr
toolkit definition: Bir artzamanlı eserin parça, yayın ya da sürüm gösterimlerinde bulunan taşıyıcı özelliklerindeki farklılıklar hakkında bilgi sağlayan gösterim üzerine bir not. @tr
label: tiene nota sobre cambios en las características del portador @es

has note on publication statement
status: Published
definition: Relates a manifestation to a note on manifestation that provides information on the publication of a manifestation.
type: Property
domain: C10007
sub property of: has note on manifestation
lexical alias: noteOnPublicationStatement.en
instruction number: 2.17.7
toolkit label: note on publication statement
toolkit definition: A note on manifestation that provides information on the publication of a manifestation.
label: a pour note sur une mention de publication @fr
definition: Met une manifestation en relation avec une note sur une manifestation qui fournit de l’information sur la publication d’une manifestation. @fr
toolkit label: note sur une mention de publication @fr
toolkit definition: Note sur une manifestation qui fournit de l’information sur la publication d’une manifestation. @fr
toolkit label: nota sobre la declaración de publicación @es
toolkit definition: Una nota sobre manifestación que proporciona información sobre la publicación de una manifestación. @es
label: har anmärkning om utgivningsuppgift @sv
toolkit label: anmärkning om utgivningsuppgift @sv
toolkit label: noot bij publicatievermelding @nl
toolkit definition: Een noot bij manifestatie die informatie verschaft over de publicatie van een manifestatie. @nl
label: có ghi chú về thông tin xuất bản @vi
definition: Liên kết biểu thị với ghi chú cung cấp chi tiết về địa điểm xuất bản, nhà xuất bản , hoặc ngày xuất bản , hoặc thông tin về thay đổi trong địa điểm xuất bản , nhà sản xuất xuất bản, hoặc tên nhà xuất bản . @vi
toolkit label: ghi chú về thông tin xuất bản @vi
toolkit definition: Ghi chú cung cấp chi tiết về địa điểm xuất bản, nhà xuất bản , hoặc ngày xuất bản , hoặc thông tin về thay đổi trong địa điểm xuất bản , nhà sản xuất xuất bản, hoặc tên nhà xuất bản . @vi
label: har note om publiceringsoplysning @da
definition: Relaterer en manifestation til en note om manifestation, som giver information om publiceringen af en manifestation. @da
toolkit label: note om publiceringsoplysning @da
toolkit definition: Note om manifestation, som giver information om publiceringen af en manifestation. @da
label: hat Anmerkung zur Veröffentlichungsangabe @de
definition: Setzt eine Manifestation in Beziehung zu einer Anmerkung zur Manifestation, die Informationen über die Veröffentlichung einer Manifestation enthält. @de
toolkit label: Anmerkung zur Veröffentlichungsangabe @de
toolkit definition: Eine Anmerkung zur Manifestation, die Informationen über die Veröffentlichung einer Manifestation enthält. @de
label: té com a nota sobre menció de publicació @ca
definition: Relaciona una manifestació amb una nota sobre una manifestació que proporciona la informació sobre la publicació d’una manifestació. @ca
toolkit label: nota sobre menció de publicació @ca
toolkit definition: Nota sobre una manifestació que proporciona la informació sobre la publicació d’una manifestació. @ca
definition: Liittää manifestaation huomautukseen, joka sisältää tietoja manifestaation julkaisemisesta. @fi
toolkit label: huomautus julkaisumerkinnöstä @fi
toolkit definition: Huomautus, joka sisältää tietoja manifestaation julkaisemisesta. @fi
toolkit label: note om utgivelse @no
toolkit definition: En note om manifestasjon som gir informasjon om utgivelsen av en manifestasjon. @no
label: έχει σημείωση στη μνεία δημοσίευσης @el
definition: Συνδέει μια εκδήλωση με μια σημείωση που παρέχει τις λεπτομέρειες για τον τόπο της δημοσίευσης, τον εκδότη ή τη χρονολογία της δημοσίευσης, τις πληροφορίες για τις αλλαγές σε έναν τόπο δημοσίευσης, σε έναν εκδότη ή στο όνομα ενός εκδότη ή για την αναβολή μιας δημοσίευσης. @el
toolkit label: σημείωση στη μνεία δημοσίευσης @el
toolkit definition: Μια σημείωση που παρέχει τις λεπτομέρειες για τον τόπο της δημοσίευσης, τον εκδότη ή τη χρονολογία της δημοσίευσης, τις πληροφορίες για τις αλλαγές σε έναν τόπο δημοσίευσης, σε έναν εκδότη ή στο όνομα ενός εκδότη. @el
has element type: 6
label: megjelenési közlésről szóló megjegyzése a következő: @hu
definition: Hozzákapcsol egy megjelenési formát egy megjelenési formára tett megjegyzéshez, amely információt nyújt egy megjelenési forma megjelenéséről. @hu
toolkit label: megjelenési közlésről szóló megjegyzése: @hu
toolkit definition: Egy megjelenési formára tett megjegyzés, amely információt nyújt egy megjelenési forma megjelenéséről. @hu
label: huomautus julkaisumerkinnöstä @fi
label: har note om utgivelse @no
definition: Relaterer en manifestasjon til en note om manifestasjon som gir informasjon om utgivelsen av en manifestasjon. @no
label: heeft noot bij publicatievermelding @nl
definition: Relateert een manifestatie aan een noot bij manifestatie die informatie verschaft over de publicatie van een manifestatie. @nl
label: له تبصرة عن بيان النشر @ar
definition: يربط بين تجسيدة وتبصرة عن التجسيدة التي تعطي معلومات عن نشر تجسيدة. @ar
toolkit label: تبصرة عن بيان النشر @ar
toolkit definition: تبصرة عن التجسيدة التي تعطي معلومات عن نشر تجسيدة. @ar
label: märkus ilmumisandmete kohta @et
definition: Seostab kehastuse märkusega, mis sisaldab infot kehastuse ilmumise kohta. @et
toolkit label: märkus ilmumisandmete kohta @et
toolkit definition: Märkus, mis sisaldab infot kehastuse ilmumise kohta. @et
label: ha come nota sulla formulazione di pubblicazione @it
definition: Correla una manifestazione a una nota sulla manifestazione che fornisce informazioni sulla pubblicazione di una manifestazione. @it
toolkit label: nota sulla formulazione di pubblicazione @it
toolkit definition: Nota sulla manifestazione che fornisce informazioni sulla pubblicazione di una manifestazione. @it
label: piezīme par izdošanas ziņām @lv
definition: Sasaista manifestāciju ar piezīmi par manifestāciju, kurā ir ziņas par manifestācijas publicēšanu. @lv
toolkit label: piezīme par izdošanas ziņām @lv
toolkit definition: Piezīme par manifestāciju, kurā ir ziņas par manifestācijas publicēšanu. @lv
label: 有关于出版说明的附注 @zh-hans
definition: 将一种载体表现与提供关于载体表现出版信息的关于载体表现的附注关联起来。 @zh-hans
toolkit label: 关于出版说明的附注 @zh-hans
toolkit definition: 提供关于载体表现出版信息的关于载体表现的附注 @zh-hans
label: yayınlama bildirimi hakkında not ile ilişkilidir @tr
definition: Bir gösterimi, gösterimin yayımlanması hakkında bilgi sağlayan gösterime ilişkin bir not ile ilişkilendirir. @tr
toolkit label: yayın bildirimi hakkında not @tr
toolkit definition: Bir gösterimin yayımlanması hakkında bilgi sağlayan gösterim üzerine bir not. @tr
label: tiene nota sobre la declaración de publicación @es

has note on issue or part or iteration used as basis for identification of manifestation
status: Published
definition: Relates a manifestation to a note that identifies a part or iteration that is used for the base description of a multiunit or integrating manifestation.
type: Property
domain: C10007
sub property of: has note on manifestation
instruction number: 2.17.13
toolkit label: note on issue or part or iteration used as basis for identification of manifestation
toolkit definition: A note that identifies a part or iteration that is used for the base description of a multiunit or integrating manifestation.
label: a pour note sur une livraison ou partie ou itération servant de base à l’identification d’une manifestation @fr
definition: Met une manifestation en relation avec une note sur une manifestation qui identifie une livraison ou partie d’une monographie en plusieurs parties ou d’une publication en série ou une itération d’une ressource intégratrice ayant servi de base à l’identification d’une manifestation. @fr
toolkit label: note sur une livraison ou partie ou itération servant de base à l’identification d’une manifestation @fr
toolkit definition: Note sur une manifestation qui identifie une livraison ou partie d’une monographie en plusieurs parties ou d’une publication en série ou une itération d’une ressource intégratrice ayant servi de base à l’identification d’une manifestation. @fr
toolkit label: nota sobre el problema o parte o iteración utilizada como base para la identificación de la manifestación @es
toolkit definition: Una nota que identifica una parte o iteración que se utiliza para la descripción base de una manifestación multiunitaria o integradora. @es
label: har anmärkning om nummer, del eller uppdatering som beskrivningen grundar sig på @sv
toolkit label: anmärkning om nummer, del eller uppdatering som beskrivningen grundar sig på @sv
toolkit label: noot bij aflevering, deel of iteratie gebruikt als basis voor identificatie van de manifestatie @nl
toolkit definition: Een noot bij manifestatie die een aflevering of deel van een meerdelige of seriële publicatie identificeert, of de iteratie van een geïntegreerde resource die gebruikt is als basis voor de identificatie van een manifestatie. @nl
label: có ghi chú về phần hoặc lần lặp được dùng như là cơ sở cho nhận dạng biểu thị @vi
definition: Liên kết biểu thị với ghi chú nhận dạng số hoặc phần của chuyên khảo nhiều phần hoặc ấn phẩm nhiều kỳ, hoặc lần lặp của tài nguyên tích hợp, được sử dụng như là cơ sở cho nhận dạng biểu thị. @vi
toolkit label: ghi chú về phần hoặc lần lặp được dùng như là cơ sở cho nhận dạng biểu thị @vi
toolkit definition: Ghi chú nhận dạng số hoặc phần của chuyên khảo nhiều phần hoặc ấn phẩm nhiều kỳ, hoặc lần lặp của tài nguyên tích hợp, được sử dụng như là cơ sở cho nhận dạng biểu thị. @vi
label: har note om nummer, del eller iteration, anvendt som grundlag for identifikation af manifestationen @da
definition: Relaterer en manifestation til en note, der identificerer et nummer eller en del af et flerbindsværk eller et periodikum, eller en iteration af en integrerende ressource, der er brugt som grundlag for identifikation af en manifestation. @da
toolkit label: note om nummer, del eller iteration, anvendt som grundlag for identifikation af manifestationen @da
toolkit definition: Note, der identificerer et nummer eller en del af et flerbindsværk eller et periodikum, eller en iteration af en integrerende ressource, der er brugt som grundlag for identifkation af en manifestation. @da
label: hat Anmerkung zur Ausgabe, zum Teil oder zur Iteration, die/der als Grundlage für die Identifizierung einer Manifestation verwendet wird @de
definition: Setzt eine Manifestation in Beziehung zu einer Anmerkung, die den Teil oder Iteration identifiziert, der/die für die Basisbeschreibung einer mehrteiligen oder integrierenden Manifestation verwendet wird. @de
toolkit label: Anmerkung zur Ausgabe, zum Teil oder zur Iteration, die/der als Grundlage für die Identifizierung einer Manifestation verwendet wird @de
toolkit definition: Eine Anmerkung, die den Teil oder Iteration identifiziert, der/die für die Basisbeschreibung einer mehrteiligen oder integrierenden Manifestation verwendet wird. @de
label: té nota sobre un número o una part o una iteració usat com a base per a la identificació de manifestació @ca
definition: Relaciona una manifestació amb una nota que identifica una part o una iteració que s’usa per a la descripció de base d’una multiunitat o d’una manifestació integrant. @ca
toolkit label: nota sobre un número o una part o una iteració usat com a base per a la identificació de manifestació @ca
toolkit definition: Nota que identifica una part o una iteració que s’usa per a la descripció de base d’una multiunitat o d’una manifestació integrant. @ca
definition: Liittää manifestaation huomautukseen moniosaisen monografian tai sarja-aineiston numerosta tai osasta tai päivittyvän aineiston iteraatiosta, jota käytetään manifestaation identifioinnin perustana. @fi
toolkit label: huomautus manifestaation identifioinnin perustana käytetystä numerosta, osasta tai iteraatiosta @fi
toolkit definition: Huomautus moniosaisen monografian tai sarja-aineiston numerosta tai osasta tai päivittyvän aineiston versiosta, jota käytetään manifestaation identifioinnin perustana. @fi
toolkit label: note om hefte, del, eller versjon brukt som grunnlag for identifisering av manifestasjon @no
toolkit definition: En note om manifestasjon som identifiserer et hefte eller en del av en flerdelsmonografi eller et periodikum, eller en versjon av en integrerende ressurs som er brukt som grunnlag for identifisering av en manifestasjon. @no
label: έχει σημείωση στην έκδοση, στο μέρος ή στην επανάληψη που χρησιμοποιείται ως η βάση για την ταύτιση της εκδήλωσης @el
definition: Συνδέει μια εκδήλωση με μια σημείωση που ταυτίζει ένα τεύχος ή ένα μέρος μιας πολυμερούς μονογραφίας ή περιοδικού ή μια επανάληψη ενός ενσωματωμένου πόρου ή πόρου διαρκούς ενημέρωσης/ανανέωσης η οποία έχει χρησιμοποιηθεί ως η βάση για την ταύτιση μιας εκδήλωσης. @el
toolkit label: σημείωση στην έκδοση, στο μέρος ή στην επανάληψη που χρησιμοποιείται ως η βάση για την ταύτιση της εκδήλωσης @el
toolkit definition: Μια σημείωση που ταυτίζει ένα τεύχος ή ένα μέρος μιας πολυμερούς μονογραφίας ή περιοδικού ή μια επανάληψη ενός ενσωματωμένου πόρου ή πόρου διαρκούς ενημέρωσης/ανανέωσης, η οποία έχει χρησιμοποιηθεί ως η βάση για την ταύτιση μιας εκδήλωσης. @el
has element type: 6
label: megjegyzése a megjelenési forma azonosítója alapjaként használt számról, részről vagy iterációról a következő: @hu
definition: Egy megjelenési formát hozzákapcsol egy megjegyzéshez, amely azonosítja egy többrészes monográfia vagy folytatódó dokumentum egy számát vagy részét, vagy egy integráló forrás iterációját, amelyet egy megjelenési forma azonosításának az alapjaként használtak. @hu
toolkit label: megjegyzése a megjelenési forma azonosítója alapjaként használt számról, részről vagy iterációról: @hu
toolkit definition: Egy megjegyzés, amely azonosítja egy többkötetes monográfia vagy periodika egy számát vagy részét, vagy egy integráló forrás iterációját, amelyet egy megjelenési forma azonosításának alapjaként használtak. @hu
label: huomautus manifestaation identifioinnin perustana käytetystä numerosta, osasta tai iteraatiosta @fi
label: har note om hefte, del, eller versjon brukt som grunnlag for identifisering av manifestasjon @no
definition: Relaterer en manifestasjon til en note om manifestasjon som identifiserer et hefte eller en del av en flerdelsmonografi eller et periodikum, eller en versjon av en integrerende ressurs som er brukt som grunnlag for identifisering av en manifestasjon. @no
label: heeft noot bij aflevering, deel of iteratie gebruikt als basis voor heeft identificatie van de manifestatie @nl
definition: Relateert een manifestatie aan een noot bij manifestatie die een aflevering of deel van een meerdelige of seriële publicatie identificeert, of de iteratie van een geïntegreerde resource die gebruikt is als basis voor de identificatie van een manifestatie. @nl
label: له تبصرة عن العدد، أو الجزء، أو إعادة إصدار المستخدم كأساس لتحديد التجسيدة @ar
definition: يربط بين تجسيدة وتبصرة عن تجسيدة تحدد عدد، أو جزء من منفردة متعددة الأجزاء أو دورية، أو عدد، أو جزء أو إعادة كأساس لمصدر متكامل تم استخامه لتحديد تجسيدة ما. @ar
toolkit label: تبصرة عن العدد، أو الجزء، أو إعادة إصدار المستخدم كأساس لتحديد التجسيدة @ar
toolkit definition: تبصرة عن تجسيدة تحدد عدد، أو جزء من منفردة متعددة الأجزاء أو دورية، أو عدد، أو جزء أو إعادة كأساس لمصدر متكامل تم استخامه لتحديد تجسيدة ما. @ar
label: märkus kehastuse identifitseerimise aluseks oleva numbri, osa või seisu kohta @et
definition: Seostab kehastuse märkusega mitmest üksusest koosneva või lõimkehastuse osa või seisu kohta, mida on kasutatud kirjelduse alusena. @et
toolkit label: märkus kehastuse identifitseerimise aluseks oleva numbri, osa või seisu kohta @et
toolkit definition: Märkus mitmest üksusest koosneva või lõimkehastuse osa või seisu kohta, mida on kasutatud kirjelduse alusena. @et
label: ha come nota sul fascicolo, parte, o iterazione utilizzati come base per l'identificazione della manifestazione @it
definition: Correla una manifestazione a una nota sulla manifestazione che identifica un fascicolo o parte di una monografia multiparte o di un seriale, o l'iterazione di una risorsa integrativa utilizzati come base per l'dentificazione di una manifestazione. @it
toolkit label: nota sul fascicolo, parte, o iterazione utilizzati come base per l'identificazione di una manifestazione @it
toolkit definition: Nota sulla manifestazione che identifica un fascicolo o parte di una monografia multiparte o di un seriale, o l'iterazione di una risorsa integrativa utilizzati come base per l'dentificazione di una manifestazione. @it
label: piezīme par laidienu, tā daļu vai iterāciju, kas izmantota manifestācijas identifikācijai @lv
definition: Sasaista manifestāciju ar piezīmi, kas identificē konkrēto daļu vai iterāciju, kas izmantota par pamatu daudzvienību vai integrētas manifestācijas aprakstam. @lv
toolkit label: piezīme par laidienu, tā daļu vai iterāciju, kas izmantota manifestācijas identifikācijai @lv
toolkit definition: Piezīme, kas identificē konkrēto daļu vai iterāciju, kas izmantota par pamatu daudzvienību vai integrētas manifestācijas aprakstam. @lv
lexical alias: noteOnIssueOrPartOrIterationUsedAsBasisForIdentificationOfManifestation.en
label: 有关于用作载体表现标识之基础的期或部分或更新后整体的附注 @zh-hans
definition: 将一种载体表现与标识用作多单元或集成性载体表现之描述基础的部分或更新后整体的附注关联起来。 @zh-hans
toolkit label: 关于用作载体表现标识之基础的期或部分或更新后整体的附注 @zh-hans
toolkit definition: 标识用作多单元或集成性载体表现之描述基础的部分或更新后整体的附注 @zh-hans
alternative label: note sur une livraison, partie ou itération servant de base à l’identification d’une manifestation @fr
label: gösterimin tanımlanmasında temel alınan sayı, bölüm veya yineleme hakkında not ile ilişkilidir @tr
definition: Bir gösterimi, çok birimli veya bütünleştirici bir gösterimin temel nitelemesi için kullanılan bir parçayı veya sürümü tanımlayan bir not ile ilişkilendirir. @tr
toolkit label: gösterimin tanımlamasında temel olarak kullanılan yayın ya da parça ya da sürüm hakkında rapor @tr
toolkit definition: Çok birimli veya bütünleştirici bir gösterimin temel nitelemesi için kullanılan bir parçayı veya sürümü tanımlayan bir not. @tr

has note on identifier for manifestation
status: Published
sub property of: has note on manifestation
type: Property
lexical alias: noteOnIdentifierForManifestation.en
definition: Relates a manifestation to a note on manifestation that provides information on an identifier for a manifestation.
domain: C10007
toolkit label: note on identifier for manifestation
toolkit definition: A note on manifestation that provides information on an identifier for a manifestation.
instruction number: 2.17.14
toolkit label: noot bij identificatie van manifestatie @nl
toolkit definition: Een noot bij manifestatie die informatie verschaft over een identificatie voor een manifestatie. @nl
label: có ghi chú về chỉ số nhận dạng của biểu thị @vi
definition: Liên kết biểu thị với ghi chú cung cấp thông tin về chỉ số nhận dạng của biểu thị nhưng không được ghi như là phần của yếu tố chỉ số nhận dạng của biểu thị. @vi
toolkit label: ghi chú về chỉ số nhận dạng của biểu thị @vi
toolkit definition: Ghi chú cung cấp thông tin về chỉ số nhận dạng của biểu thị nhưng không được ghi như là phần của yếu tố chỉ số nhận dạng của biểu thị. @vi
label: har note om identifikator for manifestation @da
definition: Relaterer en manifestation til en note om manifestation, som giver information om en identifikator for en manifestation. @da
toolkit label: note om identifikator for manifestation @da
toolkit definition: Note om manifestation, som giver information om en identifikator for en manifestation. @da
label: hat Anmerkung zum Identifikator für eine Manifestation @de
definition: Setzt eine Manifestation in Beziehung zu einer Anmerkung zur Manifestation, die Informationen über einen Identifikator für eine Manifestation enthält. @de
toolkit label: Anmerkung zum Identifikator für eine Manifestation @de
toolkit definition: Eine Anmerkung zur Manifestation, die Informationen über einen Identifikator für eine Manifestation enthält. @de
label: té com a nota sobre identificador de manifestació @ca
definition: Relaciona una manifestació amb una nota sobre una manifestació que proporciona informació sobre un identificador d’una manifestació. @ca
toolkit label: nota sobre identificador de manifestació @ca
toolkit definition: Nota sobre una manifestació que proporciona informació sobre un identificador d’una manifestació. @ca
definition: Liittää manifestaation manifestaation huomautukseen, joka sisältää tietoa manifestaation tunnisteesta. @fi
toolkit label: huomautus manifestaation tunnisteesta @fi
toolkit definition: Manifestaation huomautus, joka sisältää tietoa manifestaation tunnisteesta. @fi
toolkit label: note om identifikator for manifestasjon @no
toolkit definition: En note for manifestasjon som gir informasjon om en identifikator for en manifestasjon. @no
label: έχει σημείωση στο αναγνωριστικό για την εκδήλωση @el
definition: Συνδέει μια εκδήλωση με μια σημείωση που παρέχει πληροφορίες αναφορικά με αναγνωριστικά για την εκδήλωση που δεν καταχωρίζονται ως μέρος του αναγνωριστικού για ένα στοιχείο της εκδήλωσης. @el
toolkit label: σημείωση στον αναγνωριστικό για την εκδήλωση @el
toolkit definition: Μια σημείωση που παρέχει πληροφορίες αναφορικά με αναγνωριστικά για την εκδήλωση που δεν καταχωρίζονται ως μέρος του αναγνωριστικού για ένα στοιχείο της εκδήλωσης. @el
label: a pour note sur un identifiant de manifestation @fr
definition: Met une manifestation en relation avec une note sur une manifestation qui fournit de l’information sur un identifiant de manifestation. @fr
toolkit label: note sur un identifiant de manifestation @fr
toolkit definition: Note sur une manifestation qui fournit de l’information sur un identifiant de manifestation. @fr
has element type: 6
label: megjegyzése azonosítóról megjelenési formához a következő: @hu
definition: Hozzákapcsol egy megjelenési formát egy megjelenési formára tett megjegyzéshez, amely információt nyújt egy megjelenési formának szánt azonosítóról. @hu
toolkit label: megjegyzés megjelenési forma azonosítójáról @hu
toolkit definition: Egy megjelenési formára tett megjegyzés, amely információt nyújt egy megjelenési formának szánt azonosítóról. @hu
label: huomautus manifestaation tunnisteesta @fi
label: har note om identifikator for manifestasjon @no
definition: Relaterer en manifestasjon til en note for manifestasjon som gir informasjon om en identifikator for en manifestasjon. @no
label: heeft noot bij identificatie van manifestatie @nl
definition: Relateert een manifestatie aan een noot bij manifestatie die informatie verschaft over een identificatie voor een manifestatie. @nl
label: له تبصرة عن محدد لتجسيدة @ar
definition: يربط بين تجسيدة وتبصرة على تجسيدة تعطي معلومات عن معرف لتجسيدة. @ar
toolkit label: تبصرة عن محدد لتجسيدة @ar
toolkit definition: تبصرة على تجسيدة تعطي معلومات عن معرف لتجسيدة. @ar
label: märkus kehastuse identifikaatori kohta @et
definition: Seostab kehastuse märkusega, mis sisaldab infot kehastuse identifikaatori kohta. @et
toolkit label: märkus kehastuse identifikaatori kohta @et
toolkit definition: Märkus, mis sisaldab infot kehastuse identifikaatori kohta. @et
label: ha come nota sull'identificatore per la manifestazione @it
definition: Correla una manifestazione a una nota che fornisce informazioni su un identificatore per una manifestazione. @it
toolkit label: nota sull'identificatore per la manifestazione @it
toolkit definition: Nota che fornisce informazioni su un identificatore per una manifestazione. @it
label: piezīme par manifestācijas identifikatoru @lv
definition: Sasaista manifestāciju ar piezīmi par manifestāciju, kurā ir ziņas par manifestācijas identifikatoru. @lv
toolkit label: piezīme par manifestācijas identifikatoru @lv
toolkit definition: Piezīme par manifestāciju, kurā ir ziņas par manifestācijas identifikatoru. @lv
label: 有关于载体表现的标识符的附注 @zh-hans
definition: 将一种载体表现与提供关于一种载体表现的一个标识符的信息的一个关于载体表现的附注关联起来。 @zh-hans
toolkit label: 关于载体表现的标识符的附注 @zh-hans
toolkit definition: 提供关于一种载体表现的一个标识符的信息的一个关于载体表现的附注 @zh-hans
label: gösterimin tanımlayıcısı hakkında not ile ilişkilidir @tr
definition: Bir gösterimi, bir gösterimin tanımlayıcısı hakkında bilgi sağlayan bir gösterim notuyla ilişkilendirir. @tr
toolkit label: gösterim için tanımlayıcı hakkında not @tr
toolkit definition: Bir gösterimin tanımlayıcısı hakkında bilgi sağlayan gösterim üzerine bir not. @tr
label: tiene nota sobre el identificador de manifestación @es
definition: Relaciona una manifestación con una nota sobre la manifestación que proporciona información sobre un identificador de una manifestación. @es
toolkit label: nota sobre el identificador de manifestación @es
toolkit definition: Una nota sobre la manifestación que proporciona información sobre un identificador de una manifestación. @es
has subproperty: P30260

has note on dimensions of manifestation
status: Published
definition: Relates a manifestation to a note on manifestation that provides information on the dimensions of a manifestation.
type: Property
domain: C10007
lexical alias: noteOnDimensionsOfManifestation.en
instruction number: 3.21.3
toolkit label: note on dimensions of manifestation
toolkit definition: A note on manifestation that provides information on the dimensions of a manifestation.
label: a pour note sur les dimensions d’une manifestation @fr
definition: Met une manifestation en relation avec une note sur une manifestation qui fournit de l’information sur les dimensions d’une manifestation. @fr
toolkit label: note sur les dimensions d’une manifestation @fr
toolkit definition: Note sur une manifestation qui fournit de l’information sur les dimensions d’une manifestation. @fr
toolkit label: nota sobre las dimensiones de manifestación @es
toolkit definition: Una nota sobre manifestación que proporciona información sobre las dimensiones de una manifestación. @es
sub property of: has note on carrier
label: har anmärkning om manifestationens mått @sv
toolkit label: anmärkning om manifestationens mått @sv
toolkit label: noot bij afmetingen van manifestatie @nl
toolkit definition: Een noot bij manifestatie die informatie verschaft over de afmetingen van een manifestatie. @nl
label: có ghi chú về kích thước của biểu thị @vi
definition: Liên kết biểu thị với ghi chú cung cấp thông tin về kích thước của biểu hiện không được ghi như là phần của yếu tố kích thước. @vi
toolkit label: ghi chú về kích thước của biểu thị @vi
toolkit definition: Ghi chú cung cấp thông tin về kích thước của biểu hiện không được ghi như là phần của yếu tố kích thước. @vi
label: har note om manifestations størrelse @da
definition: Relaterer en manifestation til en note om manifestation, som giver information om manifestationens størrelse. @da
toolkit label: note om manifestations størrelse @da
toolkit definition: Note om manifestation, som giver information om manifestationens størrelse. @da
label: hat Anmerkung zu den Maßen einer Manifestation @de
definition: Setzt eine Manifestation in Beziehung zu einer Anmerkung zur Manifestation, die Informationen über die Maße einer Manifestation enthält. @de
toolkit label: Anmerkung zu Maßen einer Manifestation @de
toolkit definition: Eine Anmerkung zur Manifestation, die Informationen über die Maße einer Manifestation enthält. @de
label: té com a nota sobre dimensions d’una manifestació @ca
definition: Relaciona una manifestació amb una nota sobre una manifestació que proporciona la informació sobre les dimensions d’una manifestació. @ca
toolkit label: nota sobre dimensions d’una manifestació @ca
toolkit definition: Nota sobre una manifestació que proporciona la informació sobre les dimensions d’una manifestació. @ca
definition: Liittää manifestaation huomautukseen, joka sisältää manifestaation kokoa koskevaa tietoa. @fi
toolkit label: huomautus manifestaation koosta @fi
toolkit definition: Huomautus, joka sisältää manifestaation kokoa koskevaa tietoa. @fi
toolkit label: note om manifestasjonens størrelse @no
toolkit definition: En note om manifestasjon som gir informasjon om størrelsen til en manifestasjon. @no
label: έχει σημείωση στις διαστάσεις της εκδήλωσης @el
definition: Συνδέει μια εκδήλωση με μια σημείωση που παρέχει τις πληροφορίες για τις διαστάσεις μιας εκδήλωσης οι οποίες δεν καταχωρίζονται ως μέρος του στοιχείου των διαστάσεων. @el
toolkit label: σημείωση στις διαστάσεις της εκδήλωσης @el
toolkit definition: Μια σημείωση που παρέχει τις πληροφορίες για τις διαστάσεις μιας εκδήλωσης οι οποίες δεν καταχωρίζονται ως μέρος του στοιχείου των διαστάσεων. @el
has element type: 6
label: megjegyzése a megjelenési forma méretarányairól a következő: @hu
definition: Hozzákapcsol egy megjelenési formát egy megjelenési formára tett megjegyzéshez, amely információt nyújt egy megjelenési forma méreteiről. @hu
toolkit label: megjegyzés megjelenési forma méretarányairól @hu
toolkit definition: Egy megjelenési formára tett megjegyzés, amely információt nyújt egy megjelenési forma méreteiről. @hu
label: huomautus manifestaation koosta @fi
label: har note om manifestasjonens størrelse @no
definition: Relaterer en manifestasjon til en note om manifestasjon som gir informasjon om størrelsen til en manifestasjon. @no
label: heeft noot bij afmetingen van manifestatie @nl
definition: Relateert een manifestatie aan een noot bij manifestatie die informatie verschaft over de afmetingen van een manifestatie. @nl
label: له تبصرة عن أبعاد التجسيدة @ar
definition: يربط بين تجسيدة وتبصرة عن التجسيدة التي تعطي معلومات عن أبعاد تجسيدة. @ar
toolkit label: تبصرة عن أبعاد التجسيدة @ar
toolkit definition: تبصرة عن التجسيدة التي تعطي معلومات عن أبعاد تجسيدة. @ar
label: märkus kehastuse mõõtmete kohta @et
definition: Seostab kehastuse märkusega, mis sisaldab infot kehastuse mõõtmete kohta. @et
toolkit label: märkus kehastuse mõõtmete kohta @et
toolkit definition: Märkus, mis sisaldab infot kehastuse mõõtmete kohta. @et
label: ha come nota sulle dimensioni della manifestazione @it
definition: Correla una manifestazione a una nota sulla manifestazione che fornisce informazioni sulle dimensioni di una manifestazione. @it
toolkit label: nota sulle dimensioni della manifestazione @it
toolkit definition: Nota sulla manifestazione che fornisce informazioni sulle dimensioni di una manifestazione. @it
label: piezīme par manifestācijas izmēriem @lv
definition: Sasaista manifestāciju ar piezīmi par manifestāciju, kurā ir ziņas par manifestācijas izmēriem. @lv
toolkit label: piezīme par manifestācijas izmēriem @lv
toolkit definition: Piezīme par manifestāciju, kurā ir ziņas par manifestācijas izmēriem. @lv
label: 有关于载体表现尺寸的附注 @zh-hans
definition: 将一种载体表现与提供关于载体表现尺寸信息的一个关于载体表现的附注关联起来。 @zh-hans
toolkit label: 关于载体表现尺寸的附注 @zh-hans
toolkit definition: 提供关于载体表现尺寸信息的一个关于载体表现的附注 @zh-hans
label: gösterimin boyutları hakkında not ile ilişkilidir @tr
definition: Bir gösterimi, gösterimin boyutu üzerine bilgi sağlayan bir notla ilişkilendirir. @tr
toolkit label: Gösterimin boyutları hakkında not @tr
toolkit definition: Gösterimin boyutu üzerine bilgi sağlayan gösterim üzerine bir not. @tr
label: tiene nota sobre las dimensiones de manifestación @es

has note on manifestation
status: Published
definition: Relates a manifestation to a broad unstructured description of one or more attributes of a manifestation.
type: Property
domain: C10007
lexical alias: noteOnManifestation.en
instruction number: 2.17
toolkit label: note on manifestation
toolkit definition: A broad unstructured description of one or more attributes of a manifestation.
label: a pour note sur une manifestation @fr
definition: Met une manifestation en relation avec une description non structurée générale d’un ou plusieurs attributs d’une manifestation. @fr
toolkit label: note sur une manifestation @fr
toolkit definition: Description non structurée générale d’un ou plusieurs attributs d’une manifestation. @fr
toolkit label: nota sobre la manifestación @es
toolkit definition: Una descripción amplia y no estructurada de uno o más atributos de una manifestación. @es
label: har anmärkning om manifestationen @sv
toolkit label: anmärkning om manifestationen @sv
toolkit label: noot bij manifestatie @nl
toolkit definition: Een algemene ongestructureerde beschrijving van één of meer attributen van een manifestatie. @nl
label: có ghi chú về biểu thị @vi
definition: Liên kết biểu thị với ghi chú cung cấp thông tin phụ trợ về thuộc tính của biểu thị. @vi
toolkit label: ghi chú về biểu thị @vi
toolkit definition: Ghi chú cung cấp thông tin phụ trợ về thuộc tính của biểu thị. @vi
label: har note om manifestation @da
definition: Relaterer en manifestation til en bred, ustruktureret beskrivelse af en eller flere af en manifestations attributter. @da
toolkit label: note om manifestation @da
toolkit definition: Bred, ustruktureret beskrivelse af en eller flere af en manifestations attributter. @da
label: hat Anmerkung zur Manifestation @de
definition: Setzt eine Manifestation in Beziehung zu einer umfassenden, unstrukturierten Beschreibung eines Merkmals oder mehrerer Merkmale einer Manifestation. @de
toolkit label: Anmerkung zur Manifestation @de
toolkit definition: Eine umfassenden, unstrukturierten Beschreibung eines Merkmals oder mehrerer Merkmale einer Manifestation. @de
label: té com a nota sobre una manifestació @ca
definition: Relaciona una manifestació amb una descripció no estructurada àmplia d’un o més atributs d’una manifestació. @ca
toolkit label: nota sobre una manifestació @ca
toolkit definition: Descripció no estructurada àmplia d’un o més atributs d’una manifestació. @ca
definition: Liittää manifestaation laajaan rakenteistamattomaan kuvailuun yhdestä tai useammasta aineiston attribuutista. @fi
toolkit label: huomautus manifestaatiosta @fi
toolkit definition: Laaja rakenteistamaton kuvailu yhdestä tai useammasta manifestaation attribuutista. @fi
toolkit label: note om manifestasjon @no
toolkit definition: En bred ustrukturert beskrivelse av ett eller flere attributter til en manifestasjon. @no
label: έχει σημείωση στην εκδήλωση @el
definition: Συνδέει μια εκδήλωση με μια σημείωση που παρέχει πρόσθετες πληροφορίες σχετικά με τις ιδιότητες της εκδήλωσης. @el
toolkit label: σημείωση στην εκδήλωση @el
toolkit definition: Μια σημείωση που παρέχει πρόσθετες πληροφορίες σχετικά με τις ιδιότητες της εκδήλωσης. @el
has element type: 6
sub property of: P00015
label: megjelenési formára tett megjegyzése a következő: @hu
definition: Hozzákapcsol egy megjelenési formát egy megjelenési forma egy vagy több ismérvének szabad szöveges, strukturálatlan leírásához. @hu
toolkit label: megjelenési formára tett megjegyzés @hu
toolkit definition: Egy megjelenési forma egy vagy több ismérvének szabad szöveges, strukturálatlan leírása. @hu
alternative label: note on frequency
alternative label: huomautus ilmestymistiheydestä @fi
label: huomautus manifestaatiosta @fi
label: har note om manifestasjon @no
definition: Relaterer en manifestasjon til en bred ustrukturert beskrivelse av ett eller flere attributter til en manifestasjon. @no
alternative label: note om frekvens @no
alternative label: note sur la périodicité @fr
label: heeft noot bij manifestatie @nl
definition: Relateert een manifestatie aan een noot die aanvullende informatie over attributen van een manifestatie verschaft. @nl
label: له تبصرة عن تجسيدة @ar
definition: يربط بين تجسيدة ووصف عريض غير مهيكل لواحدة أو أكثر من خواص تجسيدة. @ar
alternative label: تبصرة التتابع @ar
toolkit label: تبصرة عن تجسيدة @ar
toolkit definition: وصف عريض غير مهيكل لواحدة أو أكثر من خواص تجسيدة. @ar
alternative label: nota sobre periodicitat @ca
alternative label: note om hyppighed @da
label: märkus kehastuse kohta @et
definition: Seostab kehastuse üldise struktureerimata kirjeldusega, mis iseloomustab üht või mitut kehastuse omadust. @et
alternative label: märkus ilmumissageduse kohta @et
toolkit label: märkus kehastuse kohta @et
toolkit definition: Üldine struktureerimata kirjeldus, mis iseloomustab üht või mitut kehastuse omadust. @et
alternative label: Anmerkung zur Erscheinungsfrequenz @de
alternative label: megjegyzés gyakoriságról @hu
label: ha come nota sulla manifestazione @it
definition: Correla una manifestazione a una descrizione non strutturata generale di uno o più attributi di una manifestazione. @it
toolkit label: nota sulla manifestazione @it
toolkit definition: Descrizione non strutturata generale di uno o più attributi di una manifestazione. @it
label: piezīme par manifestāciju @lv
definition: Sasaista manifestāciju ar plašu nestrukturētu manifestācijas vienu vai vairākiem atribūtu aprakstiem. @lv
toolkit label: piezīme par manifestāciju @lv
toolkit definition: Plašs nestrukturēts manifestācijas viena vai vairāku atribūtu apraksts. @lv

has note on extent of manifestation
status: Published
definition: Relates a manifestation to a note on manifestation that provides information on the extent of a manifestation.
type: Property
domain: C10007
lexical alias: noteOnExtentOfManifestation.en
instruction number: 3.21.2
toolkit label: note on extent of manifestation
toolkit definition: A note on manifestation that provides information on the extent of a manifestation.
label: a pour note sur l’étendue d’une manifestation @fr
definition: Met une manifestation en relation avec une note sur une manifestation qui fournit de l’information sur l’étendue d’une manifestation. @fr
toolkit label: note sur l’étendue d’une manifestation @fr
toolkit definition: Note sur une manifestation qui fournit de l’information sur l’étendue d’une manifestation. @fr
toolkit label: nota sobre el alcance de la manifestación @es
toolkit definition: Una nota sobre manifestación que proporciona información sobre el alcance de una manifestación. @es
sub property of: has note on carrier
label: har anmärkning om manifestationens omfång @sv
toolkit label: anmärkning om manifestationens omfång @sv
toolkit label: noot bij omvang van manifestatie @nl
toolkit definition: Een noot bij manifestatie die informatie verschaft over de omvang van een manifestatie. @nl
label: có ghi chú về quy mô của biểu thị @vi
definition: Liên kết biểu thị với ghi chú cung cấp thông tin về quy mô của biểu hiện không được ghi như là phần của yếu tố quy mô. @vi
toolkit label: ghi chú về quy mô của biểu thị @vi
toolkit definition: Ghi chú cung cấp thông tin về quy mô của biểu hiện không được ghi như là phần của yếu tố quy mô. @vi
label: har note om omfang af manifestation @da
definition: Relaterer en manifestation til en note om manifestation, som giver information om en manifestations omfang. @da
toolkit label: note om omfang af manifestation @da
toolkit definition: Note om manifestation, som giver information om en manifestations omfang. @da
label: hat Anmerkung zum Umfang einer Manifestation @de
definition: Setzt eine Manifestation in Beziehung zu einer Anmerkung zur Manifestation, die Informationen über den Umfang einer Manifestation enthält. @de
toolkit label: Anmerkung zum Umfang einer Manifestation @de
toolkit definition: Eine Anmerkung zur Manifestation, die Informationen über den Umfang einer Manifestation enthält. @de
label: té com a nota sobre extensió d’una manifestació @ca
definition: Relaciona una manifestació amb una nota sobre una manifestació que proporciona la informació sobre l’extensió d’una manifestació. @ca
toolkit label: nota sobre extensió d’una manifestació @ca
toolkit definition: Nota sobre una manifestació que proporciona la informació sobre l’extensió d’una manifestació. @ca
definition: Liittää manifestaation huomautukseen, joka sisältää manifestaation laajuutta koskevaa tietoa. @fi
toolkit label: huomautus manifestaation laajuudesta @fi
toolkit definition: Huomautus, joka sisältää manifestaation laajuutta koskevaa tietoa. @fi
toolkit label: note om manifestasjonens omfang @no
toolkit definition: En note om manifestasjon som gir informasjon om omfanget til en manifestasjon. @no
label: έχει σημείωση στην έκταση της εκδήλωσης @el
definition: Συνδέει μια εκδήλωση με μια σημείωση που παρέχει τις πληροφορίες για την έκταση μιας εκδήλωσης η οποία δεν καταχωρίζεται ως μέρος του στοιχείου της έκτασης. @el
toolkit label: σημείωση στην έκταση της εκδήλωσης @el
toolkit definition: Μια σημείωση που παρέχει τις πληροφορίες για την έκταση μιας εκδήλωσης η οποία δεν καταχωρίζεται ως μέρος του στοιχείου της έκτασης. @el
has element type: 6
label: megjegyzése a megjelenési forma terjedelméről a következő: @hu
definition: Hozzákapcsol egy megjelenési formát egy megjelenési formára tett megjegyzéshez, amely információt nyújt egy megjelenési forma terjedelméről. @hu
toolkit label: megjegyzés megjelenési forma terjedelméről @hu
toolkit definition: Egy megjelenési formára tett megjegyzés, amely információt nyújt egy megjelenési forma terjedelméről. @hu
label: huomautus manifestaation laajuudesta @fi
label: har note om manifestasjonens omfang @no
definition: Relaterer en manifestasjon til en note om manifestasjon som gir informasjon om omfanget til en manifestasjon. @no
label: heeft noot bij omvang van manifestatie @nl
definition: Relateert een manifestatie aan een noot bij manifestatie die informatie verschaft over de omvang van een manifestatie. @nl
label: له تبصرة عن امتداد التجسيدة @ar
definition: يربط بين تجسيدة وتبصرة عن التجسيدة التي تعطي معلومات عن امتداد تجسيدة. @ar
toolkit label: تبصرة عن امتداد التجسيدة @ar
toolkit definition: تبصرة عن التجسيدة التي تعطي معلومات عن امتداد تجسيدة. @ar
label: märkus kehastuse mahu kohta @et
definition: Seostab kehastuse märkusega, mis sisaldab infot kehastuse mahu kohta. @et
toolkit label: märkus kehastuse mahu kohta @et
toolkit definition: Märkus, mis sisaldab infot kehastuse mahu kohta. @et
label: ha come nota sull'estensione della manifestazione @it
definition: Correla una manifestazione a una nota sulla manifestazione che fornisce informazioni sull'estensione di una manifestazione. @it
toolkit label: nota sull'estensione della manifestazione @it
toolkit definition: Nota sulla manifestazione che fornisce informazioni sull'estensione di una manifestazione. @it
label: piezīme par manifestācijas apjomu @lv
definition: Sasaista manifestāciju ar piezīmi par manifestāciju, kurā ir ziņas par manifestācijas apjomu. @lv
toolkit label: piezīme par manifestācijas apjomu @lv
toolkit definition: Piezīme par manifestāciju, kurā ir ziņas par manifestācijas apjomu. @lv
label: 有关于载体表现数量的附注 @zh-hans
definition: 将一种载体表现与提供关于载体表现数量信息的一个关于载体表现的附注关联起来。 @zh-hans
toolkit label: 关于载体表现数量的附注 @zh-hans
toolkit definition: 提供关于载体表现数量信息的一个关于载体表现的附注 @zh-hans
label: gösterimin kapsamı hakkında not ile ilişkilidir @tr
definition: Bir gösterimi, gösterimin kapsamı üzerine bilgi sağlayan bir notla ilişkilendirir. @tr
toolkit label: Gösterimin kapsamı hakkında not @tr
toolkit definition: Bir gösterimin kapsamı hakkında bilgi sağlayan gösterim üzerine bir not @tr
label: tiene nota sobre el alcance de la manifestación @es

has note on production statement
status: Published
definition: Relates a manifestation to a note on manifestation that provides information on the production of a manifestation.
type: Property
domain: C10007
sub property of: has note on manifestation
lexical alias: noteOnProductionStatement.en
instruction number: 2.17.6
toolkit label: note on production statement
toolkit definition: A note on manifestation that provides information on the production of a manifestation.
label: a pour note sur une mention de production @fr
definition: Met une manifestation en relation avec une note sur une manifestation qui fournit de l’information sur la production d’une manifestation. @fr
toolkit label: note sur une mention de production @fr
toolkit definition: Note sur une manifestation qui fournit de l’information sur la production d’une manifestation. @fr
toolkit label: nota sobre la declaración de producción @es
toolkit definition: Una nota sobre manifestación que proporciona información sobre la producción de una manifestación. @es
label: har anmärkning om produktionsuppgift @sv
toolkit label: anmärkning om produktionsuppgift @sv
toolkit label: noot bij productievermelding @nl
toolkit definition: Een noot bij manifestatie die informatie verschaft over de productie van een manifestatie. @nl
label: có ghi chú về thông tin sản xuất @vi
definition: Liên kết biểu thị với ghi chú cung cấp chi tiết về địa điểm sản xuất, nhà sản xuất, hoặc ngày sản xuất, hoặc thông tin về thay đổi trong địa điểm sản xuất, nhà sản xuất, hoặc tên nhà sản xuất. @vi
toolkit label: ghi chú về thông tin sản xuất @vi
toolkit definition: Ghi chú cung cấp chi tiết về địa điểm sản xuất, nhà sản xuất, hoặc ngày sản xuất, hoặc thông tin về thay đổi trong địa điểm sản xuất, nhà sản xuất, hoặc tên nhà sản xuất. @vi
label: har note om produktionsoplysning @da
definition: Relaterer en manifestation til en note om manifestation, som giver information om produktionen af en manifestation. @da
toolkit label: note om produktionsoplysning @da
toolkit definition: Note om manifestation, som giver information om produktionen af en manifestation. @da
label: hat Anmerkung zur Entstehungsangabe @de
definition: Setzt eine Manifestation in Beziehung zu einer Anmerkung zur Manifestation, die Informationen über die Entstehung einer Manifestation enthält. @de
toolkit label: Anmerkung zur Entstehungsangabe @de
toolkit definition: Eine Anmerkung zur Manifestation, die Informationen über die Entstehung einer Manifestation enthält. @de
label: té com a nota sobre menció de producció @ca
definition: Relaciona una manifestació amb una nota sobre una manifestació que proporciona la informació sobre la producció d’una manifestació. @ca
toolkit label: nota sobre menció de producció @ca
toolkit definition: Nota sobre una manifestació que proporciona la informació sobre la producció d’una manifestació. @ca
definition: Liittää manifestaation huomautukseen, joka sisältää tietoja manifestaation tuotannosta. @fi
toolkit label: huomautus tuotantomerkinnöstä @fi
toolkit definition: Huomautus, joka sisältää tietoja manifestaation tuotannosta. @fi
toolkit label: note om produksjonsangivelse @no
toolkit definition: En note om manifestasjon som gir informasjon om produksjonen av en manifestasjon. @no
label: έχει σημείωση στη μνεία παραγωγής @el
definition: Συνδέει μια εκδήλωση με μια σημείωση που παρέχει τις λεπτομέρειες για τον τόπο της παραγωγής, τον παραγωγό ή τη χρονολογία της παραγωγής ή τις πληροφορίες για τις αλλαγές σε έναν τόπο παραγωγής, σε έναν παραγωγό ή στο όνομα ενός παραγωγού. @el
toolkit label: σημείωση στη μνεία παραγωγής @el
toolkit definition: Μια σημείωση που παρέχει τις λεπτομέρειες για τον τόπο της παραγωγής, τον παραγωγό ή τη χρονολογία της παραγωγής ή τις πληροφορίες για τις αλλαγές σε έναν τόπο παραγωγής, σε έναν παραγωγό ή στο όνομα ενός παραγωγού. @el
has element type: 6
label: előállítási közlésről szóló megjegyzése a következő: @hu
definition: Hozzákapcsol egy megjelenési formát egy megjelenési formára tett megjegyzéshez, amely információt nyújt egy megjelenési forma gyártásáról. @hu
toolkit label: előállítási közlésről szóló megjegyzése: @hu
toolkit definition: Egy megjelenési formára tett megjegyzés, amely információt nyújt egy megjelenési forma gyártásáról. @hu
label: huomautus tuotantomerkinnöstä @fi
label: har note om produksjonsangivelse @no
definition: Relaterer en manifestasjon til en note om manifestasjon som gir informasjon om produksjonen av en manifestasjon. @no
label: heeft noot bij productievermelding @nl
definition: Relateert een manifestatie aan een noot bij manifestatie die informatie verschaft over de productie van een manifestatie. @nl
label: له تبصرة عن بيان الإنتاج @ar
definition: يربط بين تجسيدة وتبصرة عن التجسيدة التي تعطي معلومات عن إنتاج تجسيدة. @ar
toolkit label: تبصرة عن بيان الإنتاج @ar
toolkit definition: تبصرة عن التجسيدة التي تعطي معلومات عن إنتاج تجسيدة. @ar
label: märkus tootmisandmete kohta @et
definition: Seostab kehastuse märkusega, mis sisaldab infot kehastuse tootmise kohta. @et
toolkit label: märkus tootmisandmete kohta @et
toolkit definition: Märkus, mis sisaldab infot kehastuse tootmise kohta. @et
label: ha come nota sulla formulazione di produzione @it
definition: Correla una manifestazione a una nota sulla manifestazione che fornisce informazioni sulla produzione di una manifestazione. @it
toolkit label: nota sulla formulazione di produzione @it
toolkit definition: Nota sulla manifestazione che fornisce informazioni sulla produzione di una manifestazione. @it
label: piezīme par izgatavošanas ziņām @lv
definition: Sasaista manifestāciju ar piezīmi par manifestāciju, kurā ir ziņas par manifetācijas izveidošanu. @lv
toolkit label: piezīme par izgatavošanas ziņām @lv
toolkit definition: Piezīme par manifestāciju, kurā ir ziņas par manifetācijas izveidošanu. @lv
label: 有关于制作说明的附注 @zh-hans
definition: 将一种载体表现与提供关于载体表现制作信息的关于载体表现的附注关联起来。 @zh-hans
toolkit label: 关于制作说明的附注 @zh-hans
toolkit definition: 提供关于载体表现制作信息的关于载体表现的附注 @zh-hans
label: yapım bildirimi hakkında not ile ilişkilidir @tr
definition: Bir gösterimi, bir gösterimin üretimi hakkında bilgi sağlayan gösterime ilişkin bir not ile ilişkilendirir. @tr
toolkit label: yapım bildirimi hakkında not @tr
toolkit definition: Bir gösterimin yapımı hakkında bilgi sağlayan gösterim üzerine bir not. @tr
label: tiene nota sobre la declaración de producción @es

has note on series statement
status: Published
definition: Relates a manifestation to a note on manifestation that provides information on a series with which a manifestation is associated.
type: Property
domain: C10007
sub property of: has note on manifestation
lexical alias: noteOnSeriesStatement.en
instruction number: 2.17.11
toolkit label: note on series statement
toolkit definition: A note on manifestation that provides information on a series with which a manifestation is associated.
label: a pour note sur une mention de collection @fr
definition: Met une manifestation en relation avec une note sur une manifestation qui fournit de l’information sur une collection à laquelle une manifestation est associée. @fr
toolkit label: note sur une mention de collection @fr
toolkit definition: Note sur une manifestation qui fournit de l’information sur une collection à laquelle une manifestation est associée. @fr
toolkit label: nota sobre la declaración de la serie @es
toolkit definition: Una nota sobre manifestación que proporciona información sobre una serie a la que está asociada una manifestación. @es
label: har anmärkning om serieuppgift @sv
toolkit label: anmärkning om serieuppgift @sv
toolkit label: noot bij reeksvermelding @nl
toolkit definition: Een noot bij manifestatie die informatie verschaft over een reeks waarmee de manifestatie is geassocieerd. @nl
label: có ghi chú về thông tin tùng thư @vi
definition: Liên kết biểu thị với ghi chú cung cấp thông tin về thông tin tùng thư phức hợp, về đánh số không đúng bên trong tùng thư, hoặc về thông tin khác liên quan tới thông tin tùng thư. @vi
toolkit label: ghi chú về thông tin tùng thư @vi
toolkit definition: Ghi chú cung cấp thông tin về thông tin tùng thư phức hợp, về đánh số không đúng bên trong tùng thư, hoặc về thông tin khác liên quan tới thông tin tùng thư. @vi
label: har note om seriebetegnelse @da
definition: Relaterer en manifestation til en note om manifestation, som giver information om en serie, som en manifestation er knyttet til. @da
toolkit label: note om seriebetegnelse @da
toolkit definition: Note om manifestation, som giver information om en serie, som en manifestation er knyttet til. @da
label: hat Anmerkung zur Gesamttitelangabe @de
definition: Setzt eine Manifestation in Beziehung zu einer Anmerkung zur Manifestation, die Informationen über eine Reihe enthält, mit der eine Manifestation in Verbindung steht. @de
toolkit label: Anmerkung zur Gesamttitelangabe @de
toolkit definition: Eine Anmerkung zur Manifestation, die Informationen über eine Reihe enthält, mit der eine Manifestation in Verbindung steht. @de
label: té com a nota sobre menció de col·lecció @ca
definition: Relaciona una manifestació amb una nota sobre una manifestació que proporciona la informació sobre una col·lecció amb la qual s’associa una manifestació. @ca
toolkit label: nota sobre menció de col·lecció @ca
toolkit definition: Nota sobre una manifestació que proporciona la informació sobre una col·lecció amb la qual s’associa una manifestació. @ca
definition: Liittää manifestaation huomautukseen, joka sisältää tietoa manifestaatioon liittyvästä sarjasta. @fi
toolkit label: huomautus sarjamerkinnöstä @fi
toolkit definition: Huomautus, joka sisältää tietoa manifestaatioon liittyvästä sarjasta. @fi
toolkit label: note om serieangivelse @no
toolkit definition: En note om manifestasjon som gir informasjon om en serie som en manifestasjon forbindes med. @no
label: έχει σημείωση στη μνεία σειράς @el
definition: Συνδέει μια εκδήλωση με μια σημείωση που παρέχει τις πληροφορίες για σύνθετες μνείες ευθύνης, για λανθασμένη αρίθμηση εντός της σειράς, για αλλαγές στις μνείες σειράς ή για άλλες πληροφορίες που σχετίζονται με τη μνεία σειράς. @el
toolkit label: σημείωση στη μνεία σειράς @el
toolkit definition: Μια σημείωση που παρέχει τις πληροφορίες για σύνθετες μνείες ευθύνης, για λανθασμένη αρίθμηση εντός της σειράς, για αλλαγές στις μνείες σειράς ή για άλλες πληροφορίες που σχετίζονται με τη μνεία σειράς. @el
has element type: 6
label: sorozati közlésről szóló megjegyzése a következő: @hu
definition: Hozzákapcsol egy megjelenési formát egy megjelenési formára tett megjegyzéshez, amely információt nyújt a megjelenési formához társított sorozatról. @hu
toolkit label: sorozati közlésről szóló megjegyzése: @hu
toolkit definition: Egy megjelenési formára tett megjegyzés, amely információt nyújt a megjelenési formához társított sorozatról. @hu
label: huomautus sarjamerkinnöstä @fi
label: har note om serieangivelse @no
definition: Relaterer en manifestasjon til en note om manifestasjon som gir informasjon om en serie som en manifestasjon forbindes med. @no
label: heeft noot bij reeksvermelding @nl
definition: Relateert een manifestatie aan een noot bij manifestatie die informatie verschaft over een reeks waarmee de manifestatie is geassocieerd. @nl
label: له تبصرة عن بيان السلسلة @ar
definition: يربط بين تجسيدة وتبصرة عن التجسيدة التي تعطي معلومات عن السلسلة التي ترتبط بها تجسيدة. @ar
toolkit label: تبصرة عن بيان السلسلة @ar
toolkit definition: تبصرة عن التجسيدة التي تعطي معلومات عن السلسلة التي ترتبط بها تجسيدة. @ar
label: märkus seeriaandmete kohta @et
definition: Seostab kehastuse märkusega, mis sisaldab infot kehastusega seotud seeria kohta. @et
toolkit label: märkus seeriaandmete kohta @et
toolkit definition: Märkus, mis sisaldab infot kehastusega seotud seeria kohta. @et
label: ha come nota sulla formulazione di serie @it
definition: Correla una manifestazione a una nota sulla manifestazione che fornisce informazioni su una serie alla quale è associata una manifestazione. @it
toolkit label: nota sulla formulazione di serie @it
toolkit definition: Nota sulla manifestazione che fornisce informazioni su una serie alla quale una manifestazione è associata. @it
label: piezīme par sērijas ziņām @lv
definition: Sasaista manifestāciju ar piezīmi par manifestāciju, kurā ir ziņas par sēriju. @lv
toolkit label: piezīme par sērijas ziņām @lv
toolkit definition: Piezīme par manifestāciju, kurā ir ziņas par sēriju. @lv
label: 有关于丛编说明的附注 @zh-hans
definition: 将一种载体表现与提供关于和载体表现有关的丛编的信息的关于载体表现的附注关联起来。 @zh-hans
toolkit label: 关于丛编说明的附注 @zh-hans
toolkit definition: 提供关于和载体表现有关的丛编的信息的关于载体表现的附注 @zh-hans
label: seri bildirimi hakkında not ile ilişkilidir @tr
definition: Bir gösterimi, gösterimin ilişkili olduğu dizi hakkında bilgi sağlayan bir notla ilişkilendirir. @tr
toolkit label: Seri bildirim not @tr
toolkit definition: Gösterimin ilişkili olduğu dizi hakkında bilgi sağlayan bir not. @tr
label: tiene nota sobre la declaración de la serie @es

has note on edition statement
status: Published
definition: Relates a manifestation to a note on manifestation that provides information on an edition of a manifestation.
type: Property
domain: C10007
sub property of: has note on manifestation
lexical alias: noteOnEditionStatement.en
instruction number: 2.17.4
toolkit label: note on edition statement
toolkit definition: A note on manifestation that provides information on an edition of a manifestation.
label: a pour note sur une mention d’édition @fr
definition: Met une manifestation en relation avec une note sur une manifestation qui fournit de l’information sur une édition d’une manifestation. @fr
toolkit label: note sur une mention d’édition @fr
toolkit definition: Note sur une manifestation qui fournit de l’information sur une édition d’une manifestation. @fr
toolkit label: nota sobre la declaración de edición @es
toolkit definition: Una nota sobre manifestación que proporciona información sobre una edición de una manifestación. @es
label: har anmärkning om upplageuppgift @sv
toolkit label: anmärkning om upplageuppgift @sv
toolkit label: noot bij editievermelding @nl
toolkit definition: Een noot bij manifestatie die informatie verschaft over een editie van een manifestatie. @nl
label: có ghi chú về thông tin ấn bản @vi
definition: Liên kết biểu thị với ghi chú cung cấp thông tin về nguồn của thông tin ấn bản, về thông tin ấn bản liên quan tới số, phần, v.v..., về thay đổi trong thông tin ấn bản, hoặc về thông tin khác liên quan tới thông tin ấn bản. @vi
toolkit label: ghi chú về thông tin ấn bản @vi
toolkit definition: Ghi chú cung cấp thông tin về nguồn của thông tin ấn bản, về thông tin ấn bản liên quan tới số, phần, v.v..., về thay đổi trong thông tin ấn bản, hoặc về thông tin khác liên quan tới thông tin ấn bản. @vi
label: har note om udgavebetegnelse @da
definition: Relaterer en manifestation til en note om manifestation, som giver information om en udgave af en manifestation. @da
toolkit label: note om udgavebetegnelse @da
toolkit definition: Note om manifestation, som giver information om en udgave af en manifestation. @da
label: hat Anmerkung zum Ausgabevermerk @de
definition: Setzt eine Manifestation in Beziehung zu einer Anmerkung zur Manifestation, die Informationen über eine Ausgabe einer Manifestation enthält. @de
toolkit label: Anmerkung zum Ausgabevermerk @de
toolkit definition: Eine Anmerkung zur Manifestation, die Informationen über eine Ausgabe einer Manifestation enthält. @de
label: té com a nota sobre menció d’edició @ca
definition: Relaciona una manifestació amb una nota sobre una manifestació que proporciona la informació sobre una edició d’una manifestació. @ca
toolkit label: nota sobre menció d’edició @ca
toolkit definition: Nota sobre una manifestació que proporciona la informació sobre una edició d’una manifestació. @ca
definition: Liittää manifestaation huomautukseen, joka sisältää tietoa manifestaation painoksesta. @fi
toolkit label: huomautus painosmerkinnöstä @fi
toolkit definition: Huomautus, joka sisältää tietoa manifestaation painoksesta. @fi
toolkit label: note om utgaveangivelse @no
toolkit definition: En note om manifestasjon som gir informasjon om en utgave av en manifestasjon. @no
label: έχει σημείωση στη μνεία έκδοσης @el
definition: Συνδέει μια εκδήλωση με μια σημείωση που παρέχει τις πληροφορίες για την πηγή μιας μνείας έκδοσης, για τις μνείες έκδοσης που σχετίζονται με τα τεύχη, μέρη κ.λπ., για τις αλλαγές στις μνείες έκδοσης ή για άλλες πληροφορίες που σχετίζονται με τη μνεία έκδοσης. @el
toolkit label: σημείωση στη μνεία έκδοσης @el
toolkit definition: Μια σημείωση που παρέχει τις πληροφορίες για την πηγή μιας μνείας έκδοσης, για τις μνείες έκδοσης που σχετίζονται με τα τεύχη, μέρη κ.λπ., για τις αλλαγές στις μνείες έκδοσης ή για άλλες πληροφορίες που σχετίζονται με τη μνεία έκδοσης. @el
has element type: 6
label: a kiadási közlésről szóló megjegyzése a következő: @hu
definition: Hozzákapcsol egy megjelenési formát egy megjelenési formára tett megjegyzéshez, amely információt nyújt egy megjelenési forma kiadásáról. @hu
toolkit label: kiadási közlésről szóló megjegyzése: @hu
toolkit definition: Egy megjelenési formára tett megjegyzés, amely információt nyújt egy megjelenési forma kiadásáról. @hu
label: huomautus painosmerkinnöstä @fi
label: har note om utgaveangivelse @no
definition: Relaterer en manifestasjon til en note om manifestasjon som gir informasjon om en utgave av en manifestasjon. @no
label: heeft noot bij editievermelding @nl
definition: Relateert een manifestatie aan een noot bij manifestatie die informatie verschaft over een editie van een manifestatie. @nl
label: له تبصرة عن بيان الطبعة @ar
definition: يربط بين تجسيدة وتبصرة عن التجسيدة التي تعطي معلومات عن الطبعة الخاصة بتجسيدة. @ar
toolkit label: تبصرة عن بيان الطبعة @ar
toolkit definition: تبصرة عن التجسيدة التي تعطي معلومات عن الطبعة الخاصة بتجسيدة. @ar
label: märkus editsiooniandmete kohta @et
definition: Seostab kehastuse märkusega, mis sisaldab infot kehastuse editsiooni kohta. @et
toolkit label: märkus editsiooniandmete kohta @et
toolkit definition: Märkus, mis sisaldab infot kehastuse editsiooni kohta. @et
label: ha come nota sulla formulazione di edizione @it
definition: Correla una manifestazione a una nota sulla manifestazione che fornisce informazioni su un'edizione di una manifestazione. @it
toolkit label: nota sulla formulazione di edizione @it
toolkit definition: Nota sulla manifestazione che fornisce informazioni su un'edizione di una manifestazione. @it
label: piezīme par izdevuma ziņām @lv
definition: Sasaista manifestāciju ar piezīmi par manifestāciju, kurā ir ziņas par manifestācijas izdevuma ziņām. @lv
toolkit label: piezīme par izdevuma ziņām @lv
toolkit definition: Piezīme par manifestāciju, kurā ir ziņas par manifestācijas izdevuma ziņām. @lv
label: 有关于版本的说明 @zh-hans
definition: 将一种载体表现与提供关于载体表现版本信息的关于载体表现的附注关联起来。 @zh-hans
toolkit label: 关于版本的说明 @zh-hans
toolkit definition: 提供关于载体表现版本信息的关于载体表现的附注 @zh-hans
label: basım bildirimi hakkında not ile ilişkilidir @tr
definition: Bir gösterimi, gösterimin sürümü hakkında bilgi sağlayan bir gösterim notuyla ilişkilendirir. @tr
toolkit label: Basım bildirimi notu @tr
toolkit definition: Bir gösterimin sürümü hakkında bilgi sağlayan bir gösterim üzerine bir bir not. @tr
label: tiene nota sobre la declaración de edición @es

has note on statement of responsibility
status: Published
definition: Relates a manifestation to note on manifestation that provides information on an agent, and their function, who is responsible for a work or its expression that is embodied by a manifestation.
type: Property
domain: C10007
sub property of: has note on manifestation
lexical alias: noteOnStatementOfResponsibility.en
instruction number: 2.17.3
toolkit label: note on statement of responsibility
toolkit definition: A note on manifestation that provides information on an agent, and their function, who is responsible for a work or its expression that is embodied by a manifestation.
label: a pour note sur une mention de responsabilité @fr
definition: Met une manifestation en relation avec une note sur une manifestation qui fournit de l’information sur un agent responsable d’une œuvre ou de son expression matérialisée par une manifestation, ainsi que sur sa fonction. @fr
toolkit label: note sur une mention de responsabilité @fr
toolkit definition: Note sur une manifestation qui fournit de l’information sur un agent responsable d’une œuvre ou de son expression matérialisée par une manifestation, ainsi que sur sa fonction. @fr
toolkit label: nota sobre la declaración de responsabilidad @es
toolkit definition: Una nota sobre manifestación que proporciona información sobre un agente, y su función, quién es responsable de una obra o su expresión que se materializa en una manifestación. @es
label: har anmärkning om upphovsuppgift @sv
toolkit label: anmärkning om upphovsuppgift @sv
toolkit label: noot bij verantwoordelijkheidsvermelding @nl
toolkit definition: Een noot bij manifestatie die informatie verschaft over een actor, en diens rol, die verantwoordelijk is voor een werk of expressie daarvan die verwezenlijkt is in een manifestatie. @nl
label: có ghi chú về thông tin trách nhiệm @vi
definition: Liên kết biểu thị với ghi chú cung cấp thông tin về tác nhân không được nêu tên trong thông tin trách nhiệm đối với sáng tạo, hoặc đóng góp cho thực hiện, nội dung trí tuệ và nghệ thuật của tác phẩm, về các hình thái khác của tên xuất hiện trong biểu thị, về thay đổi trong thông tin trách nhiệm, hoặc về chi tiết liên quan tới thông tin trách nhiệm. @vi
toolkit label: ghi chú về thông tin trách nhiệm @vi
toolkit definition: Ghi chú cung cấp thông tin về tác nhân không được nêu tên trong thông tin trách nhiệm đối với sáng tạo, hoặc đóng góp cho thực hiện, nội dung trí tuệ và nghệ thuật của tác phẩm, về các hình thái khác của tên xuất hiện trong biểu thị, về thay đổi trong thông tin trách nhiệm, hoặc về chi tiết liên quan tới thông tin trách nhiệm. @vi
label: har note til ophavsangivelse @da
definition: Relaterer en manifestation til en note, der giver oplysninger om en agent, der ikke er nævnt i ophavsangivelsen, men som er tillagt ansvaret for det intellektuelle eller kunstneriske indhold af værket, om variantformer af navne, der optræder i manifestationen, om ændringer i ophavsangivelser eller om andre detaljer der knytter sig til ophavsangivelsen. @da
toolkit label: note til ophavsangivelse @da
toolkit definition: Note, der giver oplysninger om en agent, der ikke er nævnt i ophavsangivelsen, men som er tillagt ansvaret for det intellektuelle eller kunstneriske indhold af værket, om variantformer af navne, der optræder i manifestationen, om ændringer i ophavsangivelser eller om andre detaljer der knytter sig til ophavsangivelsen. @da
label: hat Anmerkung zur Verantwortlichkeitsangabe @de
definition: Setzt eine Manifestation in Beziehung zu einer Anmerkung zur Manifestation, die Informationen über einen Akteur und dessen Funktion enthält, der für ein Werk oder dessen Expression, die in einer Manifestation verkörpert ist, verantwortlich ist. @de
toolkit label: Anmerkung zur Verantwortlichkeitsangabe @de
toolkit definition: Eine Anmerkung zur Manifestation, die Informationen über einen Akteur und dessen Funktion enthält, der für ein Werk oder dessen Expression, die in einer Manifestation verkörpert ist, verantwortlich ist. @de
label: té com a nota sobre menció de responsabilitat @ca
definition: Relaciona una manifestació amb una nota sobre una manifestació que proporciona la informació sobre un agent, i la seva funció, que és responsable d’un obra o de la seva expressió que es materialitza en una manifestació. @ca
toolkit label: nota sobre menció de responsabilitat @ca
toolkit definition: Nota sobre una manifestació que proporciona la informació sobre un agent, i la seva funció, que és responsable d’un obra o de la seva expressió que es materialitza en una manifestació. @ca
definition: Liittää manifestaation huomautukseen, joka sisältää tietoa manifestaatioon sisältyvästä teoksesta tai sen ekspressioista vastuussa olevasta toimijasta ja sen roolista. @fi
toolkit label: huomautus vastuullisuusmerkinnöstä @fi
toolkit definition: Huomautus, joka sisältää tietoa manifestaatioon sisältyvästä teoksesta tai sen ekspressioista vastuussa olevasta toimijasta ja sen roolista. @fi
toolkit label: note om ansvarsangivelse @no
toolkit definition: En note om manifestasjon som gir informasjon om en agent, og dennes funksjon, som er ansvarlig for et verk og verkets uttrykk som er utformet i en manifestasjon. @no
label: έχει σημείωση στη μνεία ευθύνης @el
definition: Συνδέει μια εκδήλωση με μια σημείωση που παρέχει τις πληροφορίες για έναν φορέα ο οποίος δεν κατονομάζεται σε μια μνεία ευθύνης, στον οποίο έχει αποδοθεί η ευθύνη για τη δημιουργία του ή η συνεισφορά για την υλοποίηση του πνευματικού ή καλλιτεχνικού περιεχομένου ενός έργου, για τις διάφορες μορφές των ονομάτων που εμφανίζονται στην εκδήλωση, για τις αλλαγές στις μνείες ευθύνης ή για άλλες λεπτομέρειες που σχετίζονται με τη μνεία ευθύνης. @el
toolkit label: σημείωση στη μνεία ευθύνης @el
toolkit definition: Μια σημείωση που παρέχει τις πληροφορίες για έναν φορέα ο οποίος δεν κατονομάζεται σε μια μνεία ευθύνης, στον οποίο έχει αποδοθεί η ευθύνη για τη δημιουργία του ή η συνεισφορά για την υλοποίηση του πνευματικού ή καλλιτεχνικού περιεχομένου ενός έργου, για τις διάφορες μορφές των ονομάτων που εμφανίζονται στην εκδήλωση, για τις αλλαγές στις μνείες ευθύνης ή για άλλες λεπτομέρειες που σχετίζονται με τη μνεία ευθύνης. @el
has element type: 6
label: felelősségi közlésről szóló megjegyzése a következő: @hu
definition: Hozzákapcsol egy megjelenési formár egy megjelenési formára tett megjegyzéshez, amely információt nyújt egy ágensről, amely felelős egy műért vagy annak megjelenési formában megtestesülő kifejezési formájáért. @hu
toolkit label: felelősségi közlésről szóló megjegyzése: @hu
toolkit definition: Egy megjelenési formára tett megjegyzés, amely információt nyújt egy ágensről, amely felelős egy műért vagy annak megjelenési formában megtestesülő kifejezési formájáért. @hu
label: huomautus vastuullisuusmerkinnöstä @fi
label: har note om ansvarsangivelse @no
definition: Relaterer en manifestasjon til en note om manifestasjon som gir informasjon om en agent, og dennes funksjon, som er ansvarlig for et verk og verkets uttrykk som er utformet i en manifestasjon. @no
label: heeft noot bij verantwoordelijkheidsvermelding @nl
definition: Relateert een manifestatie aan een noot bij manifestatie die informatie verschaft over een actor, en diens rol, die verantwoordelijk is voor een werk of expressie daarvan die verwezenlijkt is in een manifestatie. @nl
label: له تبصرة عن بيان المسئولية @ar
definition: يربط بين تجسيدة وتبصرة عن تجسيدة تعطي معلومات عن الوكيل، ووظيفته، ومن مسئول عن العمل أو تعبيرته التي تمثلت في تجسيدة. @ar
toolkit label: تبصرة عن بيان المسئولية @ar
toolkit definition: تبصرة عن تجسيدة تعطي معلومات عن الوكيل، ووظيفته، ومن مسئول عن العمل أو تعبيرته التي تمثلت في تجسيدة. @ar
label: märkus vastutusandmete kohta @et
definition: Seostab kehastuse märkusega, mis sisaldab infot kehastuses teostatud teose või selle väljenduse eest vastutavate tegijate ja nende rolli kohta. @et
toolkit label: märkus vastutusandmete kohta @et
toolkit definition: Märkus, mis sisaldab infot kehastuses teostatud teose või selle väljenduse eest vastutavate tegijate ja nende rolli kohta. @et
label: ha come nota sulla formulazione di responsabilità @it
definition: Correla una manifestazione a una nota sulla manifestazione che fornisce informazioni su un agente e sulle sue funzioni, responsabile di un'opera e della sua espressione, materializzata in una manifestazione. @it
toolkit label: nota sulla formulazione di responsabilità @it
toolkit definition: Nota sulla manifestazione che fornisce informazioni su un agente e sulle sue funzioni, responsabile di un'opera e della sua espressione materializzata in una manifestazione. @it
label: piezīme par atbildības ziņām @lv
definition: Sasaista manifestāciju ar piezīmi par manifestāciju, kurā ir ziņas par aģentu un tā funkciju, kas atbildīga par darbu vai tā izteiksmi, ko ietver manifestācija. @lv
toolkit label: piezīme par atbildības ziņām @lv
toolkit definition: Piezīme par manifestāciju, kurā ir ziņas par aģentu un tā funkciju, kas atbildīga par darbu vai tā izteiksmi, ko ietver manifestācija. @lv
label: 有责任说明附注 @zh-hans
definition: 将一种载体表现与提供关于为载体表现所具体化的作品或其内容表达负责的行为者及其职能的信息的关于载体表现的附注关联起来。 @zh-hans
toolkit label: 责任说明附注 @zh-hans
toolkit definition: 提供关于为载体表现所具体化的作品或其内容表达负责的行为者及其职能的信息的关于载体表现的附注 @zh-hans
label: sorumluluk bildirimi hakkında not ile ilişkilidir @tr
definition: Bir gösterimi, gösterim ile somutlaştırılmış bir eserden veya ifadeden sorumlu bir temsilci ve onun işlevleri hakkında bilgi sağlayan gösterime ilişkin bir not ile ilişkilendirir. @tr
toolkit label: sorumluluk bildirimi hakkında not @tr
toolkit definition: Bir gösterim ile somutlaştırılmış bir eserden veya anlatımdan sorumlu bir temsilci ve onun işlevleri hakkında bilgi sağlayan gösterime ilişkin not. @tr
label: tiene nota sobre la declaración de responsabilidad @es

has note on distribution statement
status: Published
definition: Relates a manifestation to a note on manifestation that provides information on the distribution of a manifestation.
type: Property
domain: C10007
sub property of: has note on manifestation
lexical alias: noteOnDistributionStatement.en
instruction number: 2.17.8
toolkit label: note on distribution statement
toolkit definition: A note on manifestation that provides information on the distribution of a manifestation.
label: a pour note sur une mention de diffusion ou de distribution @fr
definition: Met une manifestation en relation avec une note sur une manifestation qui fournit de l’information sur la diffusion ou la distribution d’une manifestation. @fr
toolkit label: note sur une mention de diffusion ou de distribution @fr
toolkit definition: Note sur une manifestation qui fournit de l’information sur la diffusion ou la distribution d’une manifestation. @fr
toolkit label: nota sobre la declaración de distribución @es
toolkit definition: Una nota sobre manifestación que proporciona información sobre la distribución de una manifestación. @es
label: har anmärkning om distributionsuppgift @sv
toolkit label: anmärkning om distributionsuppgift @sv
toolkit label: noot bij distributievermelding @nl
toolkit definition: Een noot bij manifestatie die informatie verschaft over de distributie van een manifestatie. @nl
label: có ghi chú về thông tin phân phối @vi
definition: Liên kết biểu thị với ghi chú cung cấp chi tiết về địa điểm phân phối, nhà phân phối, hoặc ngày phân phối, hoặc thông tin về thay đổi trong địa điểm phân phối, nhà phân phối, hoặc tên nhà phân phối. @vi
toolkit label: ghi chú về thông tin phân phối @vi
toolkit definition: Ghi chú cung cấp chi tiết về địa điểm phân phối, nhà phân phối, hoặc ngày phân phối, hoặc thông tin về thay đổi trong địa điểm phân phối, nhà phân phối, hoặc tên nhà phân phối. @vi
label: har note om distributionsoplysning @da
definition: Relaterer en manifestation til en note om manifestation, som giver information om distributionen af en manifestation. @da
toolkit label: note om distributionsoplysning @da
toolkit definition: Note om manifestation, som giver information om distributionen af en manifestation. @da
label: hat Anmerkung zur Vertriebsangabe @de
definition: Setzt eine Manifestation in Beziehung zu einer Anmerkung zur Manifestation, die Informationen über den Vertrieb einer Manifestation enthält. @de
toolkit label: Anmerkung zur Vertriebsangabe @de
toolkit definition: Eine Anmerkung zur Manifestation, die Informationen über den Vertrieb einer Manifestation enthält. @de
label: té com a nota sobre menció de distribució @ca
definition: Relaciona una manifestació amb una nota sobre una manifestació que proporciona la informació sobre la distribució d’una manifestació. @ca
toolkit label: nota sobre menció de distribució @ca
toolkit definition: Nota sobre una manifestació que proporciona la informació sobre la distribució d’una manifestació. @ca
definition: Liittää manifestaation huomautukseen, joka sisältää tietoja manifestaation jakelusta. @fi
toolkit label: huomautus jakelumerkinnöstä @fi
toolkit definition: Huomautus, joka sisältää tietoja manifestaation jakelusta. @fi
toolkit label: note om distribusjonangivelse @no
toolkit definition: En note om manifestasjon som gir informasjon om distribusjonen av en manifestasjon. @no
label: έχει σημείωση στη μνεία διάθεσης @el
definition: Συνδέει μια εκδήλωση με μια σημείωση που παρέχει τις λεπτομέρειες για τον τόπο της διάθεσης, τον διαθέτη ή τη χρονολογία της διάθεσης ή τις πληροφορίες για τις αλλαγές σε έναν τόπο διάθεσης, σε έναν διαθέτη ή στο όνομα ενός διαθέτη. @el
toolkit label: σημείωση στη μνεία διάθεσης @el
toolkit definition: Μια σημείωση που παρέχει τις λεπτομέρειες για τον τόπο της διάθεσης, τον διαθέτη ή τη χρονολογία της διάθεσης ή τις πληροφορίες για τις αλλαγές σε έναν τόπο διάθεσης, σε έναν διαθέτη ή στο όνομα ενός διαθέτη. @el
has element type: 6
label: terjesztési közlésről szóló megjegyzése a következő: @hu
definition: Hozzákapcsol egy megjelenési formát egy megjelenési formára tett megjegyzéshez, amely információt nyújt egy megjelenési forma terjesztéséről. @hu
toolkit label: terjesztési közlésről szóló megjegyzése: @hu
toolkit definition: Egy megjelenési formára tett megjegyzés, amely információt nyújt egy megjelenési forma terjesztéséről. @hu
label: huomautus jakelumerkinnöstä @fi
label: har note om distribusjonangivelse @no
definition: Relaterer en manifestasjon til en note om manifestasjon som gir informasjon om distribusjonen av en manifestasjon. @no
label: heeft noot bij distributievermelding @nl
definition: Relateert een manifestatie aan een noot bij manifestatie die informatie verschaft over de distributie van een manifestatie. @nl
label: له تبصرة عن بيان التوزيع @ar
definition: يربط بين تجسيدة وتبصرة عن التجسيدة التي تعطي معلومات عن توزيع تجسيدة. @ar
toolkit label: تبصرة عن بيان التوزيع @ar
toolkit definition: تبصرة عن التجسيدة التي تعطي معلومات عن توزيع تجسيدة. @ar
label: märkus levitamisandmete kohta @et
definition: Seostab kehastuse märkusega, mis sisaldab infot kehastuse levitamise kohta. @et
toolkit label: märkus levitamisandmete kohta @et
toolkit definition: Märkus, mis sisaldab infot kehastuse levitamise kohta. @et
label: ha come nota sulla formulazione di distribuzione @it
definition: Correla una manifestazione a una nota sulla manifestazione che fornisce informazioni sulla distribuzione di una manifestazione. @it
toolkit label: nota sulla formulazione di distribuzione @it
toolkit definition: Nota sulla manifestazione che fornisce informazioni sulla distribuzione di una manifestazione. @it
label: piezīme par izplatīšanas ziņām @lv
definition: Sasaista manifestāciju ar piezīmi par manifetāciju, kurā ir ziņas par manifestācijas izplatīšanu. @lv
toolkit label: piezīme par izplatīšanas ziņām @lv
toolkit definition: Piezīme par manifetāciju, kurā ir ziņas par manifestācijas izplatīšanu. @lv
label: 有关于发行说明的附注 @zh-hans
definition: 将一种载体表现与提供关于载体表现发行信息的关于载体表现的附注关联起来。 @zh-hans
toolkit label: 关于发行说明的附注 @zh-hans
toolkit definition: 提供关于载体表现发行信息的关于载体表现的附注 @zh-hans
label: dağıtım bildirimi hakkında not ile ilişkilidir @tr
definition: Bir gösterimi, gösterimin dağıtımı hakkında bilgi sağlayan gösterime ilişkin bir not ile ilişkilendirir. @tr
toolkit label: dağıtım bildirimine ilişkin not @tr
toolkit definition: Bir gösterimin dağıtımı hakkında bilgi sağlayan gösterim üzerine bir not. @tr
label: tiene nota sobre la declaración de distribución @es

is accompanied by manifestation
status: Published
definition: Relates a manifestation to a manifestation that is a part of the same manifestation as another part manifestation.
type: Property
domain: C10007
sub property of: has related manifestation of manifestation
lexical alias: accompaniedByManifestation.en
toolkit label: accompanied by manifestation
toolkit definition: A manifestation that is a part of the same manifestation as another part manifestation.
label: est accompagné d’une manifestation @fr
definition: Met une manifestation en relation avec une manifestation qui constitue une partie de la même manifestation qu’une autre partie de manifestation. @fr
toolkit label: accompagné d’une manifestation @fr
toolkit definition: Manifestation qui constitue une partie de la même manifestation qu’une autre partie de manifestation. @fr
toolkit label: acompañado por manifestación @es
toolkit definition: Una manifestación que es una parte de la misma manifestación como otra manifestación en parte. @es
instruction number: 24.5
toolkit label: begeleid door manifestatie @nl
toolkit definition: Een manifestatie die uitgevaardigd is met een andere manifestatie, zonder enige relatie met de inhoud daarvan. @nl
label: được kèm theo bởi (biểu thị) @vi
definition: Liên kết biểu thị với biểu thị được công bố với biểu thị khác mà không có bất kỳ mối quan hệ nào về nội dung. @vi
toolkit label: được kèm theo bởi (biểu thị) @vi
toolkit definition: Biểu thị được công bố với biểu thị khác mà không có bất kỳ mối quan hệ nào về nội dung. @vi
label: er ledsaget af manifestation @da
definition: Relaterer en manifestation til en manifestation, som er udgivet med en anden manifestation uden nogen relation til dens indhold. @da
toolkit label: ledsaget af manifestation @da
toolkit definition: Manifestation, som er udgivet med en anden manifestation uden nogen relation til dens indhold. @da
label: ist begleitet von (Manifestation) @de
definition: Setzt eine Manifestation in Beziehung zu einer Manifestation, die mit einer anderen Manifestation, ohne eine Beziehung zu deren Inhalt zu haben, erscheint. @de
toolkit label: Begleitet von (Manifestation) @de
toolkit definition: Eine Manifestation, die mit einer anderen Manifestation, ohne eine Beziehung zu deren Inhalt zu haben, erscheint. @de
label: és acompanyat d’una manifestació @ca
definition: Relaciona una manifestació amb una manifestació que és una part de la mateixa manifestació com una altra manifestació de part. @ca
toolkit label: acompanyat d’una manifestació @ca
toolkit definition: Manifestació que és una part de la mateixa manifestació com una altra manifestació de part. @ca
definition: Liittää manifestaation manifestaatioon, joka on osa samaa manifestaatiota kuin toinen manifestaation osa. @fi
toolkit label: mukana ilmestynyt manifestaatio @fi
toolkit definition: Manifestaatio, joka on osa samaa manifestaatiota kuin toinen manifestaation osa. @fi
toolkit label: ledsaget av manifestasjon @no
toolkit definition: En manifestasjon som er utgitt sammen med en annen manifestasjon, uten noen relasjon til innholdet. @no
label: συνοδεύεται από (εκδήλωση) @el
definition: Συνδέει μια εκδήλωση με μια εκδήλωση που εκδίδεται μαζί με μια άλλη εκδήλωση χωρίς [να έχει] κάποια σχέση με το περιεχόμενό της. @el
toolkit label: συνοδεύεται από (εκδήλωση) @el
toolkit definition: Μια εκδήλωση που εκδίδεται μαζί με μια άλλη εκδήλωση χωρίς [να έχει] κάποια σχέση με το περιεχόμενό της. @el
has element type: 2
label: kísért (megjelenési forma) @hu
definition: Hozzákapcsol egy megjelenési formát egy megjelenési formához, amelyet egy másik megjelenési formával együtt adtak ki, a tartalmához való bármely kapcsolódás nélkül. @hu
toolkit label: kíséri (megjelenési forma) @hu
toolkit definition: Egy megjelenési forma, amelyet egy másik megjelenési formával együtt adtak ki, a tartalmához való bármely kapcsolódás nélkül. @hu
alternative label: accompanying manifestation relationship
alternative label: accompanying expression relationship
alternative label: accompanying work relationship
label: mukana ilmestynyt manifestaatio @fi
label: er ledsaget av manifestasjon @no
definition: Relaterer en manifestasjon til en manifestasjon som er utgitt sammen med en annen manifestasjon, uten noen relasjon til innholdet. @no
label: is begeleid door manifestatie @nl
definition: Relateert een manifestatie aan een manifestatie die uitgevaardigd is met een andere manifestatie, zonder enige relatie met de inhoud daarvan. @nl
label: هو مرفق بتجسيدة @ar
definition: يربط بين تجسيدة وتجسيدة صدرت مع تجسيدة أخرى، بدون أي علاقة بمحتواها. @ar
toolkit label: مرفق بتجسيدة @ar
toolkit definition: تجسيدة صدرت مع تجسيدة أخرى، بدون أي علاقة بمحتواها. @ar
label: kaasasolev kehastus @et
definition: Seostab kehastuse kehastusega, mis on ilmunud koos teise kehastusega, kuid millel pole sellega sisullist seost. @et
toolkit label: kaasasolev kehastus @et
toolkit definition: Kehastus, mis on ilmunud koos teise kehastusega, kuid millel pole sellega sisullist seost. @et
label: è accompagnata da manifestazione @it
definition: Correla una manifestazione a una manifestazione pubblicata congiuntamente a un'altra manifestazione, senza alcuna relazione con il suo contenuto. @it
toolkit label: accompagnata da manifestazione @it
toolkit definition: Manifestazione pubblicata congiuntamente a un'altra manifestazione, senza alcuna relazione con il suo contenuto. @it
label: ir izdots kopā ar manifestāciju @lv
definition: Sasaista manifestāciju ar manifestāciju, kas ir izdota kopā ar citu manifestāciju, kam nav saturiskas saistības. @lv
toolkit label: izdots kopā ar manifestāciju @lv
toolkit definition: Manifestācija, kas ir izdota kopā ar citu manifestāciju, kam nav saturiskas saistības. @lv
alternative label: علاقة عمل مصاحب @ar
alternative label: ledsagende værk-relation @da
alternative label: Begleitende Beziehungen auf Werkebene @de
label: 被载体表现伴随 @zh-hans
definition: 将一种载体表现与作为另一个部分载体表现的同一种载体表现之一部分的一种载体表现关联起来。 @zh-hans
toolkit label: 被载体表现伴随 @zh-hans
toolkit definition: 作为另一个部分载体表现的同一种载体表现之一部分的一种载体表现 @zh-hans
alternative label: 伴随载体表现关系 @zh-hans

has identifier for manifestation
status: Published
definition: Relates a manifestation to a nomen that is an appellation of manifestation that consists of a code, number, or other string, usually independent of natural language and social naming conventions, used to identify a manifestation.
type: Property
domain: C10007
lexical alias: identifierForManifestation.en
instruction number: 2.15
toolkit label: identifier for manifestation
toolkit definition: A nomen that is an appellation of manifestation that consists of a code, number, or other string, usually independent of natural language and social naming conventions, used to identify a manifestation.
label: a pour identifiant de manifestation @fr
definition: Met une manifestation en relation avec un nomen qui est une appellation de manifestation consistant en un code, un nombre ou une autre chaîne, généralement indépendante du langage naturel et des conventions sociales de dénomination, utilisée pour identifier une manifestation. @fr
toolkit label: identifiant de manifestation @fr
toolkit definition: Nomen qui est une appellation de manifestation consistant en un code, un nombre ou une autre chaîne, généralement indépendante du langage naturel et des conventions sociales de dénomination, utilisée pour identifier une manifestation. @fr
toolkit label: identificador para manifestación @es
toolkit definition: Un nomen que es un apelativo de manifestación que consiste en un código, número u otra secuencia, usualmente independiente del lenguaje natural y las convenciones sociales de nomenclatura, utilizado para identificar una manifestación. @es
scope note: An identifier for the manifestation includes registered identifiers from internationally recognized schemes, other identifiers assigned by publishers and others following internally devised schemes, identifiers known as fingerprints constructed by combining groups of characters from specified pages of early printed resources, publisher's numbers for notated music, and plate numbers for notated music.
label: har identifikator för manifestationen @sv
toolkit label: identifikator för manifestationen @sv
toolkit label: identificatie voor manifestatie @nl
toolkit definition: Een nomen dat is een benaming van manifestatie die bestaat uit een code, nummer of andere tekenreeks, meestal onafhankelijk van natuurlijke taal en sociale naamgevingsconventies, gebruikt om een manifestatie te identificeren. @nl
label: có chỉ số nhận dạng của biểu thị @vi
definition: Liên kết biểu thị với chuỗi ký tự liên quan với biểu thị phục vụ để phân biệt một biểu thị với các biểu thị khác. @vi
scope note: Chỉ số nhận dạng của biểu thị bao gồm các chỉ số nhận dạng được đăng ký từ các lược đồ đươc công nhận quốc tế, các chỉ số nhận dạng khác do nhà xuất bản và lược đồ được đưa ra cục bộ, các chỉ số nhận dạng được biết như là dấu vân tay được cấu trúc bởi kết hợp nhóm các ký tự từ các trang được chỉ định của tài nguyên in trước đây, các chỉ số của nhà xuất bản cho âm nhạc ký hiệu, và chỉ số khuôn in cho âm nhạc ký hiệu. @vi
toolkit label: chỉ số nhận dạng của biểu thị @vi
toolkit definition: Chuỗi ký tự liên quan với biểu thị phục vụ để phân biệt một biểu thị với các biểu thị khác. @vi
scope note: Een identificatie voor de manifestatie omvat geregistreerde identificaties van internationaal erkende schema's, andere identificaties toegekend door uitgevers en andere die intern ontworpen schema's volgen, identificaties die bekend staan als vingerafdruk gevormd door het combineren van groepen karakters van specifieke pagina's bij oude drukken, uitgeversnummers voor bladmuziek en plaatnummers voor bladmuziek. @nl
label: har identifikator for manifestationen @da
definition: Relaterer en manifestation til en benævnelse på manifestation, som består af en kode, nummer eller anden streng, ofte uafhængig af normalsprog og navngivningskonventioner brugt til at identificere en manifestation. @da
scope note: Identifikator for manifestationen omfatter registrerede identifikatorer fra internationalt anerkendte skemaer, andre identifikatorer tildelt af udgivere og andre der følger internationale skemaer, identifikatorer kendt som "fingeraftryk" der konstrueres ved at kombinere grupper af tegn fra særskilte sider af tidligt trykte ressourcer, editionsnumre for noteret musik og pladenumre for noteret musik. @da
toolkit label: identifikator for manifestationen @da
toolkit definition: Benævnelse på manifestation, som består af en kode, nummer eller anden streng, sædvanligvis upåvirket af normalsprog og navngivningskonventioner brugt til at identificere et manifestation. @da
label: hat Identifikator für eine Manifestation @de
definition: Setzt eine Manifestation in Beziehung zu einer Bezeichnung für eine Manifestation, die aus einem Code, einer Nummer oder einer anderen Zeichenkette besteht, der/die normalerweise nicht in natürlicher Sprache und unabhängig von den sozialen Benennungskonventionen ist und zur Identifizierung einer Manifestation verwendet wird. @de
scope note: Darunter fallen registrierte Identifikatoren, die international anerkannte Schemas anwenden, sonstige Identifikatoren, die von Verlagen und anderen vergeben werden, die intern festgelegten Schemen folgen, Fingerprints, das heißt Identifikatoren, die durch die Kombination von Zeichen von bestimmten Seiten eines alten Drucks erstellt werden, Noten-Bestellnummern und Druckplattennummern für Noten. @de
toolkit label: Identifikator für eine Manifestation @de
toolkit definition: Eine Bezeichnung für eine Manifestation, die aus einem Code, einer Nummer oder einer anderen Zeichenkette besteht, der/die normalerweise nicht in natürlicher Sprache und unabhängig von den sozialen Benennungskonventionen ist und zur Identifizierung einer Manifestation verwendet wird. @de
label: té com a identificador de manifestació @ca
definition: Relaciona una manifestació amb un nomen que és una apel·lació de manifestació que consisteix en un codi, un número o qualsevol altra cadena, normalment independent del llenguatge natural i de les convencions lingüístiques socials, usada per identificar una manifestació. @ca
scope note: Un identificador de manifestació inclou els identificadors enregistrats segons esquemes reconeguts internacionalment, altres identificadors assignats per editors i altres que segueixen esquemes concebuts internament, els identificadors coneguts com a empremtes elaborats amb la combinació de grups de caràcters obtinguts de pàgines concretes de recursos impresos antics, els números d’editors per a música notada i els números de planxa per a música notada. @ca
toolkit label: identificador de manifestació @ca
toolkit definition: Nomen que és una apel·lació de manifestació que consisteix en un codi, un número o qualsevol altra cadena, normalment independent del llenguatge natural i de les convencions lingüístiques socials, usada per identificar una manifestació. @ca
definition: Liittää manifestaation nomeniin, joka on manifestaation nimitys, joka koostuu koodista, numerosta tm. merkkijonosta ja joka yleensä on luonnollisesta kielestä ja kielen sosiaalisista konventioista riippumaton manifestaation tunnistamiskeino. @fi
toolkit label: manifestaation tunniste @fi
toolkit definition: Nomen, joka on manifestaation nimitys, joka koostuu koodista, numerosta tm. merkkijonosta ja joka yleensä on luonnollisesta kielestä ja kielen sosiaalisista konventioista riippumaton manifestaation tunnistamiskeino. @fi
toolkit label: identifikator for manifestasjon @no
toolkit definition: En betegnelse for manifestasjon som består av en kode, et tall eller annen streng, som regel uavhengig av naturlig språk og sosiale navnekonvensjoner, som brukes for å identifisere en manifestasjon. @no
label: έχει αναγνωριστικό για την εκδήλωση @el
definition: Συνδέει μια εκδήλωση με έναν αλφαριθμητικό χαρακτήρα συνδεδεμένο με μια εκδήλωση που έχει ως σκοπό τη διαφοροποίηση μιας εκδήλωσης από άλλες εκδηλώσεις. @el
scope note: Ένα αναγνωριστικό για την εκδήλωση περιλαμβάνει αναγνωριστικά καταχωρισμένα σε διεθνή αναγνωρισμένα σχήματα, άλλα αναγνωριστικά που ανατίθενται από εκδότες και άλλα τα οποία ακολουθούν επινοημένα εσωτερικά σχήματα, αναγνωριστικά γνωστά ως αποτυπώματα δομημένα από τον συνδυασμό ομάδων χαρακτήρων από συγκεκριμένες σελίδες πρώιμων έντυπων εκδόσεων, αριθμούς εκδοτών για τη μουσική σημειογραφία και αριθμούς μήτρας για τη μουσική σημειογραφία. @el
toolkit label: αναγνωριστικό για την εκδήλωση @el
toolkit definition: Ένας αλφαριθμητικός χαρακτήρας συνδεδεμένος με μια εκδήλωση που έχει ως σκοπό τη διαφοροποίηση μιας εκδήλωσης από άλλες εκδηλώσεις. @el
scope note: Les identifiants de manifestation comprennent les identifiants enregistrés issus de schémas reconnus internationalement, les autres identifiants attribués notamment par des éditeurs suivant des schémas conçus à l’interne, les identifiants connus sous le nom d’empreintes et construits en combinant des groupes de caractères provenant de pages précises d’une ressource imprimée ancienne, les numéros d’éditeur pour la musique notée et les cotages pour la musique notée. @fr
sub property of: has appellation of manifestation
has element type: 3
label: azonosító megjelenési formához a következő: @hu
definition: Hozzákapcsol egy megjelenési formát egy nomenhez, egy megjelenési forma megnevezéséhez, amely egy kód-, szám-, vagy más típusú karakterláncból áll, amely általában független a természetes nyelvektől és társadalmi névkonvencióktól, és egy megjelenési forma azonosítására használják. @hu
scope note: A megjelenési forma azonosítója magába foglalja a nemzetközileg elismert regisztrált rendszereket, más azonosítókat, amelyeket kiadók és mások osztanak ki belsőleg kidolgozott szkémákat követve, ujjlenyomatként ismert azonosítókat, amelyeket korai nyomtatott források meghatározott lapjairól vett karaktercsoportok kombinálásával állítanak elő, a kottázott zenéhez kidolgozott kiadói számozásokat, és kottázott zenéhez rendelt lemezszámokat. @hu
toolkit label: azonosító megjelenési formához: @hu
toolkit definition: Egy nomen, egy megjelenési forma megnevezése, amely egy kód-, szám-, vagy más típusú karakterláncból áll, amely általában független a természetes nyelvektől és társadalmi névkonvencióktól, és egy megjelenési forma azonosítására használják. @hu
sub property of: P00018
scope note: Manifestaation tunniste käsittää tunnettujen kansainvälisten järjestelmien rekisteröidyt tunnisteet, kustantajan antamat tunnisteet, järjestelmien sisäiset tunnisteet ja sormenjälkitunnisteet, jotka muodostetaan vanhojen painettujen aineistojen tiettyjen sivujen merkkiyhdistelmistä, sekä kustantajan antamat numerot ja laatojen numerot nuottiaineistolle. @fi
label: manifestaation tunniste @fi
label: har identifikator for manifestasjon @no
definition: Relaterer en manifestasjon til en betegnelse for manifestasjon som består av en kode, et tall eller annen streng, som regel uavhengig av naturlig språk og sosiale navnekonvensjoner, som brukes for å identifisere en manifestasjon. @no
scope note: En identifikator for manifestasjonen inkluderer registrerte identifikatorer fra internasjonalt anerkjente systemer, andre identifikatorer tilordnet av utgivere og andre som følger internt utviklede systemer, identifikatorer kjent som fingeravtrykk, opprettet ved å kombinere grupper av tegn fra bestemte sider fra eldre, trykte ressurser, edisjonsnummer for nedskrevet musikk og platenummer for nedskrevet musikk. @no
label: heeft identificatie voor manifestatie @nl
definition: Relateert een manifestatie aan een nomen dat is een benaming van manifestatie die bestaat uit een code, nummer of andere tekenreeks, meestal onafhankelijk van natuurlijke taal en sociale naamgevingsconventies, gebruikt om een manifestatie te identificeren. @nl
label: له معرِّف لتجسيدة @ar
definition: يربط بين تجسيدة وتسمية لتجسيدة تتكون من رمز، أو رقم، أو سلسلة تمثيلات أخرى، عادة ما تكون مستقلة عن اللغة الطبيعية وعن التسميات المتعارف عليها اجتماعيًا، وتستخدم لتمييز تجسيدة. @ar
scope note: يشمل معرف التجسيدة المعرفات المسجلة في نظم عالمية معرفة، والمعرفات الأخرى المخصصة من جانب ناشرين، وغيرها من النظم الداخلية المتبعة، ويعرف المعرفات كتمثيلات للبصمات يتم بناؤها من خلال ضم مجموعات من التمثيلات من صفحات محددة من مصادر أوائل المطبوعات، وأرقام الناشرين للموسيقى المدونة، وأرقام اللوحات للموسيقى المدونة. @ar
toolkit label: معرِّف لتجسيدة @ar
toolkit definition: تسمية لتجسيدة تتكون من رمز، أو رقم، أو سلسلة تمثيلات أخرى، عادة ما تكون مستقلة عن اللغة الطبيعية وعن التسميات المتعارف عليها اجتماعيًا، وتستخدم لتمييز تجسيدة. @ar
label: kehastuse identifikaator @et
definition: Seostab kehastuse kehastuse nimetusega, mis koosneb kehastust identifitseerivast koodist, numbrist või muust loomulikust keelest ja üldtuntud nimetamistavadest sõltumatust stringist. @et
scope note: Kehastuse identifikaator hõlmab rahvusvahelistes tunnustatud süsteemides registreeritud identifikaatoreid, kirjastajate ja teiste antud identifikaatoreid sisekasutuseks väljatöötatud süsteemidest, fingerprint-identifikaatoreid, mis on moodustatud varatrükise kindlatest kohtadest saadud märkidest, nootide kirjastajanumbreid ja trükiplaadinumbreid. @et
toolkit label: kehastuse identifikaator @et
toolkit definition: Kehastuse nimetus, mis koosneb kehastust identifitseerivast koodist, numbrist või muust loomulikust keelest ja üldtuntud nimetamistavadest sõltumatust stringist. @et
label: ha come identificatore per la manifestazione @it
definition: Correla una manifestazione a una denominazione di manifestazione che consiste in un codice, numero, o altra stringa, solitamente indipendente dal linguaggio naturale e dalle convenzioni sociali di denominazione, usata per identificare una manifestazione. @it
scope note: Un identificatore per la manifestazione comprende identificatori registrati da schemi riconosciuti a livello internazionale, altri identificatori assegnati da editori e da altri che seguono i loro schemi concepiti internamente, identificatori noti come impronte (cioè identificatori costruiti combinando gruppi di caratteri da pagine specifiche di risorse antiche a stampa), numeri dell'editore e di lastra per la musica notata. @it

is manifestation reviewed by
status: Published
type: Property
definition: Relates a manifestation to a work that is a brief evaluation of a manifestation.
domain: C10007
toolkit label: manifestation reviewed by
toolkit definition: A work that is a brief evaluation of a manifestation.
label: est une manifestation recensée par @fr
definition: Met une manifestation en relation avec une œuvre qui consiste en une brève évaluation d’une manifestation. @fr
toolkit label: manifestation recensée par @fr
toolkit definition: Œuvre qui consiste en une brève évaluation d’une manifestation. @fr
toolkit label: manifestación revisada por @es
toolkit definition: Una obra que es una breve evaluación de una manifestación. @es
instruction number: 23.5
toolkit label: manifestatie gerecenseerd door @nl
toolkit definition: Een werk dat is een korte evaluatie van een manifestatie. @nl
label: được tổng quan trong (biểu thị) @vi
definition: Liên kết biểu thị với tác phẩm có chứa đánh giá vắn tắt về biểu thị đang được mô tả. @vi
toolkit label: được tổng quan trong (biểu thị) @vi
toolkit definition: Tác phẩm có chứa đánh giá vắn tắt về biểu thị đang được mô tả. @vi
label: er manifestation anmeldt i @da
definition: Relaterer en manifestation til et værk, som indeholder en kort kritik af en manifestation. @da
toolkit label: er manifestation anmeldt i @da
toolkit definition: Værk, som indeholder en kort kritik af en manifestation. @da
label: ist Manifestation rezensiert in @de
definition: Setzt eine Manifestation in Beziehung zu einem Werk, bei dem es sich um eine kurze Untersuchung einer Manifestation handelt. @de
toolkit label: Manifestation rezensiert in @de
toolkit definition: Ein Werk, bei dem es sich um eine kurze Untersuchung einer Manifestation handelt. @de
label: és manifestació revisada per @ca
definition: Relaciona una manifestació amb una obra que és una avaluació breu d’una manifestació. @ca
toolkit label: manifestació revisada per @ca
toolkit definition: Obra que és una avaluació breu d’una manifestació. @ca
definition: Liittää manifestaation teokseen, joka on lyhyt arvostelu manifestaatiosta. @fi
toolkit label: manifestaation arvostelu @fi
toolkit definition: Teos, joka on lyhyt arvostelu manifestaatiosta. @fi
toolkit label: manifestasjon anmeldt i @no
toolkit definition: Et verk som inneholder en kortfattet evaluering av en manifestasjon. @no
label: εξετάζεται στην (εκδήλωση) @el
definition: Συνδέει μια εκδήλωση με ένα έργο που περιέχει μια σύντομη αξιολόγηση μιας περιγραφόμενης εκδήλωσης. @el
toolkit label: εξετάζεται στην (εκδήλωση) @el
toolkit definition: Ένα έργο που περιέχει μια σύντομη αξιολόγηση μιας περιγραφόμενης εκδήλωσης. @el
has element type: 2
alternative label: reviewed in (manifestation)
label: megjelenési forma szemlézve a következőben: @hu
definition: Hozzákapcsol egy megjelenési formát egy műhöz, amely egy megjelenési forma rövid értékelése. @hu
toolkit label: megjelenési forma szemlézve a következőben: @hu
toolkit definition: Egy mű, amely egy megjelenési forma rövid értékelése. @hu
label: manifestaation arvostelu @fi
label: er manifestasjon anmeldt i @no
definition: Relaterer en manifestasjon til et verk som inneholder en kortfattet evaluering av en manifestasjon. @no
alternative label: anmeldt i (manifestasjon) @no
label: is manifestatie gerecenseerd door @nl
definition: Relateert een manifestatie aan een werk dat is een korte evaluatie van een manifestatie. @nl
label: هو تجسيدة مراجعة في @ar
definition: يربط بين تجسيدة وعمل يحتوي على تقييم مختصر لتجسيدة. @ar
alternative label: تم مراجعته في (تجسيدة) @ar
toolkit label: تجسيدة مراجعة في @ar
toolkit definition: عمل يحتوي على تقييم مختصر لتجسيدة. @ar
alternative label: revisat en (manifestació) @ca
alternative label: anmeldt i (manifestation) @da
label: kehastuse ülevaade @et
definition: Seostab kehastuse teosega, mis sisaldab lühikest hinnangut kehastusele. @et
toolkit label: kehastuse ülevaade @et
toolkit definition: Teos, mis sisaldab lühikest hinnangut kehastusele. @et
alternative label: Rezensiert in (Manifestation) @de
alternative label: szemlézve a következőben (megjelenési forma): @hu
label: è manifestazione recensita in @it
definition: Correla una manifestazione a un'opera che contiene una breve valutazione di una manifestazione. @it
alternative label: recensita in (manifestazione) @it
toolkit label: manifestazione recensita in @it
toolkit definition: Opera che contiene una breve valutazione di una manifestazione. @it
sub property of: is manifestation evaluated by
lexical alias: manifestationReviewedBy.en
label: ir manifestācijas recenzija @lv
definition: Sasaista manifestāciju ar darbu, kas satur īsu aprakstītās manifestācijas novērtējumu. @lv
toolkit label: manifestācijas recenzija @lv
toolkit definition: Darbs, kas satur īsu aprakstītās manifestācijas novērtējumu @lv
alternative label: 被评论于（载体表现） @zh-hans
label: 是被……评论的载体表现 @zh-hans
definition: 将一种载体表现与作为一种载体表现之简要评价的一种作品关联起来。 @zh-hans
toolkit label: 被……评论的载体表现 @zh-hans

is manifestation critiqued by
status: Published
type: Property
definition: Relates a manifestation to a work that is a critical evaluation of a manifestation.
domain: C10007
toolkit label: manifestation critiqued by
toolkit definition: A work that is a critical evaluation of a manifestation.
label: est une manifestation critiquée par @fr
definition: Met une manifestation en relation avec une œuvre qui consiste en une évaluation critique d’une manifestation. @fr
toolkit label: manifestation critiquée par @fr
toolkit definition: Œuvre qui consiste en une évaluation critique d’une manifestation. @fr
toolkit label: manifestación criticada por @es
toolkit definition: Una obra que es una evaluación crítica de una manifestación. @es
instruction number: 23.5
toolkit label: manifestatie bekritiseerd door @nl
toolkit definition: Een werk dat is een kritische evaluatie van een manifestatie. @nl
label: được phê bình trong (biểu thị) @vi
definition: Liên kết biểu thị với tác phẩm có chứa đánh giá phê bình về biểu thị được mô tả. @vi
toolkit label: được phê bình trong (biểu thị) @vi
toolkit definition: Tác phẩm có chứa đánh giá phê bình về biểu thị được mô tả. @vi
label: er manifestation kritiseret i @da
definition: Relaterer en manifestation til et værk, som indeholder en kritisk vurdering af en manifestation. @da
toolkit label: manifestation kritiseret i @da
toolkit definition: Værk, som indeholder en kritisk vurdering af en manifestation. @da
label: ist Kritik einer Manifestation in @de
definition: Setzt eine Manifestation in Beziehung zu einem Werk, bei dem es sich um eine kritische Untersuchung einer Manifestation handelt. @de
toolkit label: Kritik einer Manifestation in @de
toolkit definition: Ein Werk, bei dem es sich um eine kritische Untersuchung einer Manifestation handelt. @de
label: és manifestació criticada per @ca
definition: Relaciona una manifestació amb una obra que és una avaluació crítica d’una manifestació. @ca
toolkit label: manifestació criticada per @ca
toolkit definition: Obra que és una avaluació crítica d’una manifestació. @ca
definition: Liittää manifestaation teokseen, joka on kriittinen arviointi manifestaatiosta. @fi
toolkit label: manifestaation kritiikki @fi
toolkit definition: Teos, joka on kriittinen arviointi manifestaatiosta. @fi
toolkit label: manifestasjon kritisert i @no
toolkit definition: Et verk som inneholder en kritisk evaluering av en manifestasjon. @no
label: κρίνεται στην (εκδήλωση) @el
definition: Συνδέει μια εκδήλωση με ένα έργο που περιέχει μια κριτική αξιολόγηση μιας περιγραφόμενης εκδήλωσης. @el
toolkit label: κρίνεται στην (εκδήλωση) @el
toolkit definition: Ένα έργο που περιέχει μια κριτική αξιολόγηση μιας περιγραφόμενης εκδήλωσης. @el
has element type: 2
alternative label: critiqued in (manifestation)
label: megjelenési forma bírálva a következőben: @hu
definition: Hozzákapcsol egy megjelenési formát egy műhöz, amely egy megjelenési forma kritikai értékelése. @hu
toolkit label: megjelenési forma bírálva a következőben: @hu
toolkit definition: Egy mű, amely egy megjelenési forma kritikai értékelése. @hu
label: manifestaation kritiikki @fi
label: er manifestasjon kritisert i @no
definition: Relaterer en manifestasjon til et verk som inneholder en kritisk evaluering av en manifestasjon. @no
alternative label: kritikk i (manifestasjon) @no
label: is manifestatie bekritiseerd door @nl
definition: Relateert een manifestatie aan een werk dat is een kritische evaluatie van een manifestatie. @nl
label: هو تجسيدة منتقدة في @ar
definition: يربط بين تجسيدة وعمل يحتوي على تقييم نقدي لتجسيدة. @ar
alternative label: تم نقده في (تجسيدة) @ar
toolkit label: تجسيدة منتقدة في @ar
toolkit definition: عمل يحتوي على تقييم نقدي لتجسيدة. @ar
alternative label: criticat en (manifestació) @ca
alternative label: er kritiseret i (manifestation) @da
label: kehastuse arvustus @et
definition: Seostab kehastuse teosega, mis sisaldab kriitilist hinnangut kehastusele. @et
toolkit label: kehastuse arvustus @et
toolkit definition: Teos, mis sisaldab kriitilist hinnangut kehastusele. @et
alternative label: Kritik in (Manifestation) @de
alternative label: bírálva a következőben (megjelenési forma): @hu
label: è manifestazione criticata in @it
definition: Correla una manifestazione a un'opera che contiene una valutazione critica di una manifestazione. @it
alternative label: criticata in (manifestazione) @it
toolkit label: manifestazione criticata in @it
toolkit definition: Opera che contiene una valutazione critica di una manifestazione. @it
sub property of: is manifestation evaluated by
lexical alias: manifestationCritiquedBy.en
label: ir manifestācijas kritika @lv
definition: Sasaista manifestāciju ar darbu, kas satur aprakstītās manifestācijas kritisku novērtējumu. @lv
toolkit label: manifestācijas kritika @lv
toolkit definition: Darbs, kas satur aprakstītās manifestācijas kritisku novērtējumu. @lv
alternative label: 被批评于（载体表现） @zh-hans
label: 是被……批评的载体表现 @zh-hans
definition: 将一种载体表现与作为一种载体表现之批评性评价的一种作品关联起来。 @zh-hans
toolkit label: 被……批评的载体表现 @zh-hans

is manifestation analysed in
status: Published
type: Property
lexical alias: manifestationAnalysedIn.en
definition: Relates a manifestation to a work that describes the structure and composition of a manifestation.
domain: C10007
toolkit label: manifestation analysed in
toolkit definition: A work that describes the structure and composition of a manifestation.
label: est une manifestation analysée dans @fr
definition: Met une manifestation en relation avec une œuvre qui décrit la structure et la composition d’une manifestation. @fr
toolkit label: manifestation analysée dans @fr
toolkit definition: Œuvre qui décrit la structure et la composition d’une manifestation. @fr
toolkit label: manifestación analizada en @es
toolkit definition: Una obra que describe la estructura y composición de una manifestación. @es
sub property of: is manifestation described by
instruction number: 23.5
toolkit label: manifestatie geanalyseerd in @nl
toolkit definition: Een werk dat de bronmanifestatie onderzoekt om de onderdelen en hun relaties te kunnen identificeren. @nl
label: được phân tích trong (biểu thị) @vi
definition: Liên kết biểu thị với tác phẩm kiểm tra biểu thị nguồn để nhận dạng các bộ phận cấu hành của nó và mối quan hệ của chúng. @vi
toolkit label: được phân tích trong (biểu thị) @vi
toolkit definition: Tác phẩm kiểm tra biểu thị nguồn để nhận dạng các bộ phận cấu hành của nó và mối quan hệ của chúng. @vi
label: er manifestation analyseret i @da
definition: Relaterer en manifestation til et værk, som beskriver strukturen og kompositionen af en manifestation. @da
toolkit label: manifestation analyseret i @da
toolkit definition: Værk, som beskriver strukturen og kompositionen af en manifestation. @da
label: ist Manifestation analysiert in @de
definition: Setzt eine Manifestation in Beziehung zu einem Werk, das den Aufbau und die Zusammensetzung einer Manifestation beschreibt. @de
toolkit label: Manifestation analysiert in @de
toolkit definition: Ein Werk, das den Aufbau und die Zusammensetzung einer Manifestation beschreibt. @de
label: és manifestació analitzada en @ca
definition: Relaciona una manifestació amb una obra que descriu l’estructura i la composició d’una manifestació. @ca
toolkit label: manifestació analitzada en @ca
toolkit definition: Obra que descriu l’estructura i la composició d’una manifestació. @ca
definition: Liittää manifestaation teokseen, joka kuvaa manifestaation rakennetta ja luonnetta. @fi
toolkit label: manifestaation analyysi @fi
toolkit definition: Teos, joka kuvaa manifestaation rakennetta ja luonnetta. @fi
toolkit label: manifestasjon analysert i @no
toolkit definition: Et verk som beskriver strukturen og komposisjonen av en manifestasjon. @no
label: αναλύεται στην (εκδήλωση) @el
definition: Συνδέει μια εκδήλωση με ένα έργο που εξετάζει μια εκδήλωση-πηγή για την ταύτιση των συστατικών της και των σχέσεών τους. @el
toolkit label: αναλύεται στην (εκδήλωση) @el
toolkit definition: Ένα έργο που εξετάζει μια εκδήλωση-πηγή για την ταύτιση των συστατικών της και των σχέσεών τους. @el
has element type: 2
alternative label: analysed in (manifestation)
label: megjelenési forma elemezve a következőben: @hu
definition: Hozzákapcsol egy megjelenési formát egy műhöz, amely leírja egy megjelenési forma alkotóelemeit és azok viszonyait. @hu
toolkit label: megjelenési forma elemezve a következőben: @hu
toolkit definition: Egy mű, amely leírja egy megjelenési forma alkotóelemeit és azok viszonyait. @hu
label: manifestaation analyysi @fi
label: er manifestasjon analysert i @no
definition: Relaterer en manifestasjon til et verk som beskriver strukturen og komposisjonen av en manifestasjon. @no
alternative label: analysert i (manifestasjon) @no
alternative label: analysé dans (manifestation) @fr
label: is manifestatie geanalyseerd in @nl
definition: Relateert een manifestatie aan een werk dat de bronmanifestatie onderzoekt om de onderdelen en hun relaties te kunnen identificeren. @nl
label: هو تجسيدة محللة في @ar
definition: يربط بين تجسيدة وعمل يصف هيكل وتكوين تجسيدة. @ar
alternative label: تم تحليله في (تجسيدة) @ar
toolkit label: تجسيدة محللة في @ar
toolkit definition: عمل يصف هيكل وتكوين تجسيدة. @ar
alternative label: analitzat en (manifestació) @ca
alternative label: analyseret i (manifestation) @da
label: kehastuse analüüs @et
definition: Seostab kehastuse teosega, milles kirjeldatakse kehastuse struktuuri ja kompositsiooni. @et
toolkit label: kehastuse analüüs @et
toolkit definition: Teos, milles kirjeldatakse kehastuse struktuuri ja kompositsiooni. @et
alternative label: Analysiert in (Manifestation) @de
alternative label: elemezve a következőben (megjelenési forma): @hu
label: è manifestazione analizzata in @it
definition: Correla una manifestazione a un'opera che descrive la struttura e composizione di una manifestazione. @it
alternative label: analizzata in (manifestazione) @it
toolkit label: manifestazione analizzata in @it
toolkit definition: Opera che descrive la struttura e composizione di una manifestazione. @it
label: ir manifestācijas analīze @lv
definition: Sasaista manifestāciju ar darbu, kas analizē pamatmanifestācijas sastāvdaļas un to attiecības. @lv
toolkit label: manifestācijas analīze @lv
toolkit definition: Darbs, kas analizē pamatmanifestācijas sastāvdaļas un to attiecības. @lv
alternative label: 被分析于（载体表现） @zh-hans
label: 是被分析于……的载体表现 @zh-hans
toolkit label: 被分析于……的载体表现 @zh-hans

is manifestation evaluated by
status: Published
type: Property
definition: Relates a manifestation to a work that is an examination or judgement of a manifestation.
domain: C10007
toolkit label: manifestation evaluated by
toolkit definition: A work that is an examination or judgement of a manifestation.
label: est une manifestation évaluée par @fr
definition: Met une manifestation en relation avec une œuvre qui consiste en un examen ou en un jugement d’une manifestation. @fr
toolkit label: manifestation évaluée par @fr
toolkit definition: Œuvre qui consiste en un examen ou en un jugement d’une manifestation. @fr
toolkit label: manifestación evaluada por @es
toolkit definition: Una obra que es un examen o juicio de una manifestación. @es
instruction number: 23.5
toolkit label: manifestatie beschouwd door @nl
toolkit definition: Een werk dat een onderzoek of beoordeling is van een manifestatie. @nl
label: được đánh giá trong (biểu thị) @vi
definition: Liên kết biểu thị với tác phẩm kiểm tra hoặc đánh giá biểu thị đang được mô tả. @vi
toolkit label: được đánh giá trong (biểu thị) @vi
toolkit definition: Tác phẩm kiểm tra hoặc đánh giá biểu thị đang được mô tả. @vi
label: er manifestation evalueret i @da
definition: Relaterer en manifestation til et værk, som undersøger eller bedømmer en manifestation. @da
toolkit label: manifestation evalueret i @da
toolkit definition: Værk, som undersøger eller bedømmer en manifestation. @da
label: ist Manifestation evaluiert in @de
definition: Setzt eine Manifestation in Beziehung zu einem Werk, das eine Manifestation untersucht oder beurteilt. @de
toolkit label: Manifestation evaluiert in @de
toolkit definition: Ein Werk, das eine Manifestation untersucht oder beurteilt. @de
label: és manifestació avaluada per @ca
definition: Relaciona una manifestació amb una obra que és un examen o un judici d’una manifestació. @ca
toolkit label: manifestació avaluada per @ca
toolkit definition: Obra que és un examen o un judici d’una manifestació. @ca
definition: Liittää manifestaation teokseen, joka sisältää tutkivan arvioinnin ja arvostelun manifestaatiosta. @fi
toolkit label: manifestaation arviointi @fi
toolkit definition: Teos, joka sisältää tutkivan arvioinnin ja arvostelun manifestaatiosta. @fi
toolkit label: manifestasjon evaluert i @no
toolkit definition: Et verk som utforsker eller vurderer en manifestasjon. @no
label: αξιολογείται στην (εκδήλωση) @el
definition: Συνδέει μια εκδήλωση με ένα έργο που εξετάζει ή κρίνει μια περιγραφόμενη εκδήλωση. @el
toolkit label: αξιολογείται στην (εκδήλωση) @el
toolkit definition: Ένα έργο που εξετάζει ή κρίνει μια περιγραφόμενη εκδήλωση. @el
has element type: 2
alternative label: evaluated in (manifestation)
label: megjelenési forma értékelve a következőben: @hu
definition: Hozzákapcsol egy megjelenési formát egy műhöz, amely egy megjelenési formát vizsgál és ítél meg. @hu
toolkit label: megjelenési forma értékelve a következőben: @hu
toolkit definition: Egy mű, amely egy megjelenési formát vizsgál és ítél meg. @hu
label: manifestaation arviointi @fi
label: er manifestasjon evaluert i @no
definition: Relaterer en manifestasjon til et verk som utforsker eller vurderer en manifestasjon. @no
alternative label: evaluert i (manifestasjon) @no
label: is manifestatie beschouwd door @nl
definition: Relateert een manifestatie aan een werk dat een onderzoek of beoordeling is van een manifestatie. @nl
label: هو تجسيدة مقيمة في @ar
definition: يربط بين تجسيدة وعمل يختبر أو يحكم على تجسيدة. @ar
alternative label: تم تقييمه في (تجسيدة) @ar
toolkit label: تجسيدة مقيمة في @ar
toolkit definition: عمل يختبر أو يحكم على تجسيدة. @ar
alternative label: avaluat en (manifestació) @ca
alternative label: evalueret i (manifestation) @da
label: kehastuse hinnang @et
definition: Seostab kehastuse teosega, milles kontrollitakse või hinnatakse kehastust. @et
toolkit label: kehastuse hinnang @et
toolkit definition: Teos, milles kontrollitakse või hinnatakse kehastust. @et
alternative label: Evaluiert in (Manifestation) @de
alternative label: értékelve a következőben (megjelenési forma): @hu
label: è manifestazione valutata in @it
definition: Correla una manifestazione a un'opera che esamina o giudica una manifestazione. @it
alternative label: valutata in (manifestazione) @it
toolkit label: manifestazione valutata in @it
toolkit definition: Opera che esamina o giudica una manifestazione. @it
sub property of: is subject manifestation of
lexical alias: manifestationEvaluatedBy.en
label: ir manifestācijas novērtējums @lv
definition: Sasaista manifestāciju ar darbu, kas analizē vai novērtē konkrēto manifestāciju. @lv
toolkit label: manifestācijas novērtējums @lv
toolkit definition: Darbs, kas analizē vai novērtē konkrēto manifestāciju. @lv
alternative label: 被评价于（载体表现） @zh-hans
label: 是被……评价的载体表现 @zh-hans
definition: 将一种载体表现与作为一种载体表现之检查和判断的一种作品关联起来。 @zh-hans
toolkit label: 被……评价的载体表现 @zh-hans

is manifestation described by
status: Published
type: Property
definition: Relates a manifestation to a work that is a description of a manifestation.
domain: C10007
toolkit label: manifestation described by
toolkit definition: A work that is a description of a manifestation.
label: est une manifestation décrite par @fr
definition: Met une manifestation en relation avec une œuvre qui consiste en une description d’une manifestation. @fr
toolkit label: manifestation décrite par @fr
toolkit definition: Œuvre qui consiste en une description d’une manifestation. @fr
toolkit label: manifestación descrita por @es
toolkit definition: Una obra que es una descripción de una manifestación. @es
sub property of: is subject manifestation of
instruction number: 23.5
toolkit label: manifestatie beschreven door @nl
toolkit definition: Een werk dat is een beschrijving van een manifestatie. @nl
label: được mô tả trong (biểu thị) @vi
definition: Liên kết biểu thị với tác phẩm mô tả biểu thị được mô tả. @vi
toolkit label: được mô tả trong (biểu thị) @vi
toolkit definition: Tác phẩm mô tả biểu thị được mô tả. @vi
label: er manifestation beskrevet i @da
definition: Relaterer en manifestation til et værk, som beskriver en manifestation. @da
toolkit label: manifestation beskrevet i @da
toolkit definition: Værk, som beskriver en manifestation. @da
label: ist Manifestation beschrieben in @de
definition: Setzt eine Manifestation in Beziehung zu einem Werk, das eine Manifestation beschreibt. @de
toolkit label: Manifestation beschrieben in @de
toolkit definition: Ein Werk, das eine Manifestation beschreibt. @de
label: és manifestació descrita per @ca
definition: Relaciona una manifestació amb una obra que és una descripció d’una manifestació. @ca
toolkit label: manifestació descrita per @ca
toolkit definition: Obra que és una descripció d’una manifestació. @ca
definition: Liittää manifestaation teokseen, joka kuvaa manifestaatiota. @fi
toolkit label: manifestaatiota kuvaava teos @fi
toolkit definition: Teos, joka kuvaa manifestaatiota. @fi
toolkit label: manifestasjon beskrevet i @no
toolkit definition: Et verk som beskriver en manifestasjon. @no
label: περιγράφεται στην (εκδήλωση) @el
definition: Συνδέει μια εκδήλωση με ένα έργο που περιγράφει μια περιγραφόμενη εκδήλωση. @el
toolkit label: περιγράφεται στην (εκδήλωση) @el
toolkit definition: Ένα έργο που περιγράφει μια περιγραφόμενη εκδήλωση. @el
has element type: 2
alternative label: described in (manifestation)
label: megjelenési forma leírva a következőben: @hu
definition: Hozzákapcsol egy megjelenési formát egy műhöz, amely egy megjelenési formát ír le. @hu
toolkit label: megjelenési forma leírva a következőben: @hu
toolkit definition: Egy mű, amely egy megjelenési formát ír le. @hu
alternative label: manifestaation kuvaus @fi
label: manifestaatiota kuvaava teos @fi
label: er manifestasjon beskrevet i @no
definition: Relaterer en manifestasjon til et verk som beskriver en manifestasjon. @no
alternative label: beskrives i (manifestasjon) @no
label: is manifestatie beschreven door @nl
definition: Relateert een manifestatie aan een werk dat is een beschrijving van een manifestatie. @nl
label: هو تجسيدة موصوفة في @ar
definition: يربط بين تجسيدة وعمل يصف تجسيدة. @ar
alternative label: موصوف في (تجسيدة) @ar
toolkit label: تجسيدة موصوفة في @ar
toolkit definition: عمل يصف تجسيدة. @ar
alternative label: descrit en (manifestació) @ca
alternative label: beskrevet i (manifestation) @da
label: kehastuse kirjeldus @et
definition: Seostab kehastuse teosega, mis kirjeldab kehastust. @et
toolkit label: kehastuse kirjeldus @et
toolkit definition: Teos, mis kirjeldab kehastust. @et
alternative label: Beschrieben in (Manifestation) @de
alternative label: leírva a következőben (megjelenési forma): @hu
label: è manifestazione descritta in @it
definition: Correla una manifestazione a un'opera che descrive una manifestazione. @it
alternative label: descritta in (manifestazione) @it
toolkit label: manifestazione descritta in @it
toolkit definition: Opera che descrive una manifestazione. @it
lexical alias: manifestationDescribedBy.en
label: ir manifestācijas apraksts @lv
definition: Sasaista manifestāciju ar darbu, kurā aprakstīta konkrētā manifestācija. @lv
toolkit label: manifestācijas apraksts @lv
toolkit definition: Darbs, kurā aprakstīta konkrētā manifestācija. @lv
alternative label: 被描述于（载体表现） @zh-hans
label: 是被……描述的载体表现 @zh-hans
toolkit label: 被……描述的载体表现 @zh-hans

has restriction on use of manifestation
status: Published
definition: Relates a manifestation to a limitation placed on reproduction, publication, exhibition, etc., of a manifestation.
type: Property
domain: C10007
lexical alias: restrictionOnUseOfManifestation.en
instruction number: 4.5
toolkit label: restriction on use of manifestation
toolkit definition: A limitation placed on reproduction, publication, exhibition, etc., of a manifestation.
label: a pour restriction d’usage d’une manifestation @fr
definition: Met une manifestation en relation avec une limitation imposée sur la reproduction, la publication, l’exposition, etc. d’une manifestation. @fr
toolkit label: restriction d’usage d’une manifestation @fr
toolkit definition: Limitation imposée sur la reproduction, la publication, l’exposition, etc. d’une manifestation. @fr
toolkit label: restricción en el uso de la manifestación @es
toolkit definition: Una limitación impuesta a la reproducción, publicación, exhibición, etc., de una manifestación. @es
label: har användningsrestriktioner @sv
toolkit label: användningsrestriktioner @sv
toolkit label: beperking op het gebruik van manifestatie @nl
toolkit definition: Een beperking geplaatst op de reproductie, publicatie, tentoonstelling, etc. van een manifestatie. @nl
label: có hạn chế về sử dụng biểu thị @vi
definition: Liên kết biểu thị với giới hạn được đặt ra về sản xuất lại, xuất bản, triển lãm, v.v..., biểu thị @vi
toolkit label: hạn chế về sử dụng biểu thị @vi
toolkit definition: Giới hạn được đặt ra về sản xuất lại, xuất bản, triển lãm, v.v..., biểu thị @vi
label: har restriktion på brug af manifestation @da
definition: Relaterer en manifestation til en begrænsning af reproduktion, publicering, udstilling etc. af en manifestation. @da
toolkit label: restriktion på brug af manifestation @da
toolkit definition: Begrænsning af reproduktion, publicering, udstilling etc. af en manifestation @da
label: hat Benutzungsbeschränkung einer Manifestation @de
definition: Setzt eine Manifestation in Beziehung zu einer Beschränkung der Verwendungsart einer Manifestation, wie zum Beispiel Reproduktion, Veröffentlichung, Ausstellung und so weiter. @de
toolkit label: Benutzungsbeschränkung einer Manifestation @de
toolkit definition: Eine Beschränkung der Verwendungsart einer Manifestation, wie zum Beispiel Reproduktion, Veröffentlichung, Ausstellung und so weiter. @de
label: té com a restricció d’ús d’una manifestació @ca
definition: Relaciona una manifestació amb una limitació imposada sobre la reproducció, la publicació, l’exposició, etc., d’una manifestació. @ca
toolkit label: restricció d’ús d’una manifestació @ca
toolkit definition: Limitació imposada sobre la reproducció, la publicació, l’exposició, etc., d’una manifestació. @ca
definition: Liittää manifestaation manifestaation käyttörajoituksiin koskien esim. kopiointia, julkaisemista tai esille asettamista. @fi
toolkit label: manifestaation käyttöehdot @fi
toolkit definition: Manifestaation käyttörajoitukset koskien esim. kopiointia, julkaisemista tai esille asettamista. @fi
toolkit label: restriksjoner for bruk av manifestasjon @no
toolkit definition: En begrensning for reproduksjon, utgivelse, utstilling etc. av en manifestasjon. @no
label: έχει περιορισμό της χρήσης της εκδήλωσης @el
definition: Συνδέει μια εκδήλωση με έναν περιορισμό που ανατίθεται σε μια αναπαραγωγή, μια δημοσίευση, μια έκθεση κ.λπ. μιας εκδήλωσης. @el
toolkit label: περιορισμός της χρήσης της εκδήλωσης @el
toolkit definition: Ένας περιορισμός που ανατίθεται σε μια αναπαραγωγή, μια δημοσίευση, μια έκθεση κ.λπ. μιας εκδήλωσης. @el
label: van megjelenési forma használatához rendelt korlátozása @hu
definition: Hozzákapcsol egy megjelenési formát egy korlátozáshoz, amelyet egy megjelenési forma másolásához, publikálásához, kiállításához stb. rendelnek. @hu
toolkit label: korlátozás megjelenési forma használatához @hu
toolkit definition: Egy korlátozás, amelyet egy megjelenési forma másolásához, publikálásához, kiállításához stb. rendelnek. @hu
label: manifestaation käyttöehdot @fi
label: har restriksjoner for bruk av manifestasjon @no
definition: Relaterer en manifestasjon til en begrensning for reproduksjon, utgivelse, utstilling etc. av en manifestasjon. @no
label: heeft beperking op gebruik van manifestatie @nl
definition: Relateert een manifestatie aan een beperking geplaatst op de reproductie, publicatie, tentoonstelling, etc. van een manifestatie. @nl
label: له تقييد على استخدام تجسيدة @ar
definition: يربط بين تجسيدة وقيود وفقًا للمكان تتعلق باستنساخ، ونشر، وعرض، إلخ. لتجسيدة. @ar
toolkit label: تقييد على استخدام تجسيدة @ar
toolkit definition: قيود وفقًا للمكان تتعلق باستنساخ، ونشر، وعرض، إلخ. لتجسيدة. @ar
label: kehastuse kasutuspiirang @et
definition: Seostab kehastuse piiranguga, mis on kehtestatud kehastuse reprodutseerimisele, avaldamisele, eksponeerimisele jms. @et
toolkit label: kehastuse kasutuspiirang @et
toolkit definition: Piirang, mis on kehtestatud kehastuse reprodutseerimisele, avaldamisele, eksponeerimisele jms. @et
label: ha come limitazioni d'uso di una manifestazione @it
definition: Correla una manifestazione a restrizioni poste alla riproduzione, pubblicazione, esposizione, etc. di una manifstazione. @it
toolkit label: limitazioni d'uso di una manifestazione @it
toolkit definition: Restrizioni poste alla riproduzione, pubblicazione, esposizione, etc. di una manifstazione. @it
label: manifestācijas izmantošanas ierobežojums @lv
definition: Sasaista manifestāciju ar manifestācijas izmantošanas ierobežojumiem pavairošanā, izgatavošanā, izrādīšanā u.tml. @lv
toolkit label: manifestācijas izmantošanas ierobežojums @lv
toolkit definition: Manifestācijas izmantošanas ierobežojumi pavairošanā, izgatavošanā, izrādīšanā u.tml. @lv
has element type: 5
label: 有关于载体表现使用的限制 @zh-hans
definition: 将一种载体表现与对一种载体表现的复制、出版、展览等施加的限制关联起来。 @zh-hans
toolkit label: 关于载体表现使用的限制 @zh-hans
toolkit definition: 对一种载体表现的复制、出版、展览等施加的限制 @zh-hans
label: gösterimin kullanım kısıtlaması ile ilişkilidir @tr
definition: Bir gösterimi, bir gösterimin çoğaltılmasına, yayınlanmasına, sergilenmesine vb. konulan bir sınırlamayla ilişkilendirir. @tr
toolkit label: gösterimin kullanımına ilişkin kısıtlama @tr
toolkit definition: Bir gösterimin çoğaltılmasına, yayınlanmasına, sergilenmesine vb. getirilen bir sınırlama. @tr
label: tiene restricción en el uso de la manifestación @es
definition: Relaciona una manifestación con una limitación impuesta a la reproducción, publicación, exhibición, etc., de una manifestación. @es

has restriction on access to manifestation
status: Published
definition: Relates a manifestation to a limitation placed on access to a manifestation.
type: Property
domain: C10007
lexical alias: restrictionOnAccessToManifestation.en
instruction number: 4.4
toolkit label: restriction on access to manifestation
toolkit definition: A limitation placed on access to a manifestation.
label: a pour restriction d’accès à une manifestation @fr
definition: Met une manifestation en relation avec une limitation imposée sur l’accès à une manifestation. @fr
toolkit label: restriction d’accès à une manifestation @fr
toolkit definition: Limitation imposée sur l’accès à une manifestation. @fr
toolkit label: restricción de acceso a la manifestación @es
toolkit definition: Una limitación impuesta al acceso a una manifestación. @es
label: har åtkomstrestriktioner @sv
toolkit label: åtkomstrestriktioner @sv
toolkit label: beperking op toegang tot manifestatie @nl
toolkit definition: Een beperking geplaatst op de toegang tot een manifestatie. @nl
label: có hạn chế về truy cập tới biểu thị @vi
definition: Liên kết biểu thị với giới hạn được đặt ra về truy cập tới biểu thị. @vi
toolkit label: hạn chế về truy cập tới biểu thị @vi
toolkit definition: Giới hạn được đặt ra về truy cập tới biểu thị. @vi
label: har restriktion på adgangen til manifestation @da
definition: Relaterer en manifestation til en begrænsning af adgangen til en manifestation. @da
toolkit label: restriktion på adgangen til manifestation @da
toolkit definition: Begrænsning af adgangen til en manifestation. @da
label: hat Zugangsbeschränkung zu einer Manifestation @de
definition: Setzt eine Manifestation in Beziehung zu einer Beschränkung des Zugangs zu einer Manifestation. @de
toolkit label: Zugangsbeschränkung zu einer Manifestation @de
toolkit definition: Eine Beschränkung des Zugangs zu einer Manifestation. @de
label: té com a restricció d’accés a una manifestació @ca
definition: Relaciona una manifestació amb una limitació imposada sobre l’accés a una manifestació. @ca
toolkit label: restricció d’accés a una manifestació @ca
toolkit definition: Limitació imposada sobre l’accés a una manifestació. @ca
definition: Liittää manifestaation manifestaation saatavuudelle asetettuihin rajoituksiin. @fi
toolkit label: manifestaation saatavuuden rajoitukset @fi
toolkit definition: Manifestaation saatavuudelle asetetut rajoitukset. @fi
toolkit label: adgangsbegrensning for manifestasjon @no
toolkit definition: En begrensning for tilgangen til en manifestasjon. @no
label: έχει περιορισμό της πρόσβασης στην εκδήλωση @el
definition: Συνδέει μια εκδήλωση με έναν περιορισμό που ανατίθεται στην πρόσβαση μιας εκδήλωσης. @el
toolkit label: περιορισμός της πρόσβασης στην εκδήλωση @el
toolkit definition: Ένας περιορισμός που ανατίθεται στην πρόσβαση μιας εκδήλωσης. @el
label: van megjelenési forma hozzáféréséhez rendelt korlátozása @hu
definition: Hozzákapcsol egy megjelenési formát egy korlátozáshoz, amelyet egy megjelenési formához való hozzáféréshez rendelnek. @hu
toolkit label: korlátozás megjelenési forma eléréséhez @hu
toolkit definition: Korlátozás, amelyet egy megjelenési forma hozzáféréséhez állítottak be. @hu
label: manifestaation saatavuuden rajoitukset @fi
label: har adgangsbegrensning for manifestasjon @no
definition: Relaterer en manifestasjon til en begrensning for tilgangen til en manifestasjon. @no
label: heeft beperking op toegang tot manifestatie @nl
definition: Relateert een manifestatie aan een beperking geplaatst op de toegang tot een manifestatie. @nl
label: له تقييد للوصول لتجسيدة @ar
definition: يربط بين تجسيدة وقيود وفقًا للمكان تتعلق بالوصول لتجسيدة. @ar
toolkit label: تقييد للوصول لتجسيدة @ar
toolkit definition: قيود وفقًا للمكان تتعلق بالوصول لتجسيدة. @ar
label: kehastuse juurdepääsupiirang @et
definition: Seostab kehastuse piiranguga, mis on kehtestatud kehastuse juurdepääsule. @et
toolkit label: kehastuse juurdepääsupiirang @et
toolkit definition: Piirang, mis on kehtestatud kehastuse juurdepääsule. @et
label: ha come limitazioni all'accesso a una manifestazione @it
definition: Correla una manifestazione a restrizioni poste all'accesso a una manifestazione. @it
toolkit label: limitazioni all'accesso a una manifestazione @it
toolkit definition: Restrizioni poste all'accesso a una manifestazione. @it
label: manifestācijas piekļuves ierobežojums @lv
definition: Sasaista manifestāciju ar ierobežojumu, kas noteikts piekļuvei manifestācijai. @lv
toolkit label: manifestācijas piekļuves ierobežojums @lv
toolkit definition: Ierobežojums, kas noteikts piekļuvei manifestācijai. @lv
has element type: 5
label: 有载体表现的存取限制 @zh-hans
definition: 将一种载体表现与对一种载体表现的存取施加的限制关联起来。 @zh-hans
toolkit label: 载体表现的存取限制 @zh-hans
toolkit definition: 对一种载体表现的存取施加的限制 @zh-hans
label: gösterime erişim kısıtlaması ile ilişkilidir @tr
definition: Bir gösterimi, bir gösterime erişime getirilen bir sınırlamayla ilişkilendirir. @tr
toolkit label: gösterime erişim kısıtlaması @tr
toolkit definition: Bir gösterimin erişimine getirilen bir sınırlama. @tr
label: tiene restricción de acceso a la manifestación @es
definition: Relaciona una manifestación con una limitación impuesta al acceso a una manifestación. @es

has related manifestation of manifestation
status: Published
definition: Relates a manifestation to a manifestation that is associated with a manifestation.
type: Property
domain: C10007
lexical alias: relatedManifestationOfManifestation.en
label: har relaterad manifestation @sv
toolkit label: relaterad manifestation @sv
sub property of: has related RDA entity of manifestation
toolkit label: gerelateerde manifestatie van manifestatie @nl
toolkit definition: Een manifestatie die geassocieerd is met een manifestatie. @nl
label: có biểu thị có liên quan (biểu thị) @vi
definition: Liên kết biểu thị với biểu thị liên quan tới biểu thị đang được mô tả. @vi
label: har manifestation relateret til manifestation @da
definition: Relaterer en manifestation til en manifestation, som er knyttet til en manifestation. @da
label: té com a manifestació relacionada amb una manifestació @ca
definition: Relaciona una manifestació amb una manifestació que s’associa amb una manifestació. @ca
definition: Liittää manifestaation manifestaatioon, joka liittyy manifestaatioon. @fi
toolkit label: manifestaatioon liittyvä manifestaatio @fi
toolkit definition: Manifestaatio, joka liittyy manifestaatioon. @fi
label: έχει σχετική εκδήλωση (εκδήλωση) @el
definition: Συνδέει μια εκδήλωση με μια εκδήλωση που συνδέεται με μια περιγραφόμενη εκδήλωση. @el
label: a pour manifestation en relation avec une manifestation @fr
definition: Met une manifestation en relation avec une manifestation qui est associée à une manifestation. @fr
has element type: 1
toolkit label: related manifestation of manifestation
toolkit definition: A manifestation that is associated with a manifestation.
sub property of: P00004
label: megjelenési forma kapcsolódó megjelenési formája a következő: @hu
definition: Hozzákapcsol egy megjelenési formát egy megjelenési formához, amely egy megjelenési formához kapcsolódik. @hu
alternative label: whole-part manifestation relationship
label: manifestaatioon liittyvä manifestaatio @fi
label: har relatert manifestasjon av manifestasjon @no
definition: Relaterer en manifestasjon til en manifestasjon som forbindes med en manifestasjon. @no
toolkit label: relatert manifestasjon av manifestasjon @no
toolkit definition: En manifestasjon som forbindes med en manifestasjon. @no
toolkit label: manifestation en relation avec une manifestation @fr
toolkit definition: Manifestation qui est associée à une manifestation. @fr
label: heeft gerelateerde manifestatie van manifestatie @nl
definition: Relateert een manifestatie aan een manifestatie die geassocieerd is met een manifestatie. @nl
label: له تجسيدة مرتبطة بتجسيدة @ar
definition: يربط بين تجسيدة وتجسيدة مرتبطة بتجسيدة. @ar
toolkit label: تجسيدة مرتبطة بتجسيدة @ar
toolkit definition: تجسيدة مرتبطة بتجسيدة. @ar
toolkit label: manifestació relacionada amb una manifestació @ca
toolkit definition: Manifestació que s’associa amb una manifestació. @ca
toolkit label: manifestation relateret til manifestation @da
toolkit definition: Manifestation, som er knyttet til en manifestation. @da
label: kehastusega seotud kehastus @et
definition: Seostab kehastuse kehastusega, mis on kehastusega seotud. @et
toolkit label: kehastusega seotud kehastus @et
toolkit definition: Kehastus, mis on kehastusega seotud. @et
label: hat mit Manifestation in Beziehung stehende Manifestation @de
definition: Setzt eine Manifestation in Beziehung zu einer Manifestation, die mit einer Manifestation in Verbindung steht. @de
toolkit label: mit Manifestation in Beziehung stehende Manifestation @de
toolkit definition: Eine Manifestation, die mit einer Manifestation in Verbindung steht. @de
label: ha come manifestazione di manifestazione correlata @it
definition: Correla una manifestazione a una manifestazione associata a una manifestazione. @it
toolkit label: manifestazione di manifestazione correlata @it
toolkit definition: Manifestazione associata a una manifestazione. @it
label: ar manifestāciju saistītā manifestācija @lv
definition: Sasaista manifestāciju ar manifestāciju, kas ir saistīta ar manifestāciju. @lv
toolkit label: ar manifestāciju saistītā manifestācija @lv
toolkit definition: Manifestācija, kas ir saistīta ar manifestāciju. @lv
alternative label: manifestaation osa-kokonaisuus-suhde @fi
alternative label: علاقة الكل بالجزء لتجسيدة @ar
alternative label: helhed-del-manifestation-relation @da
alternative label: Teil-Ganzes-Beziehungen auf Manifestationsebene @de
alternative label: relació de manifestació tot-part @ca
alternative label: 整体-部分载体表现关系 @zh-hans
label: 有载体表现的关联载体表现 @zh-hans
definition: 将一种载体表现与和一种载体表现有关的一种载体表现关联起来。 @zh-hans
toolkit label: 关联载体表现 @zh-hans
toolkit definition: 和一种载体表现有关的一种载体表现 @zh-hans
alternative label: relación de manifestación de parte entera @es
toolkit label: megjelenési forma kapcsolódó megjelenési formája @hu
toolkit definition: Egy megjelenési forma, amely egy megjelenési formához kapcsolódik. @hu
toolkit label: gösterimin ilişkili gösterimi @tr
toolkit definition: Bir gösterimle bağlantılı olan bir gösterim. @tr
toolkit label: manifestación relacionada de manifestación @es
toolkit definition: Una manifestación que está asociada a una manifestación. @es

is reproduced as manifestation
status: Published
definition: Relates a manifestation to a manifestation that reproduces another manifestation.
type: Property
domain: C10007
sub property of: has equivalent manifestation
lexical alias: reproducedAsManifestation.en
toolkit label: reproduced as manifestation
toolkit definition: A manifestation that reproduces another manifestation.
label: est reproduit comme une manifestation @fr
definition: Met une manifestation en relation avec une manifestation qui reproduit une autre manifestation. @fr
toolkit label: reproduit comme une manifestation @fr
toolkit definition: Manifestation qui reproduit une autre manifestation. @fr
toolkit label: reproducida como manifestación @es
toolkit definition: Una manifestación que reproduce otra manifestación. @es
instruction number: 24.5
toolkit label: gereproduceerd als manifestatie @nl
toolkit definition: Een manifestatie die een andere manifestatie reproduceert. @nl
label: được sản xuất lại như là (biểu thị) @vi
definition: Liên kết biểu thị với biểu thị sản xuất lại biểu thị khác. @vi
toolkit label: được sản xuất lại như là (biểu thị) @vi
toolkit definition: Biểu thị sản xuất lại biểu thị khác. @vi
label: er reproduceret som manifestation @da
definition: Relaterer en manifestation til en manifestation, som gengiver en anden manifestation. @da
toolkit label: reproduceret som manifestation @da
toolkit definition: Manifestation, som gengiver en anden manifestation. @da
label: ist reproduziert als Manifestation @de
definition: Setzt eine Manifestation in Beziehung zu einer Manifestation, die eine andere Manifestation reproduziert. @de
toolkit label: Reproduziert als Manifestation @de
toolkit definition: Eine Manifestation, die eine andere Manifestation reproduziert. @de
label: és reproduït com a manifestació @ca
definition: Relaciona una manifestació amb una manifestació que reprodueix una altra manifestació. @ca
toolkit label: reproduït com a manifestació @ca
toolkit definition: Manifestació que reprodueix una altra manifestació. @ca
definition: Liittää manifestaation manifestaatioon, joka on jäljenne toisesta manifestaatiosta. @fi
toolkit label: manifestaation jäljenne @fi
toolkit definition: Manifestaatio, joka on jäljenne toisesta manifestaatiosta. @fi
toolkit label: reprodusert som manifestasjon @no
toolkit definition: En manifestasjon som reproduserer en annen manifestasjonen. @no
label: είναι αναπαραγόμενη ως (εκδήλωση) @el
definition: Συνδέει μια εκδήλωση με μια εκδήλωση που αναπαράγει μια άλλη εκδήλωση. @el
toolkit label: αναπαραγόμενη ως (εκδήλωση) @el
toolkit definition: Μια εκδήλωση που αναπαράγει μια άλλη εκδήλωση. @el
has element type: 2
label: másolva (megjelenési forma) @hu
definition: Egy megjelenési formát hozzákapcsol egy olyan megjelenési formához, amely egy másik megjelenési formát reprodukál. @hu
toolkit label: másolatként (megjelenési forma) @hu
toolkit definition: Egy megjelenési forma, amely egy másik megjelenési formát reprodukál. @hu
label: manifestaation jäljenne @fi
label: er reprodusert som manifestasjon @no
definition: Relaterer en manifestasjon til en manifestasjon som reproduserer en annen manifestasjonen. @no
label: is gereproduceerd als manifestatie @nl
definition: Relateert een manifestatie aan een manifestatie die een andere manifestatie reproduceert. @nl
label: هو إعادة إنتاج كتجسيدة @ar
definition: يربط بين تجسيدة وتجسيدة هي إعادة إنتاج لتجسيدة أخرى. @ar
toolkit label: إعادة إنتاج كتجسيدة @ar
toolkit definition: تجسيدة هي إعادة إنتاج لتجسيدة أخرى. @ar
label: kehastuse reproduktsioon @et
definition: Seostab kehastuse kehastusega, mis on teise kehastuse reproduktsioon. @et
toolkit label: kehastuse reproduktsioon @et
toolkit definition: Kehastus, mis on teise kehastuse reproduktsioon. @et
label: è riprodotta come manifestazione @it
definition: Correla una manifestazione a una manifestazione che riproduce un'altra manifestazione. @it
toolkit label: riprodotta come manifestazione @it
toolkit definition: Manifestazione che riproduce un'altra manifestazione. @it
label: ir manifestācijas reprodukcija @lv
definition: Sasaista manifestāciju ar manifestāciju, kas atveido citu manifestāciju. @lv
toolkit label: manifestācijas reprodukcija @lv
toolkit definition: Manifestācija, kas atveido citu manifestāciju. @lv
label: 被复制为载体表现 @zh-hans
definition: 将一种载体表现与复制另一种载体表现的一种载体表现关联起来。 @zh-hans
toolkit label: 被复制为载体表现 @zh-hans
toolkit definition: 复制另一种载体表现的一种载体表现 @zh-hans
label: gösterim olarak yeniden yapılmıştır @tr
definition: Bir gösterimi, başka bir gösterimi yeniden üreten bir gösterim ile ilişkilendirir. @tr
toolkit label: gösterim olarak yeniden üretilmiş @tr
toolkit definition: Başka bir gösterimi yeniden üreten bir gösterim. @tr
label: se reproduce como manifestación @es
definition: Relaciona una manifestación con una manifestación que reproduce otra manifestación. @es
has subproperty: has digital transfer of manifestation

is reprinted as manifestation
status: Published
definition: Relates a manifestation to a manifestation that is a reissue of another printed manifestation.
type: Property
domain: C10007
sub property of: is reproduced as manifestation
lexical alias: reprintedAsManifestation.en
toolkit label: reprinted as manifestation
toolkit definition: A manifestation that is a reissue of another printed manifestation.
label: est réimprimé comme une manifestation @fr
definition: Met une manifestation en relation avec une manifestation qui est une réédition d’une autre manifestation imprimée. @fr
toolkit label: réimprimé comme une manifestation @fr
toolkit definition: Manifestation qui est une réédition d’une autre manifestation imprimée. @fr
toolkit label: reimpreso como manifestación @es
toolkit definition: Una manifestación que es reedición de otra manifestación impresa. @es
instruction number: 24.5
toolkit label: herdrukt als manifestatie @nl
toolkit definition: Een manifestatie die een heruitgave is van een andere gedrukte manifestatie. @nl
label: được in lại như là (biểu thị) @vi
definition: Liên kết biểu thị với biểu thị là công bố lại của biểu thị in khác. @vi
toolkit label: được in lại như là (biểu thị) @vi
toolkit definition: Biểu thị là công bố lại của biểu thị in khác. @vi
label: er genoptrykt som manifestation @da
definition: Relaterer en manifestation til en manifestation, som er en genudgivelse af en anden trykt manifestation. @da
toolkit label: genoptrykt som manifestation @da
toolkit definition: Manifestation, som er en genudgivelse af en anden trykt manifestation. @da
label: ist nachgedruckt als Manifestation @de
definition: Setzt eine Manifestation in Beziehung zu einer Manifestation, die eine Neuauflage einer anderen gedruckten Manifestation ist. @de
toolkit label: Nachgedruckt als Manifestation @de
toolkit definition: Eine Manifestation, die eine Neuauflage einer anderen gedruckten Manifestation ist. @de
label: és reimprès com a manifestació @ca
definition: Relaciona una manifestació amb una manifestació que és una reimpressió d’una altra manifestació impresa. @ca
toolkit label: reimprès com a manifestació @ca
toolkit definition: Manifestació que és una reimpressió d’una altra manifestació impresa. @ca
definition: Liittää manifestaation manifestaatioon, joka on uusintajulkaisu toisesta painetusta manifestaatiosta. @fi
toolkit label: manifestaation uusintapainos @fi
toolkit definition: Uusintajulkaisu toisesta painetusta manifestaatiosta. @fi
toolkit label: opptrykt som manifestasjon @no
toolkit definition: En manifestasjon som er et opptrykk av en annen trykt manifestasjon. @no
label: είναι ανατυπωμένη ως (εκδήλωση) @el
definition: Συνδέει μια εκδήλωση με μια εκδήλωση που είναι επανέκδοση μιας άλλης έντυπης εκδήλωσης. @el
toolkit label: ανατυπωμένη ως (εκδήλωση) @el
toolkit definition: Μια εκδήλωση που είναι επανέκδοση μιας άλλης έντυπης εκδήλωσης. @el
has element type: 2
label: reprintelve (megjelenési forma) @hu
definition: Hozzákapcsol egy megjelenési formát egy megjelenési formához, amely egy másik nyomtatott megjelenési forma újrakiadása. @hu
toolkit label: reprintje a következőnek (megjelenési forma): @hu
toolkit definition: Egy megjelenési forma, amely egy másik nyomtatott megjelenési forma újrakiadása. @hu
label: manifestaation uusintapainos @fi
label: er opptrykt som manifestasjon @no
definition: Relaterer en manifestasjon til en manifestasjon som er et opptrykk av en annen trykt manifestasjon. @no
label: is herdrukt als manifestatie @nl
definition: Relateert een manifestatie aan een manifestatie die een heruitgave is van een andere gedrukte manifestatie. @nl
label: هو إعادة طباعة كتجسيدة @ar
definition: يربط بين تجسيدة وتجسيدة هي إعادة إصدار لتجسيدة أخرى مطبوعة. @ar
toolkit label: إعادة طباعة كتجسيدة @ar
toolkit definition: تجسيدة هي إعادة إصدار لتجسيدة أخرى مطبوعة. @ar
label: kordustrükk (kehastus) @et
definition: Seostab kehastuse kehastusega, mis on teise trükitud kehastuse kordustrükk. @et
toolkit label: kordustrükk (kehastus) @et
toolkit definition: Kehastus, mis on teise trükitud kehastuse kordustrükk. @et
label: è ristampata come manifestazione @it
definition: Correla una manifestazione a una manifestazione che è una riemissione di un'altra manifestazione a stampa. @it
toolkit label: ristampata come manifestazione @it
toolkit definition: Manifestazione che è una riemissione di un'altra manifestazione a stampa. @it
label: ir manifestācijas reprints @lv
definition: Sasaista manifestāciju ar manifestāciju, kas ir citas drukātas manifestācijas reprints. @lv
toolkit label: manifestācijas reprints @lv
toolkit definition: Manifestācija, kas ir citas drukātas manifestācijas reprints. @lv
label: 被重印为载体表现 @zh-hans
definition: 将一种载体表现与作为另一个印刷载体表现的重新发行本的一种载体表现关联起来。 @zh-hans
toolkit label: 被重印为载体表现 @zh-hans
toolkit definition: 作为另一个印刷载体表现的重新发行本的一种载体表现 @zh-hans
label: gösterim olarak yeniden basılmıştır @tr
definition: Bir gösterimi, başka bir basılı gösterimin yeni basımı olan bir gösterim ile ilişkilendirir. @tr
toolkit label: gösterim olarak yeniden basılmış @tr
toolkit definition: Başka bir basılı gösterimin yeniden basımı olan bir gösterim. @tr
label: se reimprime como manifestación @es
definition: Relaciona una manifestación con una manifestación que es reedición de otra manifestación impresa. @es
has subproperty: P30038

has exemplar of manifestation
status: Published
definition: Relates a manifestation to an item that is a single instance of a manifestation.
type: Property
domain: C10007
lexical alias: exemplarOfManifestation.en
instruction number: 17.11
toolkit label: exemplar of manifestation
toolkit definition: An item that is a single instance of a manifestation.
label: a pour exemplaire d’une manifestation @fr
definition: Met une manifestation en relation avec une occurrence ou un exemplaire isolé d’une manifestation. @fr
toolkit label: exemplaire d’une manifestation @fr
toolkit definition: Occurrence ou exemplaire isolé d’une manifestation. @fr
toolkit label: ejemplar de manifestación @es
toolkit definition: Un item que es una instancia única de una manifestación. @es
label: har exemplar av manifestation @sv
toolkit label: exemplar av manifestation @sv
toolkit label: exemplaar van manifestatie @nl
toolkit definition: Een enkel exemplaar of instantie van een manifestatie. @nl
label: có mẫu cỉa biểu thị @vi
definition: Liên kết biểu thị với mẫu hoặc ví dụ đơn lẻ của biểu thị. @vi
toolkit label: mẫu cỉa biểu thị @vi
toolkit definition: Mẫu hoặc ví dụ đơn lẻ của biểu thị. @vi
label: har eksemplar af manifestation @da
definition: Relaterer en manifestation til et enkelt eksemplar eller en enkelt forekomst af en manifestation. @da
toolkit label: eksemplar af manifestation @da
toolkit definition: Enkelt eksemplar eller en enkelt forekomst af en manifestation. @da
label: hat Exemplar einer Manifestation @de
definition: Setzt eine Manifestation in Beziehung zu einem Exemplar, bei dem es sich um ein einzelnes Beispiel einer Manifestation handelt. @de
toolkit label: Exemplar einer Manifestation @de
toolkit definition: Ein Exemplar, bei dem es sich um ein einzelnes Beispiel einer Manifestation handelt. @de
label: té com a exemplar d’una manifestació @ca
definition: Relaciona una manifestació amb un exemplar sol o ocurrència d’una manifestació. @ca
toolkit label: exemplar d’una manifestació @ca
toolkit definition: Exemplar sol o ocurrència d’una manifestació. @ca
definition: Liittää manifestaation manifestaation yksittäiseen toteutumaan. @fi
toolkit label: manifestaation kappale @fi
toolkit definition: Manifestaation yksittäinen toteutuma. @fi
toolkit label: eksemplar av en manifestasjon @no
toolkit definition: En enkelt forekomst av en manifestasjon. @no
label: έχει στιγμιότυπο της εκδήλωσης @el
definition: Συνδέει μια εκδήλωση με ένα μοναδικό παράδειγμα ή στιγμιότυπο μιας εκδήλωσης. @el
toolkit label: στιγμιότυπο της εκδήλωσης @el
toolkit definition: Ένα μοναδικό παράδειγμα ή στιγμιότυπο μιας εκδήλωσης. @el
sub property of: has related item of manifestation
has element type: 3
label: megjelenési forma mintapéldánya a következő: @hu
definition: Egy megjelenési formát hozzákapcsol egy megjelenési forma egyetlen mintapéldányához vagy példájához. @hu
toolkit label: megjelenési forma mintapéldánya @hu
toolkit definition: Egy megjelenési forma egyetlen mintapéldánya vagy példája. @hu
label: manifestaation kappale @fi
label: har eksemplar av en manifestasjon @no
definition: Relaterer en manifestasjon til en enkelt forekomst av en manifestasjon. @no
label: heeft exemplaar van manifestatie @nl
definition: Relateert een manifestatie aan een enkel exemplaar of instantie van een manifestatie. @nl
label: له مثال لتجسيدة @ar
definition: يربط بين تجسيدة ومثال واحد أو حالة لتجسيدة. @ar
toolkit label: مثال لتجسيدة @ar
toolkit definition: مثال واحد أو حالة لتجسيدة. @ar
label: kehastuse eksemplar @et
definition: Seostab kehastuse eksemplariga, mis on kehastuse üksikjuht. @et
toolkit label: kehastuse eksemplar @et
toolkit definition: Eksemplar, mis on kehastuse üksikjuht. @et
label: ha come esemplare della manifestazione @it
definition: Correla una manifestazione a un singolo esemplare o istanza di una manifestazione. @it
toolkit label: esemplare della manifestazione @it
toolkit definition: Singolo esemplare o istanza di una manifestazione. @it
label: manifestācijas paraugeksemplārs @lv
definition: Sasaista manifestāciju ar vienību, kas ir manifestācijas atsevišķa instance. @lv
toolkit label: manifestācijas paraugeksemplārs @lv
toolkit definition: Vienība, kas ir manifestācijas atsevišķa instance. @lv
label: 有载体表现的例证 @zh-hans
definition: 将一种载体表现与作为一种载体表现的单一实例的一个单件关联起来。 @zh-hans
toolkit label: 载体表现的例证 @zh-hans
toolkit definition: 作为一种载体表现的单一实例的一个单件 @zh-hans
label: gösterim örneği ile ilişkilidir @tr
definition: Bir gösterimi, bir gösterimin tek bir örneği olan bir kopyayla ilişkilendirir. @tr
toolkit label: gösterim örneği @tr
toolkit definition: Bir gösterimin tek bir örneği olan bir kopya. @tr
label: tiene ejemplar de manifestación @es

is subject manifestation of
status: Published
type: Property
lexical alias: subjectManifestationOf.en
definition: Relates a manifestation to a work that is about a manifestation.
domain: C10007
toolkit label: subject manifestation of
toolkit definition: A work that is about a manifestation.
toolkit label: manifestación del tema de @es
toolkit definition: Una obra que trata sobre una manifestación. @es
sub property of: has related work of manifestation
toolkit label: onderwerp manifestatie van @nl
toolkit definition: Een werk dat over de manifestatie gaat. @nl
label: là chủ đề của (biểu thị) @vi
definition: Liên kết biểu thị với tác phẩm về biểu thị. @vi
toolkit label: chủ đề của (biểu thị) @vi
toolkit definition: Tác phẩm về biểu thị. @vi
label: er manifestation, som er subjekt af @da
definition: Relaterer en manifestation til et værk, som omhandler en manifestation. @da
toolkit label: manifestation, som er subjekt af @da
toolkit definition: Værk, som omhandler en manifestation. @da
label: ist Thema von (Manifestation) @de
definition: Setzt eine Manifestation in Beziehung zu einem Werk, das von einer Manifestation handelt. @de
toolkit label: Thema von (Manifestation) @de
toolkit definition: Ein Werk, das von einer Manifestation handelt. @de
label: és manifestació de matèria de @ca
definition: Relaciona una manifestació amb una obra que tracta d’una manifestació. @ca
toolkit label: manifestació de matèria de @ca
toolkit definition: Obra que tracta d’una manifestació. @ca
definition: Liittää manifestaation teokseen, jonka aiheena manifestaatio on. @fi
toolkit label: manifestaatio aiheena teoksessa @fi
toolkit definition: Teos, jonka aiheena manifestaatio on. @fi
toolkit label: emne for manifestasjon av @no
toolkit definition: Et verk som handler om en manifestasjon. @no
label: είναι υποκείμενο της (εκδήλωση) @el
definition: Συνδέει μια εκδήλωση με ένα έργο που αναφέρεται σε μια εκδήλωση. @el
toolkit label: υποκείμενο της (εκδήλωση) @el
toolkit definition: Ένα έργο που αναφέρεται σε μια εκδήλωση. @el
label: est une manifestation sujet de @fr
definition: Met une manifestation en relation avec une œuvre qui traite d’une manifestation. @fr
toolkit label: manifestation sujet de @fr
toolkit definition: Œuvre qui traite d’une manifestation. @fr
has element type: 2
alternative label: subject of (manifestation)
label: tárgya a következő megjelenési formának: @hu
definition: Hozzákapcsol egy megjelenési formát egy műhöz, ami egy megjelenési formáról szól. @hu
toolkit label: tárgya a következő megjelenési formának: @hu
toolkit definition: Egy mű, ami egy megjelenési formáról szól. @hu
sub property of: P00014
alternative label: manifestaation aiheena teoksessa @fi
label: manifestaatio aiheena teoksessa @fi
label: er emne for manifestasjon av @no
definition: Relaterer en manifestasjon til et verk som handler om en manifestasjon. @no
alternative label: emne for (manifestasjon) @no
alternative label: sujet de (manifestation) @fr
label: is onderwerp manifestatie van @nl
definition: Relateert een manifestatie aan een werk dat over de manifestatie gaat. @nl
label: هو تجسيدة موضوع لـ @ar
definition: يربط بين تجسيدة وعمل عن تجسيدة. @ar
alternative label: موضوع لـ (تجسيدة) @ar
toolkit label: تجسيدة موضوع لـ @ar
toolkit definition: عمل عن تجسيدة. @ar
alternative label: matèria de (manifestació) @ca
alternative label: emne for (manifestation) @da
label: käsitletud teoses (kehastus) @et
definition: Seostab kehastuse teosega, mis on kehastuse kohta. @et
toolkit label: käsitletud teoses (kehastus) @et
toolkit definition: Teos, mis on kehastuse kohta. @et
alternative label: Thema von (Manifestation) @de
alternative label: tárgya a következőnek (megjelenési forma): @hu
label: è manifestazione soggetto di @it
definition: Correla una manifestazione a un'opera che tratta di una manifestazione. @it
alternative label: soggetto di (manifestazione) @it
toolkit label: manifestazione soggetto di @it
toolkit definition: Opera che tratta di una manifestazione. @it
label: ir temats (manifestācija) @lv
definition: Sasaista manifestāciju ar darbu, kura temats ir manifestācija. @lv
toolkit label: ir temats (manifestācija) @lv
toolkit definition: Darbs, kura temats ir manifestācija. @lv
alternative label: ……的主题（载体表现） @zh-hans
toolkit label: ……的主题载体表现 @zh-hans

is on disc with manifestation
status: Published
definition: Relates a manifestation to a manifestation that is issued on the same disc with a manifestation being described.
type: Property
domain: C10007
sub property of: is on carrier unit with
lexical alias: onDiscWithManifestation.en
toolkit label: on disc with manifestation
toolkit definition: A manifestation that is issued on the same disc with a manifestation being described.
label: est sur le disque avec une manifestation @fr
definition: Met une manifestation en relation avec une manifestation qui est publiée sur le même disque qu’une manifestation décrite. @fr
toolkit label: sur le disque avec une manifestation @fr
toolkit definition: Manifestation qui est publiée sur le même disque qu’une manifestation décrite. @fr
toolkit label: en disco con manifestación @es
toolkit definition: Una manifestación que se emite en el mismo disco con una manifestación que se describe. @es
instruction number: 24.5
toolkit label: op schijf met manifestatie @nl
toolkit definition: Een manifestatie die is uitgevaardigd op dezelfde schijf met een manifestatie die wordt beschreven. @nl
label: là trên đĩa với (biểu thị) @vi
definition: Liên kết biểu thị với biểu thị được công bố trên cùng đĩa với biểu thị đang được mô tả. @vi
toolkit label: trên đĩa với (biểu thị) @vi
toolkit definition: Biểu thị được công bố trên cùng đĩa với biểu thị đang được mô tả. @vi
label: er på disk med manifestation @da
definition: Relaterer en manifestation til en manifestation, som er udgivet på den samme disk som en manifestation, der bliver beskrevet. @da
toolkit label: på disk med manifestation @da
toolkit definition: Manifestation, som er udgivet på den samme disk som en manifestation, der bliver beskrevet. @da
label: ist auf Disk mit (Manifestation) @de
definition: Setzt eine Manifestation in Beziehung zu einer Manifestation, die auf derselben Disk erscheint, wie die Manifestation, die beschrieben wird. @de
toolkit label: auf Disk mit (Manifestation) @de
toolkit definition: Eine Manifestation, die auf derselben Disk erscheint, wie die Manifestation, die beschrieben wird. @de
label: és en un disc amb una manifestació @ca
definition: Relaciona una manifestació amb una manifestació que es publica en el mateix disc amb una manifestació que es descriu. @ca
toolkit label: en un disc amb una manifestació @ca
toolkit definition: Manifestació que es publica en el mateix disc amb una manifestació que es descriu. @ca
definition: Liittää manifestaation manifestaatioon, joka on julkaistu samalla levyllä kuin kuvailun kohteena oleva manifestaatio. @fi
toolkit label: levyllä myös @fi
toolkit definition: Manifestaatio, joka on julkaistu samalla levyllä kuin kuvailun kohteena oleva manifestaatio. @fi
toolkit label: på plate med manifestasjon @no
toolkit definition: En manifestasjon som er utgitt på samme plate som manifestasjonen som beskrives. @no
label: είναι στον δίσκο μαζί με (εκδήλωση) @el
definition: Συνδέει μια εκδήλωση με μια εκδήλωση που εκδίδεται στον ίδιο δίσκο με μια περιγραφόμενη εκδήλωση. @el
toolkit label: στον δίσκο μαζί με (εκδήλωση) @el
toolkit definition: Μια εκδήλωση που εκδίδεται στον ίδιο δίσκο με μια περιγραφόμενη εκδήλωση. @el
has element type: 2
label: azonos lemezen a következő megjelenési formával: @hu
definition: Hozzákapcsol egy megjelenési formát egy megjelenési formához, amelyet ugyanazon a lemezen adnak ki, mint az éppen leírt megjelenési formát. @hu
toolkit label: közös lemezen a következő megjelenési formával: @hu
toolkit definition: Egy megjelenési forma, amelyet ugyanazon a lemezen jelentettek meg, mint az éppen leírt megjelenési formát. @hu
label: levyllä myös @fi
label: er på plate med manifestasjon @no
definition: Relaterer en manifestasjon til en manifestasjon som er utgitt på samme plate som manifestasjonen som beskrives. @no
label: is op schijf met manifestatie @nl
definition: Relateert een manifestatie aan een manifestatie die is uitgevaardigd op dezelfde schijf met een manifestatie die wordt beschreven. @nl
label: هو على قرص مع التجسيدة @ar
definition: يربط بين تجسيدة وتجسيدة صادرة على الوسيط نفسه مثل التجسيدة التي يتم وصفها. @ar
toolkit label: على قرص مع التجسيدة @ar
toolkit definition: تجسيدة صادرة على الوسيط نفسه مثل التجسيدة التي يتم وصفها. @ar
label: plaadil ka kehastus @et
definition: Seostab kehastuse kehastusega, mis on ilmunud kirjeldatava kehastusega samal plaadil. @et
toolkit label: plaadil ka kehastus @et
toolkit definition: Kehastus, mis on ilmunud kirjeldatava kehastusega samal plaadil. @et
label: è su disco con una manifestazione @it
definition: Correla una manifestazione a una manifestazione pubblicata sullo stesso disco della manifestazione descritta. @it
toolkit label: su disco con una manifestazione @it
toolkit definition: Manifestazione pubblicata sullo stesso disco della manifestazione descritta. @it
label: ir izdots diskā kopā ar manifestāciju @lv
definition: Sasaista manifestāciju ar manifestāciju, kas ir izdota tajā pašā diskā kopā ar aprakstāmo manifestāciju. @lv
toolkit label: izdots diskā kopā ar manifestāciju @lv
toolkit definition: Manifestācija, kas ir izdota tajā pašā diskā kopā ar aprakstāmo manifestāciju. @lv
label: 与载体表现合盘 @zh-hans
definition: 将一种载体表现与和一个被描述载体表现一起在同一片盘中发行的一种载体表现关联起来。 @zh-hans
toolkit label: 与载体表现合盘 @zh-hans
toolkit definition: 和一个被描述载体表现一起在同一片盘中发行的一种载体表现 @zh-hans
label: gösterim ile aynı disk üzerinde yer alır @tr
definition: Bir gösterimi, nitelenen bir gösterimle aynı diskte yayımlanan bir gösterim ile ilişkilendirir. @tr
toolkit label: gösterim ile diskte @tr
toolkit definition: Tanımlanan bir gösterimle aynı diskte yayımlanan bir gösterim. @tr
label: está en disco con manifestación @es
definition: Relaciona una manifestación con una manifestación que se emite en el mismo disco con una manifestación que se describe. @es
has subproperty: P30036

is filmed with manifestation
status: Published
definition: Relates a manifestation to a manifestation that is issued on the same microform with a manifestation being described.
type: Property
domain: C10007
sub property of: is on carrier unit with
lexical alias: filmedWithManifestation.en
toolkit label: filmed with manifestation
toolkit definition: A manifestation that is issued on the same microform with a manifestation being described.
label: est filmé avec une manifestation @fr
definition: Met une manifestation en relation avec une manifestation qui est publiée sur la même microforme qu’une manifestation décrite. @fr
toolkit label: filmé avec une manifestation @fr
toolkit definition: Manifestation qui est publiée sur la même microforme qu’une manifestation décrite. @fr
toolkit label: filmado con manifestación @es
toolkit definition: Una manifestación que se emite en la misma microforma con una manifestación que se describe. @es
instruction number: 24.5
toolkit label: verfilmd met manifestatie @nl
toolkit definition: Een manifestatie die wordt uitgevaardigd op dezelfde microvorm met een manifestatie die wordt beschreven. @nl
label: được làm phim với (biểu thị) @vi
definition: Liên kết biểu thị với biểu thị được công bố trên cùng vi dạng với biểu thị đang được mô tả. @vi
toolkit label: được làm phim với (biểu thị) @vi
toolkit definition: Biểu thị được công bố trên cùng vi dạng với biểu thị đang được mô tả. @vi
label: er filmet med manifestation @da
definition: Relaterer en manifestation til en manifestation, som er udgivet på den samme mikroform som en manifestation, der bliver beskrevet. @da
toolkit label: filmet med manifestation @da
toolkit definition: Manifestation, som er udgivet på den samme mikroform som en manifestation, der bliver beskrevet. @da
label: ist verfilmt mit (Manifestation) @de
definition: Setzt eine Manifestation in Beziehung zu einer Manifestation, die auf derselben Mikroform erscheint, wie die Manifestation, die beschrieben wird. @de
toolkit label: Verfilmt mit (Manifestation) @de
toolkit definition: Eine Manifestation, die auf derselben Mikroform erscheint, wie die Manifestation, die beschrieben wird. @de
label: és filmat amb una manifestació @ca
definition: Relaciona una manifestació amb una manifestació que es publica en la mateixa microforma amb una manifestació que es descriu. @ca
toolkit label: filmat amb una manifestació @ca
toolkit definition: Manifestació que es publica en la mateixa microforma amb una manifestació que es descriu. @ca
definition: Liittää manifestaation manifestaatioon, joka on kuvattu samalle filmille kuin kuvailun kohteena oleva manifestaatio. @fi
toolkit label: filmillä myös @fi
toolkit definition: Manifestaatio, joka on kuvattu samalle filmille kuin kuvailun kohteena oleva manifestaatio. @fi
toolkit label: på film med manifestasjon @no
toolkit definition: En manifestasjon som er utgitt på samme mikroform som manifestasjonen som beskrives. @no
label: είναι κινηματογραφημένο μαζί με (εκδήλωση) @el
definition: Συνδέει μια εκδήλωση με μια εκδήλωση που εκδίδεται στην ίδια μικροφόρμα με μια περιγραφόμενη εκδήλωση. @el
toolkit label: κινηματoγραφημένο μαζί με (εκδήλωση) @el
toolkit definition: Μια εκδήλωση που εκδίδεται στην ίδια μικροφόρμα με μια περιγραφόμενη εκδήλωση. @el
has element type: 2
label: együtt filmezve a következő megjelenési formával: @hu
definition: Hozzákapcsol egy megjelenési formát egy megjelenési formához, amelyet ugyanazon a mikroformán adnak ki, mint az éppen leírt megjelenési formát. @hu
toolkit label: együtt filmezve a következő megjelenési formával: @hu
toolkit definition: Egy megjelenési forma, amelyet ugyanazon a mikroformán adnak ki, mint az éppen leírt megjelenési formát. @hu
label: filmillä myös @fi
label: er på film med manifestasjon @no
definition: Relaterer en manifestasjon til en manifestasjon som er utgitt på samme mikroform som manifestasjonen som beskrives. @no
label: is verfilmd met manifestatie @nl
definition: Relateert een manifestatie aan een manifestatie die wordt uitgevaardigd op dezelfde microvorm met een manifestatie die wordt beschreven. @nl
label: هو مصور على فيلم مع التجسيدة @ar
definition: يربط بين تجسيدة وتجسيدة صدرت على نفس الميكروفورم مع التجسيدة التي يتم وصفها. @ar
toolkit label: مصور على فيلم مع التجسيدة @ar
toolkit definition: تجسيدة صدرت على نفس الميكروفورم مع التجسيدة التي يتم وصفها. @ar
label: mikrovormil ka kehastus @et
definition: Seostab kehastuse kehastusega, mis on ilmunud kirjeldatava kehastusega samal mikrovormil. @et
toolkit label: mikrovormil ka kehastus @et
toolkit definition: Kehastus, mis on ilmunud kirjeldatava kehastusega samal mikrovormil. @et
label: è su pellicola con una manifestazione @it
definition: Correla una manifestazione a una manifestazione pubblicata sulla stessa microforma della manifestazione descritta. @it
toolkit label: su pellicola con una manifestazione @it
toolkit definition: Manifestazione pubblicata sulla stessa microforma della manifestazione descritta. @it
label: ir izdots mikroformā kopā ar manifestāciju @lv
definition: Sasaista manifestāciju ar manifestāciju, kas ir izdota tajā pašā mikroformā kopā ar aprakstāmo manifestāciju. @lv
toolkit label: izdots mikroformā kopā ar manifestāciju @lv
toolkit definition: Manifestācija, kas ir izdota tajā pašā mikroformā kopā ar aprakstāmo manifestāciju. @lv
label: 与载体表现合拍 @zh-hans
definition: 将一种载体表现与和一个被描述载体表现一起在同一缩微品中发行的一种载体表现关联起来。 @zh-hans
toolkit label: 与载体表现合拍 @zh-hans
toolkit definition: 和一个被描述载体表现一起在同一缩微品中发行的一种载体表现 @zh-hans
label: gösterim ile birlikte çekilmiştir @tr
definition: Bir gösterimi, nitelenen bir gösterim ile aynı mikroformda yayımlanan bir gösterim ile ilişkilendirir. @tr
toolkit label: gösterim ile filme alınan @tr
toolkit definition: Tanımlanan bir gösterim ile aynı mikroformda yayımlanan bir gösterim. @tr
label: está filmado con manifestación @es
definition: Relaciona una manifestación con una manifestación que se emite en la misma microforma con una manifestación que se describe. @es
has subproperty: P30037

has work manifested
status: Published
definition: Relates a manifestation to a work that is embodied by a manifestation.
type: Property
domain: C10007
lexical alias: workManifested.en
instruction number: 17.8
toolkit label: work manifested
toolkit definition: A work that is embodied by a manifestation.
label: a pour œuvre manifestée @fr
definition: Met une manifestation en relation avec une œuvre qui est matérialisée par une manifestation. @fr
toolkit label: œuvre manifestée @fr
toolkit definition: Œuvre qui est matérialisée par une manifestation. @fr
toolkit label: obra manifestada @es
toolkit definition: Una obra que se materializa mediante una manifestación. @es
label: har manifesterat verk @sv
toolkit label: manifesterat verk @sv
toolkit label: gemanifesteerd werk @nl
toolkit definition: Een werk verwezenlijkt in een manifestatie. @nl
label: có tác phẩm được biểu thị @vi
definition: Liên kết biểu thị với tác phẩm được thể hiện trong biểu thị. @vi
toolkit label: tác phẩm được biểu thị @vi
toolkit definition: Tác phẩm được thể hiện trong biểu thị. @vi
label: har værk manifesteret @da
definition: Relaterer en manifestation til et værk, som er indeholdt i en manifestation. @da
toolkit label: værk manifesteret @da
toolkit definition: Værk, som er indeholdt i en manifestation. @da
label: hat in einer Manifestation verkörpertes Werk @de
definition: Setzt eine Manifestation in Beziehung zu einem Werk, das durch eine Manifestation verkörpert ist. @de
toolkit label: In einer Manifestation verkörpertes Werk @de
toolkit definition: Ein Werk, das durch eine Manifestation verkörpert ist. @de
label: té com a obra manifestada @ca
definition: Relaciona una manifestació amb una obra que es materialitza en una manifestació. @ca
toolkit definition: Obra que es materialitza en una manifestació. @ca
definition: Liittää manifestaation teokseen, joka sisältyy manifestaatioon. @fi
toolkit label: manifestaatioon sisältyvä teos @fi
toolkit definition: Teos, joka sisältyy manifestaatioon. @fi
toolkit label: verk manifestert @no
toolkit definition: Et verk som er realisert i en manifestasjon. @no
label: έχει έργο υλοποιημένο @el
definition: Συνδέει μια εκδήλωση με ένα έργο ενσωματωμένο σε μια εκδήλωση. @el
toolkit label: έργο υλοποιημένο @el
toolkit definition: Ένα έργο ενσωματωμένο σε μια εκδήλωση. @el
sub property of: has related work of manifestation
has element type: 3
label: van kinyilvánított műve @hu
definition: Hozzákapcsol egy megjelenési formát egy műhöz, amely egy megjelenési formában testesül meg. @hu
toolkit label: megjelentetett mű: @hu
toolkit definition: Egy mű, amely egy megjelenési formában testesül meg. @hu
label: manifestaatioon sisältyvä teos @fi
label: har verk manifestert @no
definition: Relaterer en manifestasjon til et verk som er realisert i en manifestasjon. @no
label: heeft gemanifesteerd werk @nl
definition: Relateert een manifestatie aan een werk verwezenlijkt in een manifestatie. @nl
label: له عمل مجسد @ar
definition: يربط بين تجسيدة وعمل تم تجسيده في تجسيدة. @ar
toolkit label: عمل مجسد @ar
toolkit definition: عمل تم تجسيده في تجسيدة. @ar
label: kehastatud teos @et
definition: Seostab kehastuse teosega, mis on kehastuses teostatud. @et
toolkit label: kehastatud teos @et
toolkit definition: Teos, mis on kehastuses teostatud. @et
label: ha come opera manifestata @it
definition: Correla una manifestazione a un'opera materializzata in una manifestazione. @it
toolkit label: opera manifestata @it
toolkit definition: Opera materializzata in una manifestazione. @it
label: manifestācija darbam @lv
definition: Sasaista manifestāciju ar darbu, kas fiziski realizēts manifestācijā. @lv
toolkit label: manifestācija darbam @lv
toolkit definition: Darbs, kas fiziski realizēts manifestācijā. @lv
label: 有被载体表现的作品 @zh-hans
definition: 将一种载体表现与被一种载体表现具体化的一种作品关联起来。 @zh-hans
toolkit label: 被载体表现的作品 @zh-hans
toolkit definition: 被一种载体表现具体化的一种作品 @zh-hans
label: gösterimi yapılan eser ile ilişkilidir @tr
definition: Bir gösterimi, bir gösterimin somutlaştırdığı bir eserle ilişkilendirir. @tr
toolkit label: gösterime dönüştürülmüş eser @tr
toolkit definition: Bir gösterimin somutlaştırdığı bir eser. @tr
label: tiene obra manifestada @es
definition: Relaciona una manifestación con una obra que se materializa mediante una manifestación. @es

has preservation facsimile of manifestation
status: Published
definition: Relates a manifestation to a manifestation that consists of an exact reproduction on preservation-quality media, such as acid-free permanent or archival paper.
type: Property
domain: C10007
sub property of: has facsimile of manifestation
lexical alias: preservationFacsimileOfManifestation.en
toolkit label: preservation facsimile of manifestation
toolkit definition: A manifestation that consists of an exact reproduction on preservation-quality media, such as acid-free permanent or archival paper.
label: a pour fac-similé de conservation d’une manifestation @fr
definition: Met une manifestation en relation avec une manifestation qui consiste en une reproduction exacte sur un support de qualité conservation, tel qu’un papier permanent sans acide ou un papier d’archivage. @fr
toolkit label: fac-similé de conservation d’une manifestation @fr
toolkit definition: Manifestation qui consiste en une reproduction exacte sur un support de qualité conservation, tel qu’un papier permanent sans acide ou un papier d’archivage. @fr
toolkit label: facsímil de preservación de manifestación @es
toolkit definition: Una manifestación que consiste en una reproducción exacta sobre medios con calidad de preservación, tales como papel permanente o de archivo libre de acido. @es
instruction number: 24.5
toolkit label: conservatiefacsimile van manifestatie @nl
toolkit definition: Een manifestatie die bestaat uit een exacte reproductie op media van conserveringskwaliteit, zoals zuurvrij permanent- of archiefpapier. @nl
label: có sao chép bảo quản (biểu thị) @vi
definition: Liên kết biểu thị với biểu thị có chứa bản tái tạo chính xác trên phương tiện chất lượng bảo quản, như là giấy vĩnh cửu phi axit hoặc giấy lưu trữ. @vi
toolkit label: sao chép bảo quản (biểu thị) @vi
toolkit definition: Biểu thị có chứa bản tái tạo chính xác trên phương tiện chất lượng bảo quản, như là giấy vĩnh cửu phi axit hoặc giấy lưu trữ. @vi
label: har bevaringsfaksimile af manifestation @da
definition: Relaterer en manifestation til en manifestation, som består af en nøjagtig reproduktion på et medium af bevaringskvalitet, såsom syrefrit permanent- eller arkivpapir. @da
toolkit label: bevaringsfaksimile af manifestation @da
toolkit definition: Manifestation, som består af en nøjagtig reproduktion på et medium af bevaringskvalitet, såsom syrefrit permanent- eller arkivpapir. @da
label: hat Bestandserhaltungsfaksimile einer Manifestation @de
definition: Setzt eine Manifestation in Beziehung zu einer Manifestation, die aus einer exakten Reproduktion auf bestandserhaltenden Medien, wie zum Beispiel säurefreiem Papier oder Archivpapier, besteht. @de
toolkit label: Bestandserhaltungsfaksimile einer Manifestation @de
toolkit definition: Eine Manifestation, die aus einer exakten Reproduktion auf bestandserhaltenden Medien, wie zum Beispiel säurefreiem Papier oder Archivpapier, besteht. @de
label: té com a facsímil de preservació d’una manifestació @ca
definition: Relaciona una manifestació amb una manifestació que consisteix en una reproducció exacta en un suport de preservació de qualitat, com ara paper permanent no àcid o paper d’arxiu. @ca
toolkit label: facsímil de preservació d’una manifestació @ca
toolkit definition: Manifestació que consisteix en una reproducció exacta en un suport de preservació de qualitat, com ara paper permanent no àcid o paper d’arxiu. @ca
definition: Liittää manifestaation manifestaatioon, joka koostuu täsmällisestä jäljennöksestä. Jäljennöksen valmistuksessa on käytetty arkistokelpoista materiaalia, esim. arkistopaperia. @fi
toolkit label: manifestaation säilytyskopio @fi
toolkit definition: Manifestaatio, joka koostuu arkistokelpoisesta materiaalista (esim. arkistopaperista) valmistetusta täsmällisestä jäljennöksestä. @fi
toolkit label: bevaringskopi av manifestasjon @no
toolkit definition: En manifestasjon som består av en eksakt reproduksjon på et medium av bevaringskvalitet, for eksempel syrefritt pergament eller arkivpapir. @no
label: έχει διατήρηση ομοιότυπου (εκδήλωση) @el
definition: Συνδέει μια εκδήλωση με μια εκδήλωση η οποία συνίσταται από μια αναπαραγωγή ακριβείας σε μέσα διατήρησης της ποιότητας, όπως μόνιμο αντιόξινο ή αρχειακό χαρτί. @el
toolkit label: διατήρηση ομοιότυπου (εκδήλωση) @el
toolkit definition: Μια εκδήλωση η οποία συνίσταται από μια αναπαραγωγή ακριβείας σε μέσα διατήρησης της ποιότητας, όπως μόνιμο αντιόξινο ή αρχειακό χαρτί. @el
has element type: 2
label: megjelenési forma megőrzési hasonmása a következő: @hu
definition: Hozzákapcsol egy megjelenési formát egy megjelenési formához, amely pontos újraalkotás olyan megőrzés-minőségű médiumon, mint például a savmentes tartós vagy archiváló papír. @hu
toolkit label: megjelenési forma megőrzési hasonmása: @hu
toolkit definition: Egy megjelenési forma, amely pontos újraalkotás olyan megőrzés-minőségű médiumon, mint például a savmentes tartós vagy archiváló papír. @hu
alternative label: preservation facsimile (manifestation)
label: manifestaation säilytyskopio @fi
label: har bevaringskopi av manifestasjon @no
definition: Relaterer en manifestasjon til en manifestasjon som består av en eksakt reproduksjon på et medium av bevaringskvalitet, for eksempel syrefritt pergament eller arkivpapir. @no
label: heeft conservatiefacsimile van manifestatie @nl
definition: Relateert een manifestatie aan een manifestatie die bestaat uit een exacte reproductie op media van conserveringskwaliteit, zoals zuurvrij permanent- of archiefpapier. @nl
alternative label: säilytyskopio (manifestaatio) @fi
label: له حفظ طبق الأصل لتجسيدة @ar
definition: يربط بين تجسيدة وتجسيدة عبارة عن استنساخ طبق الأصل على وسيط حفظ عالي الجودة، مثل الأوراق الخالية من الأحماض أو أوراق المحفوظات الأرشيفية. @ar
toolkit label: حفظ طبق الأصل لتجسيدة @ar
toolkit definition: تجسيدة عبارة عن استنساخ طبق الأصل على وسيط حفظ عالي الجودة، مثل الأوراق الخالية من الأحماض أو أوراق المحفوظات الأرشيفية. @ar
label: kehastuse säilituskoopia @et
definition: Seostab kehastuse kehastusega, mis on täpne reproduktsioon arhiivikvaliteediga meediumil, nt happevabal vananemiskindlal ehk arhiivipaberil. @et
toolkit label: kehastuse säilituskoopia @et
toolkit definition: Kehastus, mis on täpne reproduktsioon arhiivikvaliteediga meediumil, nt happevabal vananemiskindlal ehk arhiivipaberil. @et
label: ha come facsimile per la conservazione di manifestazione @it
definition: Correla una manifestazione a una manifestazione che consiste di una riproduzione esatta su mezzi idonei alla conservazione, come la carta permanente non acida o carta da archivio. @it
toolkit label: facsimile per la conservazione di manifestazione @it
toolkit definition: Manifestazione che consiste di una riproduzione esatta su mezzi idonei alla conservazione, come la carta permanente non acida o carta da archivio. @it
label: manifestācijas arhīvfaksimils @lv
definition: Sasaista manifestāciju ar manifestāciju, kas ir precīza reprodukcija saglabāšanai piemērotas kvalitātes vidē, piemēram, uz skābi nesaturoša papīra vai arhīvpapīra. @lv
toolkit label: manifestācijas arhīvfaksimils @lv
toolkit definition: Manifestācija - precīza reprodukcija saglabāšanai piemērotas kvalitātes vidē, piemēram, uz skābi nesaturoša papīra vai arhīvpapīra. @lv
alternative label: نسخة طبق الأصل على وسيط واقي (تجسيدة) @ar
alternative label: bevaringsfaksimile (manifestation) @da
alternative label: Bestandserhaltungsfaksimile @de
alternative label: facsímil de preservació (manifestació) @ca
alternative label: 保存摹真品（载体表现） @zh-hans
label: 有载体表现的保存摹真品 @zh-hans
definition: 将一种载体表现与由精确复制在诸如脱酸纸或档案纸等具有保存品质的媒介上的复制品组成的载体表现关联起来。 @zh-hans
toolkit label: 载体表现的保存摹真品 @zh-hans
toolkit definition: 由精确复制在诸如脱酸纸或档案纸等具有保存品质的媒介上的复制品组成的载体表现 @zh-hans

has dimensions
status: Published
definition: Relates a manifestation to a measurement of a carrier or a container of a manifestation.
type: Property
domain: C10007
lexical alias: dimensions.en
scope note: Dimensions include measurements of height, width, depth, length, gauge, and diameter.
instruction number: 3.5
toolkit label: dimensions
toolkit definition: A measurement of a carrier or a container of a manifestation.
label: a pour dimensions @fr
definition: Met une manifestation en relation avec une mesure d’un support matériel ou d’un conteneur d’une manifestation. @fr
scope note: Les dimensions comprennent les mesures de hauteur, de largeur, de profondeur, de longueur et de diamètre ainsi que le format (dans le cas d’un film ou d’une bande vidéo). @fr
toolkit definition: Mesure d’un support matériel ou d’un conteneur d’une manifestation. @fr
toolkit label: dimensiones @es
toolkit definition: Una medida de un portador o un contenedor de una manifestación. @es
label: har mått @sv
toolkit label: mått @sv
toolkit label: afmetingen @nl
toolkit definition: Een afmeting van een drager of een houder van een manifestatie. @nl
label: có kích thước @vi
definition: Liên kết biểu thị với độ đo của vật mang tin hoặc vỏ chứa của biểu thị. @vi
scope note: Kích thước bao gồm độ đo chiều cao, chiều rộng, chiều sâu, chiều dài, khoảng cách, và đường kính @vi
toolkit label: kích thước @vi
toolkit definition: Độ đo của vật mang tin hoặc vỏ chứa của biểu thị. @vi
scope note: Afmetingen kunnen de gemeten waarde omvatten van hoogte, breedte, lengte, diepte en diameter. @nl
label: har størrelse @da
definition: Relaterer en manifestation til et mål for en bærer eller en container af en manifestation. @da
scope note: Størrelse omfatter mål på højde, bredde, dybde, længde, omfang og diameter. @da
toolkit label: størrelse @da
toolkit definition: Mål for en bærer eller en container af en manifestation. @da
label: hat Maße @de
definition: Setzt eine Manifestation in Beziehung zu einer Abmessung eines Datenträgers oder eines Behältnisses einer Manifestation. @de
scope note: Darunter fallen Abmessungen der Höhe, Breite, Tiefe, Länge, Spurbreite und des Durchmessers. @de
toolkit label: Maße @de
toolkit definition: Eine Abmessung eines Datenträgers oder eines Behältnisses einer Manifestation. @de
label: té com a dimensions @ca
definition: Relaciona una manifestació amb una mida d’un suport físic o d’un contenidor d’una manifestació. @ca
scope note: Les dimensions inclouen les mesures d’alçada, amplada, profunditat, llargada, format i diàmetre. @ca
toolkit definition: Mida d’un suport físic o d’un contenidor d’una manifestació. @ca
definition: Liittää manifestaation tallenteen tai säilytyskotelon mittoihin. @fi
toolkit label: koko @fi
toolkit definition: Tallenteen tai säilytyskotelon mitat. @fi
toolkit definition: Målene til manifestasjonens bærer eller beholder. @no
label: έχει διαστάσεις @el
definition: Συνδέει μια εκδήλωση με μια μέτρηση ενός φορέα αποθήκευσης ή ενός περιέκτη μιας εκδήλωσης. @el
scope note: Οι διαστάσεις περιλαμβάνουν τις μετρήσεις του ύψους, του πλάτους, του μήκους, του πάχους και της διαμέτρου. @el
toolkit label: διαστάσεις @el
toolkit definition: Μια μέτρηση ενός φορέα αποθήκευσης ή ενός περιέκτη μιας εκδήλωσης. @el
has element type: 6
label: mérete a következő: @hu
definition: Hozzákapcsol egy megjelenési formát egy megjelenési forma hordozójának vagy tárolójának méretéhez. @hu
scope note: mérete: @hu
toolkit label: Egy megjelenési forma hordozójának vagy tárolójának mérete. @hu
toolkit definition: A méretarányok magukba foglalják a magasság, szélesség, mélység, hosszúság, űrtartalom és belső átmérő méreteit. @hu
scope note: Koko käsittää korkeuden, leveyden, syvyyden, pituuden, paksuuden ja halkaisijan. @fi
label: koko @fi
definition: Relaterer en manifestasjon til målene til manifestasjonens bærer eller beholder. @no
scope note: Målene inkluderer høyde, bredde, dybde, lengde, tykkelse og diameter. @no
label: heeft afmetingen @nl
definition: Relateert een manifestatie aan een afmeting van een drager of een houder van een manifestatie. @nl
label: له أبعاد @ar
definition: يربط بين تجسيدة ومقاييس حامل أو حاوية خاصة بتجسيدة. @ar
scope note: تشمل الأبعاد قياسات الارتفاع والعرض والسمك والطول والحجم والقطر. @ar
toolkit label: أبعاد @ar
toolkit definition: مقاييس حامل أو حاوية خاصة بتجسيدة. @ar
label: mõõtmed @et
definition: Seostab kehastuse kehastuse kandja või ümbrise mõõtudega. @et
scope note: Mõõtmed hõlmavad kõrgust, laiust, sügavust, pikkust ja läbimõõtu. @et
toolkit label: mõõtmed @et
toolkit definition: Kehastuse kandja või ümbrise mõõdud. @et
label: ha come dimensioni @it
definition: Correla una manifestazione a misure di un supporto o contenitore di una manifestazione. @it
scope note: Le dimensioni comprendono le misure di altezza, larghezza, profondità, lunghezza, spessore e diametro. @it
toolkit label: dimensioni @it
toolkit definition: Misura di un supporto o contenitore di una manifestazione. @it
label: izmēri @lv
definition: Sasaista manifestāciju ar nesēja(-u) un/vai manifestācijas ietveres izmēru. @lv
scope note: Ietver augstuma, platuma, dziļuma, garuma, biezuma un diametra mērījumus. @lv
toolkit label: izmēri @lv

has details of emulsion on microfilm and microfiche
status: Published
type: Property
lexical alias: detailsOfEmulsionOnMicrofilmAndMicrofiche.en
definition: Relates a manifestation to details of a suspension of light-sensitive chemicals that is used as a coating on a microfilm or microfiche.
domain: C10007
instruction number: 3.7.2.4
toolkit label: details of emulsion on microfilm and microfiche
toolkit definition: Details of a suspension of light-sensitive chemicals that is used as a coating on a microfilm or microfiche.
toolkit label: detalles de emulsión en microfilm y microficha @es
toolkit definition: Detalles de una suspensión de sustancias químicas sensibles a la luz que se utiliza como recubrimiento en un microfilm o microficha. @es
sub property of: has details of applied material
label: har detaljerad information om emulsion på microfilm och microfiche @sv
toolkit label: detaljerad information om emulsion på microfilm och microfiche @sv
toolkit label: details van de emulsie op microfilm en microfiche @nl
toolkit definition: Details van een suspensie van lichtgevoelige chemicaliën die gebruikt worden als coating van een microfilm of microfiche. @nl
label: có chi tiết của thể sữa của vi phim và vi phiếu @vi
definition: Liên kết biểu thị với chi tiết của thể vẩn của hoá chất nhậy sáng được sử dụng như là lớp phủ trên vi phim hoặc vi phiếu. @vi
toolkit label: chi tiết của thể sữa của vi phim và vi phiếu @vi
toolkit definition: Chi tiết của thể vẩn của hoá chất nhậy sáng được sử dụng như là lớp phủ trên vi phim hoặc vi phiếu. @vi
label: har detaljer om emulsion på mikrofilm og mikrofiche @da
definition: Relaterer en manifestation til detaljer om opslæmmede lysfølsomme kemikalier, som anvendes som belægning på en mikrofilm eller mikrofiche. @da
toolkit label: detaljer om emulsion på mikrofilm og mikrofiche @da
toolkit definition: Detaljer om opslæmmede lysfølsomme kemikalier, som anvendes som belægning på en mikrofilm eller mikrofiche. @da
label: hat Details zur Emulsionsschicht auf Mikrofilm und Mikrofiche @de
definition: Setzt eine Manifestation in Beziehung zu den Details zu einer Suspension aus lichtempfindlichen Chemikalien, die als Beschichtung eines Mikrofilms oder eines Mikrofiches verwendet wird. @de
toolkit label: Details zur Emulsionsschicht auf Mikrofilm und Mikrofiche @de
toolkit definition: Details zu einer Suspension aus lichtempfindlichen Chemikalien, die als Beschichtung eines Mikrofilms oder eines Mikrofiches verwendet wird. @de
label: té com a particularitats d’emulsió sobre microfilm i microfitxa @ca
definition: Relaciona una manifestació amb les particularitats d’una suspensió de substàncies químiques sensibles a la llum que s’usa com a revestiment d’un microfilm o una microfitxa. @ca
toolkit label: particularitats d’emulsió sobre microfilm i microfitxa @ca
toolkit definition: Particularitats d’una suspensió de substàncies químiques sensibles a la llum que s’usa com a revestiment d’un microfilm o una microfitxa. @ca
definition: Liittää manifestaation tarkempiin tietoihin mikrofilmin tai mikrokortin valoherkkiä kemikaaleja sisältävästä pinnoitteesta. @fi
toolkit label: mikrokortin ja mikrofilmin emulsion tarkemmat tiedot @fi
toolkit definition: Tarkemmat tiedot mikrofilmin tai mikrokortin valoherkkiä kemikaaleja sisältävästä pinnoitteesta. @fi
toolkit label: detaljer vedrørende emulsjon på mikrofilm og mikrofilmkort @no
toolkit definition: Detaljer vedrørende en suspensjon av lysfølsomme kjemikalier som er brukt som belegg på mikrofilm eller mikrofilmkort. @no
label: έχει λεπτομέρειες του γαλακτώματος στη μικροταινία και στο μικροδελτίο @el
definition: Συνδέει μια εκδήλωση με τις λεπτομέρειες ενός αιωρήματος χαμηλής ευαισθησίας χημικών που χρησιμοποιείται ως επίστρωση πάνω σε μικροταινία ή σε μικροδελτίο. @el
toolkit label: λεπτομέρειες του γαλακτώματος στη μικροταινία και το μικροδελτίο @el
toolkit definition: Λεπτομέρειες ενός αιωρήματος χαμηλής ευαισθησίας χημικών που χρησιμοποιείται ως επίστρωση πάνω σε μικροταινία ή σε μικροδελτίο. @el
label: a pour particularités d’une émulsion sur microfilm et microfiche @fr
definition: Met une manifestation en relation avec des particularités d’une suspension de produits chimiques photosensibles qui est utilisée comme revêtement sur un microfilm ou une microfiche. @fr
toolkit label: particularités d’une émulsion sur microfilm et microfiche @fr
toolkit definition: Particularités d’une suspension de produits chimiques photosensibles qui est utilisée comme revêtement sur un microfilm ou une microfiche. @fr
has element type: 6
label: mikrofilmen és mikrofilmlapon levő emulzió részletei a következők: @hu
definition: Hozzákapcsol egy megjelenési formát mikrofilmen vagy mikrofilmlapon bevonatként használt fényérzékeny vegyszerek szuszpenziójának részleteihez. @hu
toolkit label: mikrofilmen és mikrofilmlapon levő emulzió részletei: @hu
toolkit definition: Mikrofilmen vagy mikrofilmlapon bevonatként használt fényérzékeny vegyszerek szuszpenziójának részletei. @hu
label: mikrokortin ja mikrofilmin emulsion tarkemmat tiedot @fi
label: har detaljer vedrørende emulsjon på mikrofilm og mikrofilmkort @no
definition: Relaterer en manifestasjon til detaljer vedrørende en suspensjon av lysfølsomme kjemikalier som er brukt som belegg på mikrofilm eller mikrofilmkort. @no
label: heeft details van de emulsie op microfilm en microfiche @nl
definition: Relateert een manifestatie aan details van een suspensie van lichtgevoelige chemicaliën die gebruikt worden als coating van een microfilm of microfiche. @nl
label: له تفاصيل عن طبقة حساسة على الميكروفيلم والميكروفيش @ar
definition: يربط بين تجسيدة وتفاصيل المواد الكيميائية الحساسة للضوء التي تستخدم كغلاف على ميكروفيلم أو ميكروفيش. @ar
toolkit label: تفاصيل عن طبقة حساسة على الميكروفيلم والميكروفيش @ar
toolkit definition: تفاصيل المواد الكيميائية الحساسة للضوء التي تستخدم كغلاف على ميكروفيلم أو ميكروفيش. @ar
label: mikrofilmi ja mikrokaardi emulsiooni täpsustus @et
definition: Seostab kehastuse täpsemate andmetega valgustundliku kemikaali kihi kohta, mida on kasutatud mikrofilmi või mikrokaardi pinna katmiseks. @et
toolkit label: mikrofilmi ja mikrokaardi emulsiooni täpsustus @et
toolkit definition: Täpsemad andmed valgustundliku kemikaali kihi kohta, mida on kasutatud mikrofilmi või mikrokaardi pinna katmiseks. @et
label: ha come particolari relativi all'emulsione su microfilm e microfiche @it
definition: Correla una manifestazione ai particolari relativi a una sospensione di sostanza chimica fotosensibile utilizzata come uno strato su un microfilm o una microfiche. @it
toolkit label: particolari relativi all'emulsione su microfilm e microfiche @it
toolkit definition: Particolari relativi a una sospensione di sostanza chimica fotosensibile utilizzata come uno strato su un microfilm o una microfiche. @it
label: detalizēti par mikrofilmas un mikrofišas emulsijas pārklājumu @lv
definition: Sasaista manifestāciju ar sīkāku informāciju par gaismas jutīgu ķīmisku suspensiju, ko lieto mikrofilmu vai mikrofišu pārklājumos. @lv
toolkit label: detalizēti par mikrofilmas un mikrofišas emulsijas pārklājumu @lv
toolkit definition: Sīkāka informācija par gaismas jutīgu ķīmisku suspensiju, ko lieto mikrofilmu vai mikrofišu pārklājumos. @lv
label: 有缩微胶卷和缩微平片上的乳剂的细节 @zh-hans
definition: 将一种载体表现与缩微胶卷或缩微平片表面感光化合物的悬浮涂层的细节关联起来。 @zh-hans
toolkit label: 缩微胶卷和缩微平片上的乳剂的细节 @zh-hans
toolkit definition: 缩微胶卷或缩微平片表面感光化合物的悬浮涂层的细节 @zh-hans
label: mikrofilm ve mikrofiş üzerindeki emülsiyonun ayrıntıları ile ilişkilidir @tr
definition: Bir gösterimi, üzerinde kaplama olarak kullanılan ışığa duyarlı kimyasallardan oluşan bir mikrofilm veya mikrofiş.süspansiyonun ayrıntılarıyla ilişkilendirir.. @tr
toolkit label: mikrofilm ve mikrofiş üzerindeki emülsiyon ayrıntıları @tr
toolkit definition: Bir mikrofilm veya mikrofiş üzerinde kaplama olarak kullanılan ışığa duyarlı kimyasalların süspansiyonunun ayrıntıları. @tr
label: tiene detalles de emulsión en microfilm y microficha @es

has projection characteristic of motion picture film
status: Published
definition: Relates a manifestation to a technical specification relating to the projection of a motion picture film.
type: Property
domain: C10007
lexical alias: projectionCharacteristicOfMotionPictureFilm.en
instruction number: 3.17
toolkit label: projection characteristic of motion picture film
toolkit definition: A technical specification relating to the projection of a motion picture film.
label: a pour caractéristique de projection d’un film cinématographique @fr
definition: Met une manifestation en relation avec une spécification technique relative à la projection d’un film cinématographique. @fr
toolkit label: caractéristique de projection d’un film cinématographique @fr
toolkit definition: Spécification technique relative à la projection d’un film cinématographique. @fr
toolkit label: característica de proyección de una película cinematográfica @es
toolkit definition: Una especificación técnica relativa a la proyección de una película cinematográfica. @es
label: har projektionskaraktäristika för film @sv
toolkit label: projektionskaraktäristika för film @sv
toolkit label: kenmerken van de projectie van speelfilm @nl
toolkit definition: Een technische specificatie gerelateerd aan de projectie van een speelfilm. @nl
label: có đặc trưng chiếu của phim điện ảnh @vi
definition: Liên kết biểu thị với đặc tính kỹ thuật liên quan tới chiếu phim điện ảnh. @vi
toolkit label: đặc trưng chiếu của phim điện ảnh @vi
toolkit definition: Đặc tính kỹ thuật liên quan tới chiếu phim điện ảnh. @vi
label: har projiceringskarakteristika for spillefilm @da
definition: Relaterer en manifestation til en teknisk specifikation, som relaterer til projiceringen af en spillefilm. @da
toolkit label: projiceringskarakteristika for spillefilm @da
toolkit definition: Teknisk specifikation, som relaterer til projiceringen af en spillefilm. @da
label: hat Projektionseigenschaft von Filmen @de
definition: Setzt eine Manifestation in Beziehung zu einer technischen Spezifikation, die sich auf die Projektion eines Films bezieht. @de
toolkit label: Projektionseigenschaft von Filmen @de
toolkit definition: Eine technische Spezifikation, die sich auf die Projektion eines Films bezieht. @de
label: té com a característica de projecció d’una pel·lícula cinematogràfica @ca
definition: Relaciona una manifestació amb una especificació tècnica relativa a la projecció d’una pel·lícula cinematogràfica. @ca
toolkit label: característica de projecció d’una pel·lícula cinematogràfica @ca
toolkit definition: Especificació tècnica relativa a la projecció d’una pel·lícula cinematogràfica. @ca
definition: Liittää manifestaation elokuvafilmin projisointia koskevaan tekniseen määritykseen. @fi
toolkit label: elokuvafilmin projisointiominaisuudet @fi
toolkit definition: Elokuvafilmin projisointia koskeva tekninen määritys. @fi
toolkit label: projeksjonsegenskaper for spillefilm @no
toolkit definition: En teknisk spesifikasjon knyttet til projeksjonen av en spillefilm. @no
label: έχει χαρακτηριστικό της προβολής της κινηματογραφικής ταινίας @el
definition: Συνδέει μια εκδήλωση με μια τεχνική προδιαγραφή που σχετίζεται με την προβολή μιας κινηματογραφικής ταινίας. @el
toolkit label: χαρακτηριστικό προβολής της κινηματογραφικής ταινίας @el
toolkit definition: Μια τεχνική προδιαγραφή που σχετίζεται με την προβολή μιας κινηματογραφικής ταινίας. @el
label: mozgókép vetítési jellemzője a következő: @hu
definition: Hozzákapcsol egy megjelenési formát egy műszaki specifikációhoz, amely egy filmen lévő mozgókép vetítéséhez kapcsolódik. @hu
toolkit label: mozgókép vetítési jellemzője: @hu
toolkit definition: Egy műszaki specifikáció, amely egy filmen lévő mozgókép vetítéséhez kapcsolódik. @hu
label: elokuvafilmin projisointiominaisuudet @fi
label: har projeksjonsegenskaper for spillefilm @no
definition: Relaterer en manifestasjon til en teknisk spesifikasjon knyttet til projeksjonen av en spillefilm. @no
label: heeft kenmerken van de projectie van speelfilm @nl
definition: Relateert een manifestatie aan een technische specificatie gerelateerd aan de projectie van een speelfilm. @nl
label: له خاصية عرض لفيلم صور متحركة @ar
definition: يربط بين تجسيدة وخصائص فنية متعلقة بعرض فيلم صور متحركة. @ar
toolkit label: خاصية عرض لفيلم صور متحركة @ar
toolkit definition: خصائص فنية متعلقة بعرض فيلم صور متحركة. @ar
label: kinofilmi projitseerimistunnus @et
definition: Seostab kehastuse tehnilise kirjeldusega, mis puudutab kinofilmi projitseerimist. @et
toolkit label: kinofilmi projitseerimistunnus @et
toolkit definition: Tehniline kirjeldus, mis puudutab kinofilmi projitseerimist. @et
label: ha come caratteristica di proiezione di pellicola cinematografica @it
definition: Correla una manifestazione a una specifica tecnica relativa alla proiezione di un film. @it
toolkit label: caratteristica di proiezione di pellicola cinematografica @it
toolkit definition: Specifica tecnica relativa alla proiezione di un film. @it
label: kinofilmas demonstrēšanas raksturlielumi @lv
definition: Sasaista manifestāciju ar tehnisko specifikāciju, kas attiecas uz kinofilmu demonstrēšanu. @lv
toolkit label: kinofilmas demonstrēšanas raksturlielumi @lv
toolkit definition: Tehniskā specifikācija kinofilmu demonstrēšanai. @lv
has element type: 5
label: 有电影胶卷的投影特征 @zh-hans
definition: 将一种载体表现与和一种电影胶卷的投影有关的技术规格关联起来。 @zh-hans
toolkit label: 电影胶卷的投影特征 @zh-hans
toolkit definition: 和一种电影胶卷的投影有关的技术规格 @zh-hans
label: sinema filminin projeksiyon özelliği ile ilişkilidir @tr
definition: Bir gösterimi, bir sinema filminin gösterimiyle ilgili teknik bir teknik ayrıntılarıyla ilişkilendirir. @tr
toolkit label: sinema filmi projeksiyon özelliği @tr
toolkit definition: Bir sinema filminin projeksiyonuna ilişkin teknik şartname. @tr
label: tiene la característica de proyección de una película cinematográfica @es
definition: Relaciona una manifestación con una especificación técnica relativa a la proyección de una película cinematográfica. @es

has name of agent of manifestation
status: Published
sub property of: has related nomen of manifestation
type: Property
lexical alias: nameOfAgentOfManifestation.en
definition: Relates a manifestation to a nomen that is a name of an agent who is responsible for distributing, printing, duplicating, casting, publishing, releasing, or issuing a published manifestation, or inscribing, fabricating, constructing, or other method of producing an unpublished manifestation.
domain: C10007
toolkit label: name of agent of manifestation
toolkit definition: A nomen that is a name of an agent who is responsible for distributing, printing, duplicating, casting, publishing, releasing, or issuing a published manifestation, or inscribing, fabricating, constructing, or other method of producing an unpublished manifestation.
has element type: 3
label: manifestaation toimijan nimi @fi
definition: Liittää manifestaation nomeniin, joka on julkaistun manifestaation jakelusta, painamisesta, monistamisesta, kirjasinten valamisesta, kuntantamisesta, julkaisemisesta tai ilmestymisestä vastuussa olevan toimijan nimi tai julkaisemattoman manifestaation kaivertamisesta, valmistamisesta, koostamisesta tai muusta valmistustavasta vastuussa olevan toimijan nimi.. @fi
toolkit label: manifestaation toimijan nimi @fi
toolkit definition: Nomen, joka on julkaistun manifestaation jakelusta, painamisesta, monistamisesta, kirjasinten valamisesta, kuntantamisesta, julkaisemisesta tai ilmestymisestä vastuussa olevan toimijan nimi tai julkaisemattoman manifestaation kaivertamisesta, valmistamisesta, koostamisesta tai muusta valmistustavasta vastuussa olevan toimijan nimi. @fi
label: har navn på agent for manifestasjon @no
definition: Relaterer en manifestasjon til et navn på en agent som er ansvarlig for distribusjon, trykking, mangfoldiggjøring, rollebesettelse, utgivelse, tilgjengeliggjøring, utstedelse etc. av en publisert manifestasjon, eller inskripsjon, fabrikasjon, konstruksjon etc. av en upublisert manifestasjon. @no
toolkit label: navn på agent for manifestasjon @no
toolkit definition: Et navn på en agent som er ansvarlig for distribusjon, trykking, mangfoldiggjøring, rollebesettelse, utgivelse, tilgjengeliggjøring, utstedelse etc. av en publisert manifestasjon, eller inskripsjon, fabrikasjon, konstruksjon etc. av en upublisert manifestasjon. @no
label: a pour nom d’agent d’une manifestation @fr
definition: Met une manifestation en relation avec un nomen qui est un nom d’un agent responsable de la diffusion ou de la distribution, de l’impression, de la reproduction, du moulage, de la publication, de la mise à disposition ou de l’édition d’une manifestation publiée ou de la scription, de la fabrication, de la construction ou de toute autre méthode de production d’une manifestation non publiée. @fr
toolkit label: nom d’agent d’une manifestation @fr
toolkit definition: Nomen qui est un nom d’un agent responsable de la diffusion ou de la distribution, de l’impression, de la reproduction, du moulage, de la publication, de la mise à disposition ou de l’édition d’une manifestation publiée ou de la scription, de la fabrication, de la construction ou de toute autre méthode de production d’une manifestation non publiée. @fr
label: heeft naam van actor van manifestatie @nl
definition: Relateert een manifestatie aan een nomen dat is een naam van een actor die verantwoordelijk is voor het distribueren, drukken, dupliceren, gieten, uitgeven, uitbrengen of uitvaardigen van een gepubliceerde manifestatie, of afschrijven, fabriceren, construeren of andere methode van het produceren van een ongepubliceerde manifestatie. @nl
toolkit label: naam van actor van manifestatie @nl
toolkit definition: Een nomen dat is een naam van een actor die verantwoordelijk is voor het distribueren, drukken, dupliceren, gieten, uitgeven, uitbrengen of uitvaardigen van een gepubliceerde manifestatie, of afschrijven, fabriceren, construeren of andere methode van het produceren van een ongepubliceerde manifestatie. @nl
label: له اسم وكيل لتجسيدة @ar
definition: يربط بين تجسيدة واسم وكيل مسئول عن التوزيع، أو الطباعة، أو النسخ، أو الصب، أو النشر، أو الإصدار،إلخ. لتجسيدة منشورة. أو التسجيل، أو التصنيع، أو الإنشاء، إلخ. لتجسيدة غير منشورة. @ar
toolkit label: اسم وكيل لتجسيدة @ar
toolkit definition: اسم وكيل مسئول عن التوزيع، أو الطباعة، أو النسخ، أو الصب، أو النشر، أو الإصدار،إلخ. لتجسيدة منشورة. أو التسجيل، أو التصنيع، أو الإنشاء، إلخ. لتجسيدة غير منشورة. @ar
label: té com a nom d’agent d’una manifestació @ca
definition: Relaciona una manifestació amb un nomen que és un nom d’un agent que és responsable de la distribució, la impressió, la reproducció, el modelat, la publicació, la posada en circulació o l’emissió d’una manifestació publica o de la inscripció, la fabricació, la construcció o un altre mètode de producció d’una manifestació no publicada. @ca
toolkit label: nom d’agent d’una manifestació @ca
toolkit definition: Nomen que és un nom d’un agent que és responsable de la distribució, la impressió, la reproducció, el modelat, la publicació, la posada en circulació o l’emissió d’una manifestació publica o de la inscripció, la fabricació, la construcció o un altre mètode de producció d’una manifestació no publicada. @ca
label: har navn på agent af manifestation @da
definition: Relaterer en manifestation til et navn på en agent, som er ansvarlig for distribution, trykning, duplikering, støbning, publicering, frigivelse, udgivelse etc. af en publiceret manifestation eller indskrift, fremstilling, konstruktion, ect. af en upubliceret manifestation. @da
toolkit label: navn på agent af manifestation @da
toolkit definition: Navn på en agent, som er ansvarlig for distribution, trykning, duplikering, støbning, publicering, frigivelse, udgivelse etc. af en publiceret manifestation, eller indskrift, fremstilling, konstruktion, ect. af en upubliceret manifestation. @da
label: kehastuse tegija nimi @et
definition: Seostab kehastuse selle tegija nimega, kes vastutab avaldatud kehastuse levitamise, trükkimise, paljundamise, valamise, avaldamise, väljalaskmise, väljaandmise vms eest või avaldamata kehastuse inskribeerimise, tootmise, ehitamise vms eest. @et
toolkit label: kehastuse tegija nimi @et
toolkit definition: Selle tegija nimi, kes vastutab avaldatud kehastuse levitamise, trükkimise, paljundamise, valamise, avaldamise, väljalaskmise, väljaandmise vms eest või avaldamata kehastuse inskribeerimise, tootmise, ehitamise vms eest. @et
label: hat Namen eines Akteurs einer Manifestation @de
definition: Setzt eine Manifestation in Beziehung zu einem Namen eines Akteurs, der für den Vertrieb, den Druck, die Vervielfältigung, den Guss, das Veröffentlichen, die Freigabe oder die Herausgabe einer veröffentlichten Manifestation oder der für das Gravieren, Fabrizieren, Konstruieren oder eine andere Entstehungsmethode einer unveröffentlichten Manifestation verantwortlich ist. @de
toolkit label: Name eines Akteur einer Manifestation @de
toolkit definition: Ein Name eines Akteurs, der für den Vertrieb, den Druck, die Vervielfältigung, den Guss, das Veröffentlichen, die Freigabe oder die Herausgabe einer veröffentlichten Manifestation oder der für das Gravieren, Fabrizieren, Konstruieren oder eine andere Entstehungsmethode einer unveröffentlichten Manifestation verantwortlich ist. @de
label: megjelenési forma ágensének neve a következő: @hu
definition: Hozzákapcsol egy megjelenési formát egy nomenhez, amely egy olyan ágens neve, amely felelős egy kiadott megjelenési forma terjesztéséért, nyomtatásáért, sokszorosításáért, öntéséért, kiadásáért, kibocsájtásáért, megjelentetéséért stb., vagy egy kiadatlan megjelenési forma írásáért, összeállításáért, készítéséért, vagy egyéb módú előállításáért. @hu
toolkit label: megjelenési forma ágensének neve @hu
toolkit definition: Egy nomen, amely egy olyan ágens neve, amely felelős egy kiadott megjelenési forma terjesztéséért, nyomtatásáért, sokszorosításáért, öntéséért, kiadásáért, kibocsájtásáért, megjelentetéséért stb., vagy egy kiadatlan megjelenési forma írásáért, összeállításáért, készítéséért, vagy egyéb módú előállításáért. @hu
label: ha come nome di agente di manifestazione @it
definition: Correla una manifestazione a un nome di un agente responsabile della distribuzione, stampa, duplicazione, fusione, pubblicazione, diffusione, emissione, etc. di una manifestazione pubblicata, o dell'iscrizione, fabbricazione, costruzione, etc. di una manifestazione non pubblicata. @it
toolkit label: nome di agente di manifestazione @it
toolkit definition: Nome di un agente responsabile della distribuzione, stampa, duplicazione, fusione, pubblicazione, diffusione, emissione, etc. di una manifestazione pubblicata, o dell'iscrizione, fabbricazione, costruzione, etc. di una manifestazione non pubblicata. @it
label: manifestācijas aģenta vārds/nosaukums @lv
definition: Sasaista manifestāciju ar nomenu, kas ir vārds/nosaukums aģentam, kurš ir atbildīgs par publicētas manifestācijas izplatīšanu, iespiešanu, pavairošanu, publicēšanu, izdošanu u.tml. vai nepublicētas manifestācijas pierakstīšanu, izgatavošanu, izveidošanu u.tml. @lv
toolkit label: manifestācijas aģenta vārds/nosaukums @lv
toolkit definition: Vārds/nosaukums aģentam, kurš ir atbildīgs par publicētas manifestācijas izplatīšanu, iespiešanu, pavairošanu, publicēšanu, izdošanu u.tml. vai nepublicētas manifestācijas pierakstīšanu, izgatavošanu, izveidošanu u.tml. @lv
label: 有载体表现的行为者的名称 @zh-hans
definition: 将一种载体表现与作为负责一种出版载体表现的经销、印刷、复制、铸造、出版、发布、或发行、或者一种非出版载体表现的镌刻、制造、构造或其他方式制作的一个行为者的名称的一个命名关联起来。 @zh-hans
toolkit label: 载体表现的行为者的名称 @zh-hans
toolkit definition: 负责一种出版载体表现的经销、印刷、复制、铸造、出版、发布、或发行、或者一种非出版载体表现的镌刻、制造、构造或其他方式制作的一个行为者的名称 @zh-hans
label: gösterim temsilcisinin adı ile ilişkilidir @tr
definition: Bir gösterimi, yayınlanmış bir örneği dağıtmak, basmak, çoğaltmak, dökmek, yayınlamak, serbest bırakmak veya yayınlamaktan veya yayınlanmamış bir bildirimi yazmak, imal etmek, inşa etmek veya başka bir yöntemle üretmekten sorumlu olan bir temsilcinin adı olan bir isimle ilişkilendirir. @tr
toolkit label: Gösterim temsilcisinin adı @tr
toolkit definition: Yayınlanmış bir öğrenin dağıtımından, basımından, çoğaltılmasından, dökümünden, yayınlanmasından, serbest bırakılmasından veya piyasaya çıkarılmasından ya da yayınlanmamış bir bildirinin yazılmasından, fabrikasyonundan, inşa edilmesinden veya başka bir yöntemle üretilmesinden sorumlu olan bir temsilcinin ismidir. @tr
label: tiene nombre de agente de manifestación @es
definition: Relaciona una manifestación con un nomen que es el nombre de un agente que es responsable de distribuir, imprimir, duplicar, emitir, publicar, liberar o emitir una manifestación publicada, o inscribir, fabricar, construir u otro método para producir una manifestación no publicada. . @es
toolkit label: nombre de agente de manifestación @es
toolkit definition: Un nomen que es el nombre de un agente que es responsable de distribuir, imprimir, duplicar, emitir, publicar, liberar o emitir una manifestación publicada, o inscribir, fabricar, construir u otro método para producir una manifestación no publicada. . @es
has subproperty: has name of producer
has subproperty: has name of manufacturer
has subproperty: has name of publisher
has subproperty: has name of distributor
has subproperty: P30297

has note on numbering of sequence
status: Published
definition: Relates a manifestation to a note on manifestation that provides information on the range of designators that is used to indicate a sequence of the individual parts or iterations of a manifestation.
type: Property
domain: C10007
sub property of: has note on manifestation
lexical alias: noteOnNumberingOfSequence.en
instruction number: 2.17.5
toolkit label: note on numbering of sequence
toolkit definition: A note on manifestation that provides information on the range of designators that is used to indicate a sequence of the individual parts or iterations of a manifestation.
label: a pour note sur une numérotation d’une séquence @fr
definition: Met une manifestation en relation avec une note sur une manifestation qui fournit de l’information sur la fourchette d’indicateurs servant à indiquer une séquence des parties ou itérations individuelles d’une manifestation. @fr
toolkit label: note sur une numérotation d’une séquence @fr
toolkit definition: Note sur une manifestation qui fournit de l’information sur la fourchette d’indicateurs servant à indiquer une séquence des parties ou itérations individuelles d’une manifestation. @fr
toolkit label: nota sobre la numeración de la secuencia @es
toolkit definition: Una nota sobre la manifestación que proporciona información sobre el rango de designadores que se utiliza para indicar una secuencia de las partes individuales o iteraciones de una manifestación. @es
label: har anmärkning om numrering av seriella resurser @sv
toolkit label: anmärkning om numrering av seriella resurser @sv
toolkit label: noot bij nummering van volgorde @nl
toolkit definition: Een noot bij manifestatie die informatie verschaft over de reeks van aanduidingen die gebruikt worden om de volgorde aan te geven van de individuele delen of iteraties van een manifestatie. @nl
label: có ghi chú về đánh số ấn phẩm nhiều kỳ @vi
definition: Liên kết biểu thị với ghi chú cung cấp thông tin về đánh số của số hoặc phần đầu tiên và/hoặc cuối cùng, về đánh số phức hợp hoặc bất quy bao gồm cả đánh số lỗi, về thời kỳ được bao quát bởi tập, số, phần, v.v..., hoặc về thông tin khác liên quan tới đánh số ấn phẩm nhiều kỳ. @vi
toolkit label: ghi chú về đánh số ấn phẩm nhiều kỳ @vi
toolkit definition: Ghi chú cung cấp thông tin về đánh số của số hoặc phần đầu tiên và/hoặc cuối cùng, về đánh số phức hợp hoặc bất quy bao gồm cả đánh số lỗi, về thời kỳ được bao quát bởi tập, số, phần, v.v..., hoặc về thông tin khác liên quan tới đánh số ấn phẩm nhiều kỳ. @vi
label: har note om nummerering af rækkefølge @da
definition: Relaterer en manifestation til en note om manifestation, som giver information om de forskellige betegnere, som anvendes til at indikere en rækkefølge af de enkelte dele eller iterationer af en manifestation. @da
toolkit label: note om nummerering af rækkefølge @da
toolkit definition: Note om manifestation, som giver information om de forskellige betegnere, som anvendes til at indikere en rækkefølge af de enkelte dele eller iterationer af en manifestation. @da
label: hat Anmerkung zur Zählung einer fortlaufenden Ressource @de
definition: Setzt eine Manifestation in Beziehung zu einer Anmerkung zur Manifestation, die Informationen zur Reihenfolge der einzelnen Ausgaben einer fortlaufenden Ressource enthält. @de
toolkit label: Anmerkung zur Zählung einer fortlaufenden Ressource @de
toolkit definition: Eine Anmerkung zur Manifestation, die Informationen zur Reihenfolge der einzelnen Ausgaben einer fortlaufenden Ressource enthält. @de
label: té com a nota sobre numeració d’una seqüència @ca
definition: Relaciona una manifestació amb una nota sobre una manifestació que proporciona la informació sobre el rang dels designadors que s’usa per indicar una seqüència de les parts individuals o les iteracions d’una manifestació. @ca
toolkit label: nota sobre numeració d’una seqüència @ca
toolkit definition: Nota sobre una manifestació que proporciona la informació sobre el rang dels designadors que s’usa per indicar una seqüència de les parts individuals o les iteracions d’una manifestació. @ca
definition: Liittää manifestaation huomautukseen, joka sisältää tietoa määritteiden jonosta. Määritteiden jonoa käytetään ilmaisemaan manifestaation yksittäisten osien tai iteraatioiden peräkkäisyyttä. @fi
toolkit label: huomautus numerointijaksosta @fi
toolkit definition: Huomautus, joka sisältää tietoa määritteiden jonosta. Määritteiden jonoa käytetään ilmaisemaan manifestaation yksittäisten osien tai iteraatioiden peräkkäisyyttä. @fi
toolkit label: note om nummerering av sekvens @no
toolkit definition: En note om manifestasjon som gir informasjon om spennet av betegnelser som er brukt for å indikere en sekvens av enkeltstående deler eller versjoner av en manifestasjon. @no
label: έχει σημείωση στην αρίθμηση των περιοδικών @el
definition: Συνδέει μια εκδήλωση με μια σημείωση που παρέχει τις πληροφορίες για την αρίθμηση του πρώτου ή/και τελευταίου τεύχους ή μέρους, για τη σύνθετη ή ακανόνιστη αρίθμηση περιλαμβανομένων των λαθών στην αρίθμηση, για την περίοδο που καλύπτεται από έναν τόμο, τεύχος, μέρος κ.λπ. ή για άλλες πληροφορίες που σχετίζονται με την αρίθμηση των περιοδικών. @el
toolkit label: σημείωση στην αρίθμηση των περιοδικών @el
toolkit definition: Μια σημείωση που παρέχει τις πληροφορίες για την αρίθμηση του πρώτου ή/και τελευταίου τεύχους ή μέρους, για τη σύνθετη ή ακανόνιστη αρίθμηση περιλαμβανομένων των λαθών στην αρίθμηση, για την περίοδο που καλύπτεται από έναν τόμο, τεύχος, μέρος κ.λπ. ή για άλλες πληροφορίες που σχετίζονται με την αρίθμηση των περιοδικών. @el
has element type: 6
label: sorrendiség számozásáról szóló megjegyzése a következő: @hu
definition: Hozzákapcsol egy megjelenési formát egy megjelenési formára tett megjegyzéshez, amely információt nyújt egy megjelenési forma egyes részeinek vagy iterációinak sorrendjét mutató jelöléstartományról. @hu
toolkit label: sorrendiség számozásáról szóló megjegyzése: @hu
toolkit definition: Egy megjelenési formára tett megjegyzés, amely információt nyújt egy megjelenési forma egyes részeinek vagy iterációinak sorrendjét mutató jelöléstartományról. @hu
alternative label: note on numbering of serials
alternative label: huomautus kausijulkaisun numeroinnista @fi
label: huomautus numerointijaksosta @fi
label: har note om nummerering av sekvens @no
definition: Relaterer en manifestasjon til en note om manifestasjon som gir informasjon om spennet av betegnelser som er brukt for å indikere en sekvens av enkeltstående deler eller versjoner av en manifestasjon. @no
alternative label: note om nummerering av periodika @no
alternative label: note sur la numérotation des publications en série @fr
label: heeft noot bij nummering van volgorde @nl
definition: Relateert een manifestatie aan een noot bij manifestatie die informatie verschaft over de reeks van aanduidingen die gebruikt worden om de volgorde aan te geven van de individuele delen of iteraties van een manifestatie. @nl
label: له تبصرة عن ترقيم التسلسل @ar
definition: يربط بين تجسيدة وتبصرة عن التجسيدة التي تعطي معلومات عن مدى من الترقيم الذي يستخدم لتحديد تسلسل أجزاء منفردة أو أعداد، أو تكرارات من تجسيدة. @ar
alternative label: تبصرة على ترقيم السلسلة @ar
toolkit label: تبصرة عن ترقيم التسلسل @ar
toolkit definition: تبصرة عن التجسيدة التي تعطي معلومات عن مدى من الترقيم الذي يستخدم لتحديد تسلسل أجزاء منفردة أو أعداد، أو تكرارات من تجسيدة. @ar
alternative label: nota sobre numeració de publicacions en sèrie @ca
alternative label: note om nummerering af periodika @da
label: märkus jada nummerduse kohta @et
definition: Seostab kehastuse märkusega, mis sisaldab infot tähiste vahemiku kohta, mis on antud kehastuse üksikosade või seisude järjestuse näitamiseks. @et
alternative label: märkus seeria nummerduse kohta @et
toolkit label: märkus jada nummerduse kohta @et
toolkit definition: Märkus, mis sisaldab infot tähiste vahemiku kohta, mis on antud kehastuse üksikosade või seisude järjestuse näitamiseks. @et
alternative label: Anmerkung zur Zählung von fortlaufenden Ressourcen @de
alternative label: sorozat számozásáról szóló megjegyzése: @hu
label: ha come nota sulla numerazione della sequenza @it
definition: Correla una manifestazione a una nota sulla manifestazione che fornisce informazioni sulla serie di designatori utilizzata per indicare una sequenza delle parti o iterazioni individuali di una manifestazione. @it
toolkit label: nota sulla numerazione della sequenza @it
toolkit definition: Nota sulla manifestazione che fornisce informazioni sulla serie di designatori utilizzata per indicare una sequenza delle parti o iterazioni individuali di una manifestazione. @it
label: piezīme par numerāciju @lv
definition: Sasaista manifestāciju ar piezīmi par manifestāciju, kurā ir ziņas par apzīmējumu diapazonu, kas izmantots, lai norādītu manifestācijas atsevišķo daļu vai atkārtojumu secību. @lv
toolkit label: piezīme par numerāciju @lv
toolkit definition: Piezīme par manifestāciju, kurā ir ziņas par apzīmējumu diapazonu, kas izmantots, lai norādītu manifestācijas atsevišķo daļu vai atkārtojumu secību. @lv

has numbering of sequence
status: Published
definition: Relates a manifestation to the first and last designations of a sequence of manifestations of the individual parts or iterations of a manifestation.
type: Property
domain: C10007
lexical alias: numberingOfSequence.en
instruction number: 2.6
toolkit label: numbering of sequence
toolkit definition: The first and last designations of a sequence of manifestations of the individual parts or iterations of a manifestation.
label: a pour numérotation d’une séquence @fr
definition: Met une manifestation en relation avec les première et dernière désignations d’une séquence de manifestations des parties ou itérations individuelles d’une manifestation. @fr
scope note: La numérotation peut comprendre des dates ou d’autres laps de temps, des caractères alphanumériques ou autres ainsi qu’un libellé d’accompagnement. @fr
toolkit label: numérotation d’une séquence @fr
toolkit definition: Première et dernière désignations d’une séquence de manifestations des parties ou itérations individuelles d’une manifestation. @fr
toolkit label: numeración de secuencia @es
toolkit definition: La primera y última designación de una secuencia de manifestaciones de las partes individuales o iteraciones de una manifestación. @es
label: har numrering av seriella resurser @sv
toolkit label: numrering av seriella resurser @sv
toolkit label: nummering van volgorde @nl
toolkit definition: De eerste en laatste aanduidingen van een volgorde van manifestaties van de individuele delen of iteraties van een manifestatie. @nl
label: có đánh số tùng thư @vi
definition: Liên kết biểu thị với định danh cho mỗi số hoặc phần của ấn phẩm nhiều kỳ. @vi
scope note: Đánh số bao gồm con số, chữ cái, ký tự bất kỳ khác, hoặc tổ hợp của chúng có hoặc không dấu hiệu đi kèm và/hoặc định danh biên niên. @vi
toolkit label: đánh số tùng thư @vi
toolkit definition: Định danh cho mỗi số hoặc phần của ấn phẩm nhiều kỳ. @vi
scope note: Nummering kan datums of andere tijdspannes omvatten, alfanumerieke of ander karakters, en een begeleidend bijschrift. @nl
label: har nummerering af rækkefølge @da
definition: Relaterer en manifestation til den første og sidste betegnelse for en rækkefølge af manifestationer, enten af separate dele af en manifestation eller dele eller numre af et værk. @da
scope note: Nummerering kan omfatte datoer eller andre tidsperioder, alfanumerisk tegnsæt eller andre skrifttegn og en tilhørende billedtekst. @da
toolkit label: nummerering af rækkefølge @da
toolkit definition: Første og sidste betegnelse for en rækkefølge af manifestationer, enten af separate dele af en manifestation eller dele eller numre af et værk. @da
label: hat Zählung einer fortlaufenden Ressource @de
definition: Setzt eine Manifestation in Beziehung zu der ersten und letzten Bezeichnung der einzelnen Ausgaben einer fortlaufenden Ressource. @de
scope note: Darunter fallen Daten oder andere Zeiträume, alphanumerische oder andere Zeichen und ein Begleittext. @de
toolkit label: Zählung einer fortlaufenden Ressource @de
toolkit definition: Die erste und letzte Bezeichnung der einzelnen Ausgaben einer fortlaufenden Ressource. @de
label: té com a numeració d’una seqüència @ca
definition: Relaciona una manifestació amb la primera i darrera designació d’una seqüència de les manifestacions de les parts individuals o les iteracions d’una manifestació, @ca
scope note: La numeració pot incloure dates o altres intervals de temps, caràcters alfanumèrics o altres caràcters i una llegenda adjunta. @ca
toolkit label: numeració d’una seqüència @ca
toolkit definition: Primera i darrera designació d’una seqüència de les manifestacions de les parts individuals o les iteracions d’una manifestació, @ca
definition: Liittää manifestaation manifestaation yksittäisten osien tai iteraatioiden numerointijakson ensimmäiseen ja viimeiseen määritteeseen. @fi
toolkit label: numerointijakso @fi
toolkit definition: Manifestaation yksittäisten osien tai iteraatioiden numerointijakson ensimmäinen ja viimeinen määrite. @fi
toolkit label: nummerering for sekvens @no
toolkit definition: Den første og siste betegnelsen av en sekvens av manifestasjoner av individuelle deler av en manifestasjon eller deler eller hefter av et verk. @no
label: έχει αρίθμηση των περιοδικών @el
definition: Συνδέει μια εκδήλωση με έναν προσδιορισμό για κάθε ένα από τα τεύχη ή μέρη ενός περιοδικού. @el
scope note: Η αρίθμηση περιλαμβάνει ένα αριθμητικό, ένα γράμμα, οποιονδήποτε άλλον χαρακτήρα ή τον συνδυασμό αυτών με ή χωρίς συνοδευτική κεφαλίδα ή/και χρονολογικό προσδιορισμό. @el
toolkit label: αρίθμηση των περιοδικών @el
toolkit definition: Ένας προσδιορισμός για κάθε ένα από τα τεύχη ή μέρη ενός περιοδικού. @el
has element type: 6
label: sorrendiségszámozása a következő: @hu
definition: Hozzákapcsol egy megjelenési formát egy megjelenési forma egyes részeinek vagy iterációinak a sorrendjében az elsőt és az utolsót mutatót jelöléshez. @hu
scope note: sorozat számozása @hu
toolkit label: sorrendiségszámozása: @hu
toolkit definition: Egy megjelenési forma egyes részeinek vagy iterációinak a sorrendjében az elsőt és az utolsót mutatót jelölés. @hu
alternative label: numbering of serials
scope note: Numbering may include dates or other timespans, alphanumeric or other characters, and an accompanying caption.
scope note: Numerointi voi sisältää päivämääriä tai muita ajanjaksoja, aakkosnumeerisia tai muita merkkejä sekä selosteen. @fi
alternative label: kausijulkaisujen numerointi @fi
label: numerointijakso @fi
label: har nummerering for sekvens @no
definition: Relaterer en manifestasjon til den første og siste betegnelsen av en sekvens av manifestasjoner av individuelle deler av en manifestasjon eller deler eller hefter av et verk. @no
scope note: Nummerering kan inkludere datoer eller andre tidsrom, alfanumeriske eller andre tegn, og en ledsagende tekst. @no
alternative label: nummerering av periodika @no
alternative label: numérotation des publications en série @fr
label: heeft nummering van volgorde @nl
definition: Relateert een manifestatie aan de eerste en laatste aanduidingen van een volgorde van manifestaties van de individuele delen of iteraties van een manifestatie. @nl
label: له ترقيم متسلسل @ar
definition: يربط بين تجسيدة وكل من أول وآخر تسمية في تسلسل تجسيدات للأجزاء المنفردة لتجسيدة أو أجزاء أو أعداد من عمل. @ar
scope note: قد يشمل الترقيم : التواريخ أو أي فترات زمنية، سواء هجائي رقمي أو من تمثيلات أخرى، والتعليق المصاحب. @ar
alternative label: ترقيم الدوريات @ar
toolkit label: ترقيم متسلسل @ar
toolkit definition: كل من أول وآخر تسمية في تسلسل تجسيدات للأجزاء المنفردة لتجسيدة أو أجزاء أو أعداد من عمل. @ar
alternative label: numeració de publicacions en sèrie @ca
alternative label: nummerering af periodika @da
label: jada nummerdus @et
definition: Seostab kehastuse kehastuse üksikosade või teose osade või numbrite jada esimese ja viimase tähistusega. @et
scope note: Nummerdus võib sisaldada daatumeid või muid ajavahemikke, tähtnumbrilisi või muid märke ning kaasnevat pealkirja. @et

has numbering within sequence
status: Published
definition: Relates a manifestation to a nomen that is a designation that is assigned to a manifestation to identify its position in a sequence of individual parts of a larger manifestation or parts or issues of a larger work.
type: Property
domain: C10007
lexical alias: numberingWithinSequence.en
scope note: Numbering may include dates or other timespans, alphanumeric or other characters, and an accompanying caption.
instruction number: 2.12.9
toolkit label: numbering within sequence
toolkit definition: A nomen that is a designation that is assigned to a manifestation to identify its position in a sequence of individual parts of a larger manifestation or parts or issues of a larger work.
label: a pour numérotation au sein d’une séquence @fr
definition: Met une manifestation en relation avec un nomen qui est une désignation attribuée à une manifestation pour identifier sa position dans une séquence de parties individuelles d’une manifestation plus vaste ou de parties ou livraisons d’une œuvre plus vaste. @fr
scope note: La numérotation peut comprendre des dates ou d’autres laps de temps, des caractères alphanumériques ou autres ainsi qu’un libellé d’accompagnement. @fr
toolkit label: numérotation au sein d’une séquence @fr
toolkit definition: Nomen qui est une désignation attribuée à une manifestation pour identifier sa position dans une séquence de parties individuelles d’une manifestation plus vaste ou de parties ou livraisons d’une œuvre plus vaste. @fr
toolkit label: numeración dentro de secuencia @es
toolkit definition: Un nomen que es una designación que esta asignada a una manifestación para identificar su posición en una secuencia de partes individuales de una manifestación mayor o partes o ejemplares de una obra mayor. @es
label: har numrering inom serie @sv
toolkit label: numrering inom serie @sv
toolkit label: nummering binnen volgorde @nl
toolkit definition: Een nomen dat is een aanduiding die is toegekend aan een manifestatie om diens positie te identificeren in een volgorde van individuele delen van een grotere manifestatie of delen of afleveringen van een groter werk. @nl
label: có đánh số bên trong tùng thư @vi
definition: Liên kết biểu thị với định danh của việc sắp xếp chuỗi của phần hoặc các phần bên trong tùng thư. @vi
scope note: Đánh số bao gồm con số, chữ cái, ký tự bất kỳ khác, hoặc tổ hợp của chúng có hoặc không dấu hiệu đi kèm và/hoặc định danh biên niên. @vi
toolkit label: đánh số bên trong tùng thư @vi
toolkit definition: Định danh của việc sắp xếp chuỗi của phần hoặc các phần bên trong tùng thư. @vi
scope note: Nummering kan datums of andere tijdspannes omvatten, alfanumerieke of andere karakters, en een begeleidende tekst. @nl
label: har nummerering indenfor rækkefølge @da
definition: Relaterer en manifestation til en betegnelse, som er tildelt en manifestation for at identificere dens placering i en rækkefølge, enten af enkelte dele af en større manifestation eller dele eller numre af et større værk. @da
scope note: Nummerering kan omfatte datoer eller andre tidsperioder, alfanumerisk tegnsæt eller andre skrifttegn og en tilhørende billedtekst. @da
toolkit label: nummerering indenfor rækkefølge @da
toolkit definition: Betegnelse, som er tildelt en manifestation for at identificere dens placering i en rækkefølge, enten af enkelte dele af en større manifestation eller dele eller numre af et større værk. @da
label: hat Zählung innerhalb einer Reihe @de
definition: Setzt eine Manifestation in Beziehung zu einer Bezeichnung, die einer Manifestation zugewiesen wird, um ihre Position in einer Reihe einzelner Teile einer größeren Manifestation oder Teilen oder Ausgaben eines größeren Werks zu identifizieren. @de
scope note: Darunter fallen Daten oder andere Zeiträume, alphanumerische oder andere Zeichen und ein Begleittext. @de
toolkit label: Zählung innerhalb einer Reihe @de
toolkit definition: Eine Bezeichnung, die einer Manifestation zugewiesen wird, um ihre Position in einer Reihe einzelner Teile einer größeren Manifestation oder Teilen oder Ausgaben eines größeren Werks zu identifizieren. @de
label: té com a numeració dins d’una seqüència @ca
definition: Relaciona una manifestació amb un nomen que és una designació que s’assigna a una manifestació per identificar la seva posició en una seqüència de parts individuals d’una manifestació més àmplia o les parts o els números d’una obra més àmplia. @ca
scope note: La numeració pot incloure dates o altres intervals de temps, caràcters alfanumèrics o altres caràcters i una llegenda adjunta. @ca
toolkit label: numeració dins d’una seqüència @ca
toolkit definition: Nomen que és una designació que s’assigna a una manifestació per identificar la seva posició en una seqüència de parts individuals d’una manifestació més àmplia o les parts o els números d’una obra més àmplia. @ca
definition: Liittää manifestaation nomeniin, joka on manifestaatiolle annettu määrite, joka osoittaa manifestaation paikan laajemman manifestaation yksittäisten osien tai laajemman teoksen osien tai numeroiden numerointijaksossa. @fi
toolkit label: numerointijakson sisäinen numerointi @fi
toolkit definition: Nomen, joka on manifestaatiolle annettu määrite, joka osoittaa manifestaation paikan laajemman manifestaation yksittäisten osien tai laajemman teoksen osien tai numeroiden numerointijaksossa. @fi
toolkit label: nummerering innen sekvens @no
toolkit definition: En betegnelse som er gitt en manifestasjon for å identifisere dens posisjon i en sekvens av individuelle deler av en større manifestasjon eller deler eller hefter av et større verk. @no
label: έχει αρίθμηση εντός της σειράς @el
definition: Συνδέει μια εκδήλωση με έναν προσδιορισμό της ακολουθίας ενός μέρους ή μερών εντός μια σειράς. @el
scope note: Η αρίθμηση περιλαμβάνει ένα αριθμητικό, ένα γράμμα, οποιονδήποτε άλλον χαρακτήρα ή τον συνδυασμό αυτών με ή χωρίς συνοδευτική κεφαλίδα ή/και χρονολογικό προσδιορισμό. @el
toolkit label: αρίθμηση εντός της σειράς @el
toolkit definition: Ένας προσδιορισμός της ακολουθίας ενός μέρους ή μερών εντός μια σειράς. @el
label: sorozaton belüli számozása a következő: @hu
definition: Hozzákapcsol egy megjelenési formát egy megjelenési formához rendelt jelöléshez, amely azonosítja annak elhelyezkedését az egyedi részek sorrendiségében egy nagyobb mű részeként vagy számaként. @hu
scope note: sorozaton belüli számozása: @hu
toolkit label: Egy megjelenési formához rendelt jelölés, amely azonosítja annak elhelyezkedését az egyedi részek sorrendiségében egy nagyobb mű részeként vagy számaként. @hu
toolkit definition: A számozás jelenthet dátumokat vagy egyéb időtartamokat, és alfanumerikus vagy egyéb karaktereket is, továbbá kísérő feliratot. @hu
alternative label: numbering within series
alternative label: numbering within subseries
scope note: Numerointi voi sisältää päivämääriä tai muita ajanjaksoja, aakkosnumeerisia tai muita merkkejä sekä selosteen. @fi
label: numerointijakson sisäinen numerointi @fi
label: har nummerering innen sekvens @no
definition: Relaterer en manifestasjon til en betegnelse som er gitt en manifestasjon for å identifisere dens posisjon i en sekvens av individuelle deler av en større manifestasjon eller deler eller hefter av et større verk. @no
scope note: Nummerering kan inkludere datoer eller andre tidsrom, alfanumeriske eller andre tegn, og en ledsagende tekst. @no
alternative label: nummerering innen serie @no
alternative label: nummerering innen underserie @no
sub property of: has related nomen of manifestation
alternative label: numérotation au sein d’une collection @fr
alternative label: numérotation au sein d’une sous-collection @fr
label: heeft nummering binnen volgorde @nl
definition: Relateert een manifestatie aan een nomen dat is een aanduiding die is toegekend aan een manifestatie om diens positie te identificeren in een volgorde van individuele delen van een grotere manifestatie of delen of afleveringen van een groter werk. @nl
label: له ترقيم ضمن تسلسل @ar
definition: يربط بين تجسيدة وتسمية محددة مربوطة بتجسيدة لتحدد مكانها في تسلسل الأجزاء الفردية من تجسيدة أكبر، أو أجزاء أو إصدارات لعمل أكبر. @ar
scope note: قد يشتمل الترقيم على تواريخ أو فترات زمنية أخرى، أو تمثيلات هجائية رقمية، أو تمثيلات أخرى، والتعليق المصاحب. @ar
alternative label: الترقيم داخل سلسلة فرعية @ar
toolkit label: ترقيم ضمن تسلسل @ar
toolkit definition: تسمية محددة مربوطة بتجسيدة لتحدد مكانها في تسلسل الأجزاء الفردية من تجسيدة أكبر، أو أجزاء أو إصدارات لعمل أكبر. @ar
alternative label: nummerering indenfor underserie @da
label: jadasisene number @et
definition: Seostab kehastuse tähistusega, mis on kehastusele antud, et identifitseerida selle asendit suurema kehastuse üksikosade või suurema teose osade või numbrite jadas. @et

has papermaker agent
status: Published
type: Property
lexical alias: papermakerAgent.en
definition: Relates a manifestation to an agent who is responsible for the making of paper used in a manifestation.
domain: C10007
toolkit label: papermaker agent
toolkit definition: An agent who is responsible for the making of paper used in a manifestation.
label: a pour agent papetier @fr
definition: Met une manifestation en relation avec un agent qui est responsable de la confection du papier utilisé dans une manifestation. @fr
toolkit label: agent papetier @fr
toolkit definition: Agent qui est responsable de la confection du papier utilisé dans une manifestation. @fr
toolkit label: agente papelero @es
toolkit definition: Un agente que es responsable de la fabricación del papel utilizado en una manifestación. @es
instruction number: 18.5
toolkit label: papiermaker-actor @nl
toolkit definition: Een actor die verantwoordelijk is voor het maken van papier gebruikt in een manifestatie. @nl
label: có người sản xuất giấy @vi
definition: Liên kết biểu thị với tác nhân có trách nhiệm đối với sản xuất giấy được sử dụng để chế tạo biểu thị. @vi
toolkit label: người sản xuất giấy @vi
toolkit definition: Tác nhân có trách nhiệm đối với sản xuất giấy được sử dụng để chế tạo biểu thị. @vi
label: har agent, som er papirproducent @da
definition: Relaterer en manifestation til en agent, som er ansvarlig for fremstilling af papir, som anvendes til fremstilling af en manifestation. @da
toolkit label: agent, som er papirproducent @da
toolkit definition: Agent, som er ansvarlig for fremstilling af papir, som anvendes til fremstilling af en manifestation. @da
label: hat Papiermacherin/Papiermacher (Akteur) @de
definition: Setzt eine Manifestation in Beziehung zu einem Akteur, der für die Produktion von Papier verantwortlich ist, das zur Herstellung einer Manifestation verwendet wird. @de
toolkit label: Papiermacherin/Papiermacher (Akteur) @de
toolkit definition: Ein Akteur, der für die Produktion von Papier verantwortlich ist, das zur Herstellung einer Manifestation verwendet wird. @de
label: té com a agent paperer @ca
definition: Relaciona una manifestació amb un agent que és responsable de l’elaboració del paper usat en una manifestació. @ca
toolkit label: agent paperer @ca
toolkit definition: Agent que és responsable de l’elaboració del paper usat en una manifestació. @ca
definition: Liittää manifestaation toimijaan, joka on vastuussa manifestaatioon käytettävän paperin valmistamisesta. @fi
toolkit label: paperinvalmistaja (toimija) @fi
toolkit definition: Toimija, joka on vastuussa manifestaatioon käytettävän paperin valmistamisesta. @fi
toolkit label: papirprodusent (agent) @no
toolkit definition: En agent som er ansvarlig for produksjonen av papir brukt til å framstille en manifestasjon. @no
label: έχει χαρτοποιό @el
definition: Συνδέει μια εκδήλωση με έναν φορέα υπεύθυνο για την παραγωγή χάρτου που χρησιμοποιείται για την κατασκευή μιας εκδήλωσης. @el
toolkit label: χαρτοποιός @el
toolkit definition: Ένας φορέας υπεύθυνος για την παραγωγή χάρτου που χρησιμοποιείται για την κατασκευή μιας εκδήλωσης. @el
has element type: 2
label: papírgyártó ágense a következő: @hu
definition: Hozzákapcsol egy megjelenési formát egy ágenshez, amely egy megjelenési forma gyártásához használt papír előállításáért felelős. @hu
toolkit label: papírgyártó ágens: @hu
toolkit definition: Egy ágens, amely egy megjelenési forma gyártásához használt papír előállításáért felelős. @hu
alternative label: papermaker
alternative label: paperinvalmistaja @fi
label: paperinvalmistaja (toimija) @fi
label: har papirprodusent (agent) @no
definition: Relaterer en manifestasjon til en agent som er ansvarlig for produksjonen av papir brukt til å framstille en manifestasjon. @no
alternative label: papirprodusent @no
alternative label: papetier @fr
label: heeft papiermaker-actor @nl
definition: Relateert een manifestatie aan een actor die verantwoordelijk is voor het maken van papier gebruikt in een manifestatie. @nl
label: له وكيل صانع ورق @ar
definition: يربط بين تجسيدة ووكيل مسئول عن إنتاج الورق المستخدم في صناعة تجسيدة. @ar
alternative label: صانع ورق @ar
toolkit label: وكيل صانع ورق @ar
toolkit definition: وكيل مسئول عن إنتاج الورق المستخدم في صناعة تجسيدة. @ar
alternative label: paperer @ca
alternative label: papirproducent @da
label: paberivalmistaja (tegija) @et
definition: Seostab kehastuse tegijaga, kes vastutab kehastuse valmistamiseks kasutatud paberi tootmise eest. @et
alternative label: paberivalmistaja @et
toolkit label: paberivalmistaja (tegija) @et
toolkit definition: Tegija, kes vastutab kehastuse valmistamiseks kasutatud paberi tootmise eest. @et
alternative label: papírgyártó: @hu
label: ha come produttore di carta agente @it
definition: Correla una manifestazione all'agente responsabile della produzione della carta utilizzata per la manifattura di una manifestazione. @it
alternative label: produttore di carta @it
toolkit label: produttore di carta agente @it
toolkit definition: Agente responsabile della produzione della carta utilizzata per la manifattura di una manifestazione. @it
label: papīra izgatavotājs (aģents) @lv
definition: Sasaista manifestāciju ar aģentu, kas ir atbildīgs par papīra izgatavošanu, kas izmantots ražošanai. @lv
toolkit label: papīra izgatavotājs (aģents) @lv
toolkit definition: Aģents, kas ir atbildīgs par papīra izgatavošanu, kas izmantots ražošanai. @lv
sub property of: has related agent of manifestation
alternative label: Papiermacher @de
toolkit label: 造纸者行为者 @zh-hans

has papermaker collective agent
status: Published
lexical alias: papermakerCollectiveAgent.en
definition: Relates a manifestation to a collective agent who is responsible for the making of paper used in a manifestation.
toolkit label: papermaker collective agent
toolkit definition: A collective agent who is responsible for the making of paper used in a manifestation.
type: Property
domain: C10007
has element type: 2
sub property of: has papermaker agent
label: paperinvalmistaja (yhteistoimija) @fi
definition: Liittää manifestaation yhteistoimijaan, joka on vastuussa manifestaatioon käytettävän paperin valmistamisesta. @fi
toolkit label: paperinvalmistaja (yhteistoimija) @fi
toolkit definition: Yhteistoimija, joka on vastuussa manifestaatioon käytettävän paperin valmistamisesta. @fi
label: har papirprodusent (kollektiv agent) @no
definition: Relaterer en manifestasjon til en kollektiv agent som er ansvarlig for produksjonen av papir brukt til å framstille en manifestasjon. @no
toolkit label: papirprodusent (kollektiv agent) @no
toolkit definition: En kollektiv agent som er ansvarlig for produksjonen av papir brukt til å framstille en manifestasjon. @no
label: a pour agent collectif papetier @fr
definition: Met une manifestation en relation avec un agent collectif qui est responsable de la confection du papier utilisé dans une manifestation. @fr
toolkit label: agent collectif papetier @fr
toolkit definition: Agent collectif qui est responsable de la confection du papier utilisé dans une manifestation. @fr
label: heeft papierproducent-collectieve actor @nl
definition: Relateert een manifestatie aan een collectieve actor die verantwoordelijk is voor het maken van papier gebruikt in een manifestatie. @nl
toolkit label: papierproducent-collectieve actor @nl
toolkit definition: Een collectieve actor die verantwoordelijk is voor het maken van papier gebruikt in een manifestatie. @nl
label: له وكيل جماعي صانع ورق @ar
definition: يربط بين تجسيدة ووكيل جماعي مسئول عن إنتاج الورق المستخدم في صناعة تجسيدة. @ar
toolkit label: وكيل جماعي صانع ورق @ar
toolkit definition: وكيل جماعي مسئول عن إنتاج الورق المستخدم في صناعة تجسيدة. @ar
label: té com a agent col·lectiu paperer @ca
definition: Relaciona una manifestació amb un agent col·lectiu que és responsable de l’elaboració del paper usat en una manifestació. @ca
toolkit label: agent col·lectiu paperer @ca
toolkit definition: Agent col·lectiu que és responsable de l’elaboració del paper usat en una manifestació. @ca
label: har kollektiv agent, som er papirproducent @da
definition: Relaterer en manifestation til en kollektiv agent, som er ansvarlig for fremstilling af papir, som anvendes til fremstilling af en manifestation. @da
toolkit label: kollektiv agent, som er papirproducent @da
toolkit definition: Kollektiv agent, som er ansvarlig for fremstilling af papir, som anvendes til fremstilling af en manifestation. @da
label: paberivalmistaja (kollektiiv) @et
definition: Seostab kehastuse kollektiiviga, kes vastutab kehastuse valmistamiseks kasutatud paberi tootmise eest. @et
toolkit label: paberivalmistaja (kollektiiv) @et
toolkit definition: Kollektiiv, kes vastutab kehastuse valmistamiseks kasutatud paberi tootmise eest. @et
label: hat Papiermacherin/Papiermacher (Gemeinschaftlicher Akteur) @de
definition: Setzt eine Manifestation in Beziehung zu einem gemeinschaftlichen Akteur, der für die Produktion von Papier verantwortlich ist, das zur Herstellung einer Manifestation verwendet wird. @de
toolkit label: Papiermacherin/Papiermacher (Gemeinschaftlicher Akteur) @de
toolkit definition: Ein gemeinschaftlicher Akteur, der für die Produktion von Papier verantwortlich ist, das zur Herstellung einer Manifestation verwendet wird. @de
label: papírgyártó kollektív ágense a következő: @hu
definition: Hozzákapcsol egy megjelenési formát egy kollektív ágenshez, amely egy megjelenési forma gyártásához használt papír előállításáért felelős. @hu
toolkit label: papírgyártó kollektív ágense: @hu
toolkit definition: Egy kollektív ágens, amely egy megjelenési forma gyártásához használt papír előállításáért felelős. @hu
label: ha come produttore di carta agente collettivo @it
definition: Correla una manifestazione all'agente collettivo responsabile della produzione della carta utilizzata per la manifattura di una manifestazione. @it
toolkit label: produttore di carta agente collettivo @it
toolkit definition: Agente collettivo responsabile della produzione della carta utilizzata per la manifattura di una manifestazione. @it
label: papīra izgatavotājs (grupa) @lv
definition: Sasaista manifestāciju ar grupu, kas ir atbildīga par papīra izgatavošanu, kas izmantots ražošanai. @lv
toolkit label: papīra izgatavotājs (grupa) @lv
toolkit definition: Grupa, kas ir atbildīga par papīra izgatavošanu, kas izmantots ražošanai. @lv
sub property of: has related collective agent of manifestation
label: 有造纸者集体行为者 @zh-hans
definition: 将一种载体表现与负责一种载体表现中所使用的纸张之制造的一个集体行为者关联起来。 @zh-hans
toolkit label: 造纸者集体行为者 @zh-hans
toolkit definition: 负责一种载体表现中所使用的纸张之制造的一个集体行为者 @zh-hans
label: kağıt üreticisi kolektif temsilcisi ile ilişkilidir @tr
definition: Bir gösterimi, bir gösterimde kullanılan kağıdın yapımından sorumlu olan kolektif bir temsilci ile ilişkilendirir. @tr
toolkit label: kağıt üreticisi kollektif temsilcisi @tr
toolkit definition: Bir gösterimde kullanılan kağıdın yapımından sorumlu olan kolektif bir temsilci. @tr
label: tiene agente colectivo fabricante de papel @es
definition: Relaciona una manifestación con un agente colectivo que es responsable de la elaboración del papel utilizado en una manifestación. @es
toolkit label: agente colectivo fabricante de papel @es
toolkit definition: Un agente colectivo que es responsable de la elaboración del papel utilizado en una manifestación. @es
has subproperty: has papermaker corporate body
has subproperty: has papermaker family
has subproperty: P30393

has papermaker corporate body
status: Published
lexical alias: papermakerCorporateBody.en
definition: Relates a manifestation to a corporate body who is responsible for the making of paper used in a manifestation.
toolkit label: papermaker corporate body
toolkit definition: A corporate body who is responsible for the making of paper used in a manifestation.
type: Property
domain: C10007
has element type: 2
sub property of: has papermaker collective agent
label: paperinvalmistaja (yhteisö) @fi
definition: Liittää manifestaation yhteisöön, joka on vastuussa manifestaatioon käytettävän paperin valmistamisesta. @fi
toolkit label: paperinvalmistaja (yhteisö) @fi
toolkit definition: Yhteisö, joka on vastuussa manifestaatioon käytettävän paperin valmistamisesta. @fi
label: har papirprodusent (korporasjon) @no
definition: Relaterer en manifestasjon til en korporasjon som er ansvarlig for produksjonen av papir brukt til å framstille en manifestasjon. @no
toolkit label: papirprodusent (korporasjon) @no
toolkit definition: En korporasjon som er ansvarlig for produksjonen av papir brukt til å framstille en manifestasjon. @no
label: a pour collectivité papetière @fr
definition: Met une manifestation en relation avec une collectivité qui est responsable de la confection du papier utilisé dans une manifestation. @fr
toolkit label: collectivité papetière @fr
toolkit definition: Collectivité qui est responsable de la confection du papier utilisé dans une manifestation. @fr
label: heeft papierproducent-corporatie @nl
definition: Relateert een manifestatie aan een corporatie die verantwoordelijk is voor het maken van papier gebruikt in een manifestatie. @nl
toolkit label: papierproducent-corporatie @nl
toolkit definition: Een corporatie die verantwoordelijk is voor het maken van papier gebruikt in een manifestatie. @nl
label: له هيئة صانع ورق @ar
definition: يربط بين تجسيدة وهيئة مسئولة عن إنتاج الورق المستخدم في صناعة تجسيدة. @ar
toolkit label: هيئة صانع ورق @ar
toolkit definition: هيئة مسئولة عن إنتاج الورق المستخدم في صناعة تجسيدة. @ar
label: té com a entitat corporativa paperera @ca
definition: Relaciona una manifestació amb una entitat corporativa que és responsable de l’elaboració del paper usat en una manifestació. @ca
toolkit label: entitat corporativa paperera @ca
toolkit definition: Entitat corporativa que és responsable de l’elaboració del paper usat en una manifestació. @ca
label: har korporation, som er papirproducent @da
definition: Relaterer en manifestation til en korporation, som er ansvarlig for fremstilling af papir, som anvendes til fremstilling af en manifestation. @da
toolkit label: korporation, som er papirproducent @da
toolkit definition: Korporation, som er ansvarlig for fremstilling af papir, som anvendes til fremstilling af en manifestation. @da
label: paberivalmistaja (asutus) @et
definition: Seostab kehastuse asutusega, kes vastutab kehastuse valmistamiseks kasutatud paberi tootmise eest. @et
toolkit label: paberivalmistaja (asutus) @et
toolkit definition: Asutus, kes vastutab kehastuse valmistamiseks kasutatud paberi tootmise eest. @et
label: hat Papiermacherin/Papiermacher (Körperschaft) @de
definition: Setzt eine Manifestation in Beziehung zu einer Körperschaft, die für die Produktion von Papier verantwortlich ist, das zur Herstellung einer Manifestation verwendet wird. @de
toolkit label: Papiermacherin/Papiermacher (Körperschaft) @de
toolkit definition: Eine Körperschaft, die für die Produktion von Papier verantwortlich ist, das zur Herstellung einer Manifestation verwendet wird. @de
label: papírgyártó testülete a következő: @hu
definition: Hozzákapcsol egy megjelenési formát egy testülethez, amely egy megjelenési forma gyártásához használt papír előállításáért felelős. @hu
toolkit label: papírgyártó testület: @hu
toolkit definition: Egy testület, amely egy megjelenési forma gyártásához használt papír előállításáért felelős. @hu
label: ha come produttore di carta ente @it
definition: Correla una manifestazione all'ente responsabile della produzione della carta utilizzata per la manifattura di una manifestazione. @it
toolkit label: ha come produttore di carta ente @it
toolkit definition: Ente responsabile della produzione della carta utilizzata per la manifattura di una manifestazione. @it
label: papīra izgatavotājs (institūcija) @lv
definition: Sasaista manifestāciju ar institūciju, kas ir atbildīga par papīra izgatavošanu, kas izmantots ražošanai. @lv
toolkit label: papīra izgatavotājs (institūcija) @lv
toolkit definition: Institūcija, kas ir atbildīga par papīra izgatavošanu, kas izmantots ražošanai. @lv
sub property of: has related corporate body of manifestation
label: 有造纸者团体 @zh-hans
definition: 将一种载体表现与负责一种载体表现中所使用的纸张之制造的一个团体关联起来。 @zh-hans
toolkit label: 造纸者团体 @zh-hans
toolkit definition: 负责一种载体表现中所使用的纸张之制造的一个团体 @zh-hans
label: kağıt üreticisi tüzel kişisi ile ilişkilidir @tr
definition: Bir gösterimi, gösterimde kullanılan kağıtları üretmekten sorumlu tüzel kişiyle ilişkilendirir. @tr
toolkit label: Kağıt üretici tüzel kişi @tr
toolkit definition: Gösterimde kullanılan kağıtları üretmekten sorumlu tüzel kişi. @tr
label: tiene cuerpo corporativo fabricante de papel @es
definition: Relaciona una manifestación con un cuerpo corporativo que es responsable de la fabricación del papel utilizado en una manifestación. @es
toolkit label: cuerpo corporativo fabricante de papel @es
toolkit definition: Un cuerpo corporativo que es responsable de la fabricación del papel utilizado en una manifestación. @es
has subproperty: P30422

has papermaker family
status: Published
lexical alias: papermakerFamily.en
definition: Relates a manifestation to a family who is responsible for the making of paper used in a manifestation.
toolkit label: papermaker family
toolkit definition: A family who is responsible for the making of paper used in a manifestation.
type: Property
domain: C10007
has element type: 2
sub property of: has papermaker collective agent
label: paperinvalmistaja (suku) @fi
definition: Liittää manifestaation sukuun, joka on vastuussa manifestaatioon käytettävän paperin valmistamisesta. @fi
toolkit label: paperinvalmistaja (suku) @fi
toolkit definition: Suku, joka on vastuussa manifestaatioon käytettävän paperin valmistamisesta. @fi
label: har papirprodusent (familie) @no
definition: Relaterer en manifestasjon til en familie som er ansvarlig for produksjonen av papir brukt til å framstille en manifestasjon. @no
toolkit label: papirprodusent (familie) @no
toolkit definition: En familie som er ansvarlig for produksjonen av papir brukt til å framstille en manifestasjon. @no
label: a pour famille papetière @fr
definition: Met une manifestation en relation avec une famille qui est responsable de la confection du papier utilisé dans une manifestation. @fr
toolkit label: famille papetière @fr
toolkit definition: Famille qui est responsable de la confection du papier utilisé dans une manifestation. @fr
label: heeft papierproducent-familie @nl
definition: Relateert een manifestatie aan een familie die verantwoordelijk is voor het maken van papier gebruikt in een manifestatie. @nl
toolkit label: papierproducent-familie @nl
toolkit definition: Een familie die verantwoordelijk is voor het maken van papier gebruikt in een manifestatie. @nl
label: له عائلة صانع ورق @ar
definition: يربط بين تجسيدة وعائلة مسئولة عن إنتاج الورق المستخدم في صناعة تجسيدة. @ar
toolkit label: عائلة صانع ورق @ar
toolkit definition: عائلة مسئولة عن إنتاج الورق المستخدم في صناعة تجسيدة. @ar
label: té com a família paperera @ca
definition: Relaciona una manifestació amb una família que és responsable de l’elaboració del paper usat en una manifestació. @ca
toolkit label: família paperera @ca
toolkit definition: Família que és responsable de l’elaboració del paper usat en una manifestació. @ca
label: har familie, som er papirproducent @da
definition: Relaterer en manifestation til en familie, som er ansvarlig for fremstilling af papir, som anvendes til fremstilling af en manifestation. @da
toolkit label: familie, som er papirproducent @da
toolkit definition: Familie, som er ansvarlig for fremstilling af papir, som anvendes til fremstilling af en manifestation. @da
label: paberivalmistaja (perekond) @et
definition: Seostab kehastuse perekonnaga, kes vastutab kehastuse valmistamiseks kasutatud paberi tootmise eest. @et
toolkit label: paberivalmistaja (perekond) @et
toolkit definition: Perekond, kes vastutab kehastuse valmistamiseks kasutatud paberi tootmise eest. @et
label: hat Papiermacherin/Papiermacher (Familie) @de
definition: Setzt eine Manifestation in Beziehung zu einer Familie, die für die Produktion von Papier verantwortlich ist, das zur Herstellung einer Manifestation verwendet wird. @de
toolkit label: Papiermacherin/Papiermacher (Familie) @de
toolkit definition: Eine Familie, die für die Produktion von Papier verantwortlich ist, das zur Herstellung einer Manifestation verwendet wird. @de
label: papírgyártó családja a következő: @hu
definition: Hozzákapcsol egy megjelenési formát egy családhoz, amely egy megjelenési forma gyártásához használt papír előállításáért felelős. @hu
toolkit label: papírgyártó család: @hu
toolkit definition: Egy család, amely egy megjelenési forma gyártásához használt papír előállításáért felelős. @hu
label: ha come produttore di carta famiglia @it
definition: Correla una manifestazione alla famiglia responsabile della produzione della carta utilizzata per la manifattura di una manifestazione. @it
toolkit label: produttore di carta famiglia @it
toolkit definition: Famiglia responsabile della produzione della carta utilizzata per la manifattura di una manifestazione. @it
label: papīra izgatavotājs (dzimta/ģimene) @lv
definition: Sasaista manifestāciju ar dzimtu/ģimeni, kas ir atbildīga par papīra izgatavošanu, kas izmantots ražošanai. @lv
toolkit label: papīra izgatavotājs (dzimta/ģimene) @lv
toolkit definition: Dzimta/ģimene, kas ir atbildīga par papīra izgatavošanu, kas izmantots ražošanai. @lv
sub property of: has related family of manifestation
label: 有造纸者家族 @zh-hans
definition: 将一种载体表现与负责一种载体表现中所使用的纸张之制造的一个家族关联起来。 @zh-hans
toolkit label: 造纸者家族 @zh-hans
toolkit definition: 负责一种载体表现中所使用的纸张之制造的一个家族 @zh-hans
label: kağıt üreticisi ailesi ile ilişkilidir @tr
definition: Bir gösterimi, gösterimde kullanılan kağıtları üretmekten sorumlu aileyle ilişkilendirir. @tr
toolkit label: kağıt üretici aile @tr
toolkit definition: Gösterimde kullanılan kağıtları üretmekten sorumlu aile. @tr
label: tiene familia papelera @es
definition: Relaciona una manifestación con una familia que es responsable por la elaboración de papel utilizado en una manifestación. @es
toolkit label: familia papelera @es
toolkit definition: Una familia que es responsable por la elaboración de papel utilizado en una manifestación. @es
has subproperty: P30451

has papermaker person
status: Published
lexical alias: papermakerPerson.en
definition: Relates a manifestation to a person who is responsible for the making of paper used in a manifestation.
toolkit label: papermaker person
toolkit definition: A person who is responsible for the making of paper used in a manifestation.
type: Property
domain: C10007
has element type: 2
sub property of: has papermaker agent
label: paperinvalmistaja (henkilö) @fi
definition: Liittää manifestaation henkilöön, joka on vastuussa manifestaatioon käytettävän paperin valmistamisesta. @fi
toolkit label: paperinvalmistaja (henkilö) @fi
toolkit definition: Henkilö, joka on vastuussa manifestaatioon käytettävän paperin valmistamisesta. @fi
label: har papirprodusent (person) @no
definition: Relaterer en manifestasjon til en person som er ansvarlig for produksjonen av papir brukt til å framstille en manifestasjon. @no
toolkit label: papirprodusent (person) @no
toolkit definition: En person som er ansvarlig for produksjonen av papir brukt til å framstille en manifestasjon. @no
label: a pour personne papetière @fr
definition: Met une manifestation en relation avec une personne qui est responsable de la confection du papier utilisé dans une manifestation. @fr
toolkit label: personne papetière @fr
toolkit definition: Personne qui est responsable de la confection du papier utilisé dans une manifestation. @fr
label: heeft papierproducent-persoon @nl
definition: Relateert een manifestatie aan een persoon die verantwoordelijk is voor het maken van papier gebruikt in een manifestatie. @nl
toolkit label: papierproducent-persoon @nl
toolkit definition: Een persoon die verantwoordelijk is voor het maken van papier gebruikt in een manifestatie. @nl
label: له شخص صانع ورق @ar
definition: يربط بين تجسيدة وشخص مسئول عن إنتاج الورق المستخدم في صناعة تجسيدة. @ar
toolkit label: شخص صانع ورق @ar
toolkit definition: شخص مسئول عن إنتاج الورق المستخدم في صناعة تجسيدة. @ar
label: té com a persona paperera @ca
definition: Relaciona una manifestació amb una persona que és responsable de l’elaboració del paper usat en una manifestació. @ca
toolkit label: persona paperera @ca
toolkit definition: Persona que és responsable de l’elaboració del paper usat en una manifestació. @ca
label: har person, som er papirproducent @da
definition: Relaterer en manifestation til en person, som er ansvarlig for fremstilling af papir, som anvendes til fremstilling af en manifestation. @da
toolkit label: person, som er papirproducent @da
toolkit definition: Person, som er ansvarlig for fremstilling af papir, som anvendes til fremstilling af en manifestation. @da
label: paberivalmistaja (isik) @et
definition: Seostab kehastuse isikuga, kes vastutab kehastuse valmistamiseks kasutatud paberi tootmise eest. @et
toolkit label: paberivalmistaja (isik) @et
toolkit definition: Isik, kes vastutab kehastuse valmistamiseks kasutatud paberi tootmise eest. @et
label: hat Papiermacherin/Papiermacher (Person) @de
definition: Setzt eine Manifestation in Beziehung zu einer Person, die für die Produktion von Papier verantwortlich ist, das zur Herstellung einer Manifestation verwendet wird. @de
toolkit label: Papiermacherin/Papiermacher (Person) @de
toolkit definition: Eine Person, die für die Produktion von Papier verantwortlich ist, das zur Herstellung einer Manifestation verwendet wird. @de
label: papírgyártó személye a következő: @hu
definition: Hozzákapcsol egy megjelenési formát egy személyhez, aki egy megjelenési forma gyártásához használt papír előállításáért felelős. @hu
toolkit label: papírgyártó személy: @hu
toolkit definition: Egy személy, aki egy megjelenési forma gyártásához használt papír előállításáért felelős. @hu
label: ha come produttore di carta persona @it
definition: Correla una manifestazione alla persona responsabile della produzione della carta utilizzata per la manifattura di una manifestazione. @it
toolkit label: produttore di carta persona @it
toolkit definition: Persona responsabile della produzione della carta utilizzata per la manifattura di una manifestazione. @it
label: papīra izgatavotājs (persona) @lv
definition: Sasaista manifestāciju ar personu, kura ir atbildīga par papīra izgatavošanu, kas izmantots ražošanai. @lv
toolkit label: papīra izgatavotājs (persona) @lv
toolkit definition: Persona, kura ir atbildīga par papīra izgatavošanu, kas izmantots ražošanai. @lv
sub property of: has related person of manifestation
label: 有造纸者个人 @zh-hans
definition: 将一种载体表现与负责一种载体表现中所使用的纸张之制造的一个个人关联起来。 @zh-hans
toolkit label: 造纸者个人 @zh-hans
toolkit definition: 负责一种载体表现中所使用的纸张之制造的一个个人 @zh-hans
label: kağıt üreticisi kişi ile ilişkilidir @tr
definition: Bir gösterimde kullanılan kağıdın yapımından sorumlu olan bir kişiyle ilişkilendirir. @tr
toolkit label: kağıt üreten kişi @tr
toolkit definition: Bir gösterimde kullanılan kağıdın yapımından sorumlu olan kişi. @tr
label: tiene persona fabricante de papel @es
definition: Relaciona una manifestación con una persona que es responsable de la elaboración del papel utilizado en una manifestación. @es
toolkit label: persona fabricante de papel @es
toolkit definition: Una persona que es responsable de la elaboración del papel utilizado en una manifestación. @es
has subproperty: P30364

has parallel title of series
status: Published
definition: Relates a manifestation to a nomen that is a title of a series in another language or script.
type: Property
domain: C10007
lexical alias: parallelTitleOfSeries.en
instruction number: 2.12.3
toolkit label: parallel title of series
toolkit definition: A nomen that is a title of series in another language or script.
label: a pour titre parallèle de collection @fr
definition: Met une manifestation en relation avec un nomen qui est un titre propre de collection dans une autre langue ou écriture. @fr
toolkit label: titre parallèle de collection @fr
toolkit definition: Nomen qui est un titre propre de collection dans une autre langue ou écriture. @fr
toolkit label: título paralelo de serie @es
toolkit definition: Un nomen que es título de una serie en otra lengua o escritura. @es
label: har parallel title proper of series @sv
toolkit label: parallell huvudtitel till serie @sv
toolkit label: parallelle titel van reeks @nl
toolkit definition: Een nomen dat is een titel van reeks in een andere taal en/of schrift. @nl
label: có nhan đề hợp thức song song của tùng thư @vi
definition: Liên kết biểu thị với nhan đề hợp thức của tùng thư trong ngôn ngữ hoặc hệ thống viết khác. @vi
toolkit label: nhan đề hợp thức song song của tùng thư @vi
toolkit definition: Nhan đề hợp thức của tùng thư trong ngôn ngữ hoặc hệ thống viết khác. @vi
label: har parallel titel på serie @da
definition: Relaterer en manifestation til en titel på serie på et andet sprog eller skriftsystem. @da
toolkit label: parallel titel på serie @da
toolkit definition: Titel på serie på et andet sprog eller skriftsystem. @da
label: hat Paralleltitel einer Reihe @de
definition: Setzt eine Manifestation in Beziehung zu einem Titel einer Reihe, der in einer anderen Sprache oder einer anderen Schrift vorliegt. @de
toolkit label: Paralleltitel einer Reihe @de
toolkit definition: Eine Titel einer Reihe, der in einer anderen Sprache oder einer anderen Schrift vorliegt. @de
label: té com a títol paral·lel de col·lecció @ca
definition: Relaciona una manifestació amb un nomen que és un títol de col·lecció en una altra llengua o escriptura. @ca
toolkit label: títol paral·lel de col·lecció @ca
toolkit definition: Nomen que és un títol de col·lecció en una altra llengua o escriptura. @ca
definition: Liittää manifestaation nomeniin, joka on sarjan nimeke toisella kielellä tai kirjoitusjärjestelmällä. @fi
toolkit label: sarjan rinnakkainen nimeke @fi
toolkit definition: Nomen, joka on sarjan nimeke toisella kielellä tai kirjoitusjärjestelmällä. @fi
toolkit label: parallell serietittel @no
toolkit definition: En serietittel på et annet språk eller i et annet skriftsystem. @no
label: έχει παράλληλο κύριο τίτλο σειράς @el
definition: Συνδέει μια εκδήλωση με έναν κύριο τίτλο σειράς σε μια άλλη γλώσσα ή γραφή. @el
toolkit label: παράλληλος κύριος τίτλος σειράς @el
toolkit definition: Ένας κύριος τίτλος σειράς σε μια άλλη γλώσσα ή γραφή. @el
sub property of: has title of series
has element type: 3
sub property of: has parallel title proper
label: párhuzamos sorozatcíme a következő: @hu
definition: Hozzákapcsol egy megjelenési formát egy nomenhez, amely egy sorozatcím más nyelven vagy írásrendszerben. @hu
toolkit label: párhuzamos sorozatcíme: @hu
toolkit definition: Egy nomen, amely egy sorozatcím más nyelven vagy írásrendszerben. @hu
alternative label: parallel title proper of subseries
alternative label: parallel title proper of series
label: sarjan rinnakkainen nimeke @fi
label: har parallell serietittel @no
definition: Relaterer en manifestasjon til en serietittel på et annet språk eller i et annet skriftsystem. @no
alternative label: parallell hovedtittel for underserie @no
alternative label: parallell hovedtittel for serie @no
alternative label: titre propre parallèle de sous-collection @fr
alternative label: titre propre parallèle de collection @fr
label: heeft parallelle titel van reeks @nl
definition: Relateert een manifestatie aan een nomen dat is een titel van reeks in een andere taal en/of schrift. @nl
label: له عنوان سلسلة موازي @ar
definition: يربط بين تجسيدة وعنوان سلسلة في لغة أخرى أو نظام آخر للحروف. @ar
alternative label: عنوان فعلي موازي لسلسلة @ar
toolkit label: عنوان سلسلة موازي @ar
toolkit definition: عنوان سلسلة في لغة أخرى أو نظام آخر للحروف. @ar
alternative label: parallel hovedtitel på serie @da
label: seeria rööppealkiri @et
definition: Seostab kehastuse seeria pealkirjaga teises keeles või kirjasüsteemis. @et
alternative label: allseeria rööppõhipealkiri @et
alternative label: seeria rööppõhipealkiri @et
toolkit label: seeria rööppealkiri @et
toolkit definition: Seeria pealkiri teises keeles või kirjasüsteemis. @et
alternative label: Paralleltitel einer Unterreihe @de
label: ha come titolo della serie parallelo @it
definition: Correla una manifestazione a un titolo di una serie in un'altra lingua e/scrittura. @it
alternative label: titolo proprio della sottoserie parallelo @it
toolkit label: titolo della serie parallelo @it
toolkit definition: Titolo di una serie in un'altra lingua e/scrittura. @it
toolkit label: paralēlais sērijas nosaukums @lv

has parallel other title information
status: Published
definition: Relates a manifestation to an other title information in another language or script.
type: Property
domain: C10007
sub property of: has other title information
lexical alias: parallelOtherTitleInformation.en
instruction number: 2.3.5
toolkit label: parallel other title information
toolkit definition: An other title information in another language or script.
label: a pour complément de titre parallèle @fr
definition: Met une manifestation en relation avec un complément de titre dans une autre langue ou écriture. @fr
toolkit label: complément de titre parallèle @fr
toolkit definition: Complément de titre dans une autre langue ou écriture. @fr
toolkit label: otra información de título paralela @es
toolkit definition: Otra información de título en otro idioma o escritura. @es
label: har parallell övrig titelinformation @sv
toolkit label: parallell övrig titelinformation @sv
toolkit label: parallelle overige titelinformatie @nl
toolkit definition: Overige titelinformatie in een taal en/of schrift dat afwijkt van die zoals is opgenomen in het element overige titelinformatie. @nl
label: có thông tin nhan đề khác song song @vi
definition: Liên kết biểu thị với thông tin nhan đề khác trong ngôn ngữ hoặc hệ thống viết khác với được ghi trong yếu tố thông tin nhan đề khác. @vi
toolkit label: thông tin nhan đề khác song song @vi
toolkit definition: Thông tin nhan đề khác trong ngôn ngữ hoặc hệ thống viết khác với được ghi trong yếu tố thông tin nhan đề khác. @vi
label: har parallel anden titelinformation @da
definition: Relaterer en manifestation til en anden titelinformation på et andet sprog eller skriftsystem. @da
toolkit label: parallel anden titelinformation @da
toolkit definition: Anden titelinformation på et andet sprog eller skriftsystem. @da
label: hat parallelen Titelzusatz @de
definition: Setzt eine Manifestation in Beziehung zu einem Titelzusatz in einer anderen Sprache oder einer anderen Schrift. @de
toolkit label: Paralleler Titelzusatz @de
toolkit definition: Ein Titelzusatz in einer anderen Sprache oder einer anderen Schrift. @de
label: té com a complement paral·lel de títol @ca
definition: Relaciona una manifestació amb un complement de títol en una altra llengua o escriptura. @ca
toolkit label: complement paral·lel de títol @ca
toolkit definition: Complement de títol en una altra llengua o escriptura. @ca
definition: Liittää manifestaation muuhun nimeketietoon toisella kielellä ja/tai kirjoitusjärjestelmällä. @fi
toolkit label: rinnakkainen muu nimeketieto @fi
toolkit definition: Muu nimeketieto toisella kielellä ja/tai kirjoitusjärjestelmällä. @fi
toolkit label: parallell annen tittelinformasjon @no
toolkit definition: Annen tittelinformasjon på et annet språk eller i et annet skriftsystem. @no
label: έχει άλλες πληροφορίες σχετικές με τον παράλληλο τίτλο @el
definition: Συνδέει μια εκδήλωση με άλλες πληροφορίες σχετικές με τον τίτλο σε μια γλώσσα ή γραφή που διαφέρει από εκείνη με την οποία καταχωρίστηκαν στο στοιχείο των άλλων πληροφοριών σχετικά με τον τίτλο. @el
toolkit label: άλλες πληροφορίες σχετικές με τον παράλληλο τίτλο @el
toolkit definition: Άλλες πληροφορίες σχετικές με τον τίτλο σε μια γλώσσα ή γραφή που διαφέρει από εκείνη με την οποία καταχωρίστηκαν στο στοιχείο των άλλων πληροφοριών σχετικών με τον τίτλο. @el
has element type: 3
label: párhuzamos egyéb címinformációja a következő: @hu
definition: Hozzákapcsol egy megjelenési formát egyéb címinformációhoz egy másik nyelven vagy írásmódban. @hu
toolkit label: párhuzamos egyéb címinformációja: @hu
toolkit definition: Egyéb címinformáció egy másik nyelven vagy írásmódban. @hu
label: rinnakkainen muu nimeketieto @fi
label: har parallell annen tittelinformasjon @no
definition: Relaterer en manifestasjon til annen tittelinformasjon på et annet språk eller i et annet skriftsystem. @no
label: heeft parallelle overige titelinformatie @nl
definition: Relateert een manifestatie aan overige titelinformatie in een taal en/of schrift dat afwijkt van die zoals is opgenomen in het element overige titelinformatie. @nl
label: له معلومات عنوان أخرى بديلة @ar
definition: يربط بين تجسيدة ومعلومات أخرى لعنوان في لغة أخرى أو نظام آخر للحروف. @ar
toolkit label: معلومات عنوان أخرى بديلة @ar
toolkit definition: معلومات أخرى لعنوان في لغة أخرى أو نظام آخر للحروف. @ar
label: pealkirja rööptäiendandmed @et
definition: Seostab kehastuse pealkirja täiendandmetega teises keeles või kirjasüsteemis. @et
toolkit label: pealkirja rööptäiendandmed @et
toolkit definition: Pealkirja täiendandmed teises keeles või kirjasüsteemis. @et
label: ha come altre informazioni sul titolo parallele @it
definition: Correla una manifestazione ad altre informazioni sul titolo in una lingua e/o scrittura diversa. @it
toolkit label: altre informazioni sul titolo parallele @it
toolkit definition: Altre informazioni sul titolo in una lingua e/o scrittura diversa. @it
label: paralēlās citas nosaukumziņas @lv
definition: Sasaista manifestāciju ar citām nosaukumziņām citā valodā vai rakstībā. @lv
toolkit label: paralēlās citas nosaukumziņas @lv
toolkit definition: Citas nosaukumziņas citā valodā vai rakstībā. @lv
label: 有并列其他题名信息 @zh-hans
definition: 将一种载体表现与用另一种语言或文字的其他题名信息关联起来。 @zh-hans
toolkit label: 并列其他题名信息 @zh-hans
toolkit definition: 用另一种语言或文字的其他题名信息 @zh-hans
label: paralel diğer başlık bilgisi ile ilişkilidir @tr
definition: bir gösterimi, başka bir dildeki veya alfabedeki diğer bir başlık bilgisiyle ilişkilendirir. @tr
toolkit label: Diğer paralel başlık bilgisi @tr
toolkit definition: Başka bir dilde veya alfabede diğer bir başlık bilgisi. @tr
label: tiene otra información de título paralela @es

has parallel name of producer
status: Published
definition: Relates a manifestation to a nomen that is a name of producer in another language or script.
type: Property
domain: C10007
lexical alias: parallelNameOfProducer.en
instruction number: 2.7.5
toolkit label: parallel name of producer
toolkit definition: A nomen that is a name of producer in another language or script.
label: a pour forme parallèle d’un nom de producteur @fr
definition: Met une manifestation en relation avec un nomen qui est un nom de producteur dans une autre langue ou écriture. @fr
toolkit label: forme parallèle d’un nom de producteur @fr
toolkit definition: Nomen qui est un nom de producteur dans une autre langue ou écriture. @fr
toolkit label: nombre paralelo del productor @es
toolkit definition: Un nomen que es un nombre de productor en otra lengua o escritura. @es
label: har parallellt producentnamn @sv
toolkit label: parallellt producentnamn @sv
toolkit label: parallelle naam van producent @nl
toolkit definition: Een nomen dat is een naam van producent in een andere taal of schrift. @nl
label: có tên nhà sản xuất song song @vi
definition: Liên kết biểu thị với tên nhà sản xuất trong ngôn ngữ hoặc hệ thống viết khác với được ghi trong yếu tố tên nhà sản xuất. @vi
toolkit label: tên nhà sản xuất song song @vi
toolkit definition: Tên nhà sản xuất trong ngôn ngữ hoặc hệ thống viết khác với được ghi trong yếu tố tên nhà sản xuất. @vi
label: har parallelt navn på producent @da
definition: Relaterer en manifestation til et navn på producent på et andet sprog eller skriftsystem. @da
toolkit label: parallelt navn på producent @da
toolkit definition: Navn på producent på et andet sprog eller skriftsystem. @da
label: hat parallelen Erzeugernamen @de
definition: Setzt eine Manifestation in Beziehung zu einem Erzeugernamen in einer anderen Sprache oder einer anderen Schrift. @de
toolkit label: Paralleler Erzeugername @de
toolkit definition: Ein Erzeugername in einer anderen Sprache oder einer anderen Schrift. @de
label: té com a nom paral·lel de productor @ca
definition: Relaciona una manifestació amb un nomen que és un nom d’un productor en una altra llengua o escriptura. @ca
toolkit label: nom paral·lel de productor @ca
toolkit definition: Nomen que és un nom d’un productor en una altra llengua o escriptura. @ca
definition: Liittää manifestaation nomeniin, joka tuottajan nimi toisella kielellä ja/tai kirjoitusjärjestelmällä. @fi
toolkit label: tuottajan rinnakkainen nimi @fi
toolkit definition: Nomen, joka on tuottajan nimi toisella kielellä ja/tai kirjoitusjärjestelmällä. @fi
toolkit label: parallelt navn på produsent @no
toolkit definition: Et navn på produsent på et annet språk eller i et annet skriftsystem. @no
label: έχει παράλληλο όνομα του παραγωγού @el
definition: Συνδέει μια εκδήλωση με το όνομα ενός εκδότη σε μια γλώσσα ή γραφή που διαφέρει από εκείνη με την οποία καταχωρίστηκε στο στοιχείο του ονόματος ενός παραγωγού. @el
toolkit label: παράλληλο όνομα παραγωγού @el
toolkit definition: Το όνομα ενός εκδότη σε μια γλώσσα ή γραφή που διαφέρει από εκείνη με την οποία καταχωρίστηκε στο στοιχείο του ονόματος ενός παραγωγού. @el
sub property of: has name of producer
has element type: 3
label: párhuzamos előállítói neve a következő: @hu
definition: Hozzákapcsol egy megjelenési formát egy előállítói név nomenhez más nyelven vagy írásrendszerben. @hu
toolkit label: párhuzamos előállítói neve: @hu
toolkit definition: Egy előállítói név nomen más nyelven vagy írásrendszerben. @hu
alternative label: parallel producer's name
label: tuottajan rinnakkainen nimi @fi
label: har parallelt navn på produsent @no
definition: Relaterer en manifestasjon til et navn på produsent på et annet språk eller i et annet skriftsystem. @no
label: heeft parallelle naam van producent @nl
definition: Relateert een manifestatie aan een nomen dat is een naam van producent in een andere taal of schrift. @nl
alternative label: rinnakkainen tuottajan nimi @fi
label: له اسم موازي للمنتِج @ar
definition: يربط بين تجسيدة واسم منتج في لغة أخرى أو نظام آخر للحروف. @ar
toolkit label: اسم موازي للمنتِج @ar
toolkit definition: تسمية هي اسم منتِج في لغة أخرى أو نظام آخر للحروف. @ar
label: tootja rööpnimi @et
definition: Seostab kehastuse tootja nimega teises keeles või kirjasüsteemis. @et
toolkit label: tootja rööpnimi @et
toolkit definition: Tootja nimi teises keeles või kirjasüsteemis. @et
label: ha come nome del produttore parallelo @it
definition: Correla una manifestazione a un nome del produttore in una lingua o scrittura diversa. @it
toolkit label: nome del produttore parallelo @it
toolkit definition: Nome del produttore in una lingua o scrittura diversa. @it
label: izgatavotāja paralēlais vārds/nosaukums @lv
definition: Sasaista manifestāciju ar nomenu, kas ir izgatavotāja vārds/nosaukums citā valodā vai rakstībā. @lv
toolkit label: izgatavotāja paralēlais vārds/nosaukums @lv
toolkit definition: Izgatavotāja vārds/nosaukums citā valodā vai rakstībā. @lv
alternative label: اسم موازي للمنتِج @ar
alternative label: parallelt producentnavne @da
alternative label: 并列制作者名称 @zh-hans
label: 有并列制作者名称 @zh-hans
definition: 将一种载体表现与作为用另一种语言或文字的制作者名称的一个命名关联起来。 @zh-hans
toolkit label: 并列制作者名称 @zh-hans
toolkit definition: 作为用另一种语言或文字的制作者名称的一个命名 @zh-hans

has parallel name of manufacturer
status: Published
definition: Relates a manifestation to a nomen that is a name of manufacturer in another language or script.
type: Property
domain: C10007
lexical alias: parallelNameOfManufacturer.en
instruction number: 2.10.5
toolkit label: parallel name of manufacturer
toolkit definition: A nomen that is a name of manufacturer in another language or script.
label: a pour forme parallèle d’un nom de fabricant @fr
definition: Met une manifestation en relation avec un nomen qui est un nom de fabricant dans une autre langue ou écriture. @fr
toolkit label: forme parallèle d’un nom de fabricant @fr
toolkit definition: Nomen qui est un nom de fabricant dans une autre langue ou écriture. @fr
toolkit label: nombre paralelo del fabricante @es
toolkit definition: Un nomen que es un nombre de fabricante en otro idioma o escritura. @es
label: har parallellt tillverkningsnamn @sv
toolkit label: parallellt tillverkningsnamn @sv
toolkit label: parallelle naam van vervaardiger @nl
toolkit definition: Een nomen dat is een naam van vervaardiger in een andere taal of schrift. @nl
label: có tên nhà chế tạo song song @vi
definition: Liên kết biểu thị với tên nhà chế tạo trong ngôn ngữ hoặc hệ thống viết khác với được dùng để ghi trong yếu tố tên nhà chế tạo. @vi
toolkit label: tên nhà chế tạo song song @vi
toolkit definition: Tên nhà chế tạo trong ngôn ngữ hoặc hệ thống viết khác với được dùng để ghi trong yếu tố tên nhà chế tạo. @vi
label: har parallelt navn på producent @da
definition: Relaterer en manifestation til et navn på producent på et andet sprog eller skriftsystem. @da
toolkit label: parallelt navn på producent @da
toolkit definition: Navn på producent på et andet sprog eller skriftsystem. @da
label: hat parallelen Herstellername @de
definition: Setzt eine Manifestation in Beziehung zu einem Herstellernamen in einer anderen Sprache oder einer anderen Schrift. @de
toolkit label: Paralleler Herstellername @de
toolkit definition: Ein Herstellername in einer anderen Sprache oder einer anderen Schrift. @de
label: té com a nom paral·lel de fabricant @ca
definition: Relaciona una manifestació amb un nomen que és un nom de fabricant en una altra llengua o escriptura. @ca
toolkit label: nom paral·lel de fabricant @ca
toolkit definition: Nomen que és un nom de fabricant en una altra llengua o escriptura. @ca
definition: Liittää manifestaation nomeniin, joka on valmistajan nimi toisella kielellä tai kirjoitusjärjestelmällä. @fi
toolkit label: valmistajan rinnakkainen nimi @fi
toolkit definition: Nomen, joka on valmistajan nimi toisella kielellä tai kirjoitusjärjestelmällä. @fi
toolkit label: parallelt navn på tilvirker @no
toolkit definition: Et navn på tilvirker på et annet språk eller i et annet skriftsystem. @no
label: έχει παράλληλο όνομα του κατασκευαστή @el
definition: Συνδέει μια εκδήλωση με το όνομα ενός κατασκευαστή σε μια γλώσσα ή γραφή που διαφέρει από εκείνη με την οποία καταχωρίστηκε στο στοιχείο του ονόματος του κατασκευαστή. @el
toolkit label: παράλληλο όνομα κατασκευαστή @el
toolkit definition: Το όνομα ενός κατασκευαστή σε μια γλώσσα ή γραφή που διαφέρει από εκείνη με την οποία καταχωρίστηκε στο στοιχείο του ονόματος του κατασκευαστή. @el
sub property of: has name of manufacturer
has element type: 3
label: gyártó párhuzamos neve a következő: @hu
definition: Hozzákapcsol egy megjelenési formát egy nomenhez, amely a gyártó neve más nyelven vagy írásrendszerben. @hu
toolkit label: gyártó párhuzamos neve: @hu
toolkit definition: Egy nomen, amely a gyártó neve más nyelven vagy írásrendszerben. @hu
alternative label: parallel manufacturer's name
label: valmistajan rinnakkainen nimi @fi
label: har parallelt navn på tilvirker @no
definition: Relaterer en manifestasjon til et navn på tilvirker på et annet språk eller i et annet skriftsystem. @no
label: heeft parallelle naam van vervaardiger @nl
definition: Relateert een manifestatie aan een nomen dat is een naam van vervaardiger in een andere taal of schrift. @nl
alternative label: rinnakkainen valmistajan nimi @fi
label: له اسم موازي للصانع @ar
definition: يربط بين تجسيدة وتسمية هي اسم للصانع بلغٍة أخرى أو نظام آخر للحروف. @ar
toolkit label: اسم موازي للصانع @ar
toolkit definition: تسمية هي اسم للصانع بلغٍة أخرى أو نظام آخر للحروف. @ar
label: valmistaja rööpnimi @et
definition: Seostab kehastuse valmistaja nimega teises keeles või kirjasüsteemis. @et
toolkit label: valmistaja rööpnimi @et
toolkit definition: Valmistaja nimi teises keeles või kirjasüsteemis. @et
label: ha come nome della manifattura parallelo @it
definition: Correla una manifestazione a un nome della manifattura in una lingua o scrittura diversa. @it
toolkit label: nome della manifattura parallelo @it
toolkit definition: Nome della manifattura in una lingua o scrittura diversa. @it
label: ražotāja paralēlais vārds/nosaukums @lv
definition: Sasaista manifestāciju ar nomenu, kas ir ražotāja vārds/nosaukums citā valodā vai rakstībā. @lv
toolkit label: ražotāja paralēlais vārds/nosaukums @lv
toolkit definition: Ražotāja vārds/nosaukums citā valodā vai rakstībā. @lv
alternative label: اسم موازي للصانع @ar
alternative label: parallelt navn på producent @da
alternative label: 并列生产者名称 @zh-hans
label: 有生产者的并列名称 @zh-hans
definition: 将一种载体表现与作为另一种语言或文字的生产者名称的命名关联起来。 @zh-hans
toolkit label: 生产者的并列名称 @zh-hans
toolkit definition: 作为另一种语言或文字的生产者名称的命名 @zh-hans

has parallel name of publisher
status: Published
definition: Relates a manifestation to a nomen that is a name of publisher in another language or script.
type: Property
domain: C10007
lexical alias: parallelNameOfPublisher.en
instruction number: 2.8.5
toolkit label: parallel name of publisher
toolkit definition: A nomen that is a name of publisher in another language or script.
label: a pour forme parallèle d’un nom d’éditeur @fr
definition: Met une manifestation en relation avec un nomen qui est un nom d’éditeur dans une autre langue ou écriture. @fr
toolkit label: forme parallèle d’un nom d’éditeur @fr
toolkit definition: Nomen qui est un nom d’éditeur dans une autre langue ou écriture. @fr
toolkit label: nombre paralelo del publicador @es
toolkit definition: Un nomen que es un nombre de publicador en otro idioma o escritura. @es
label: har parallellt utgivarnamn @sv
toolkit label: parallellt utgivarnamn @sv
toolkit label: parallelle naam van uitgever @nl
toolkit definition: Een nomen dat is een naam van uitgever in een andere taal of schrift. @nl
label: có tên nhà xuất bản song song @vi
definition: Liên kết biểu thị với tên nhà xuất bản trong ngôn ngữ hoặc hệ thống viết khác với được ghi trong yếu tố tên nhà xuất bản. @vi
toolkit label: tên nhà xuất bản song song @vi
toolkit definition: Tên nhà xuất bản trong ngôn ngữ hoặc hệ thống viết khác với được ghi trong yếu tố tên nhà xuất bản. @vi
label: har parallelt navn på udgiver @da
definition: Relaterer en manifestation til et navn på udgiver på et andet sprog eller skriftsystem. @da
toolkit label: parallelt navn på udgiver @da
toolkit definition: Navn på udgiver på et andet sprog eller skriftsystem. @da
label: hat parallelen Verlagsnamen @de
definition: Setzt eine Manifestation in Beziehung zu einem Verlagsnamen in einer anderen Sprache oder einer anderen Schrift. @de
toolkit label: Paralleler Verlagsname @de
toolkit definition: Ein Verlagsname in einer anderen Sprache oder einer anderen Schrift. @de
label: té com a nom paral·lel d’editor @ca
definition: Relaciona una manifestació amb un nomen que és un nom d’un editor en una altra llengua o escriptura. @ca
toolkit label: nom paral·lel d’editor @ca
toolkit definition: Nomen que és un nom d’un editor en una altra llengua o escriptura. @ca
definition: Liittää manifestaation nomeniin, joka on kustantajan nimi toisella kielellä ja/tai kirjoitusjärjestelmällä. @fi
toolkit label: kustantajan rinnakkainen nimi @fi
toolkit definition: Nomen, joka on kustantajan nimi toisella kielellä ja/tai kirjoitusjärjestelmällä. @fi
toolkit label: parallelt navn på utgiver @no
toolkit definition: Et navn på utgiver på et annet språk eller i et annet skriftsystem. @no
label: έχει παράλληλο όνομα του εκδότη @el
definition: Συνδέει μια εκδήλωση με το όνομα ενός εκδότη σε μια γλώσσα ή γραφή που διαφέρει από εκείνη με την οποία καταχωρίστηκε στο στοιχείο του ονόματος ενός εκδότη. @el
toolkit label: παράλληλο όνομα εκδότη @el
toolkit definition: Το όνομα ενός εκδότη σε μια γλώσσα ή γραφή που διαφέρει από εκείνη με την οποία καταχωρίστηκε στο στοιχείο του ονόματος ενός εκδότη. @el
sub property of: has name of publisher
has element type: 3
label: párhuzamos kiadói neve a következő: @hu
definition: Egy megjelenési formát hozzákapcsol egy kiadó nevéhez olyan nyelven vagy írásmódban, amely különbözik attól, amely a kiadó neve elemben rögzítve van. @hu
toolkit label: párhuzamos kiadói neve: @hu
toolkit definition: Egy kiadó neve olyan nyelven vagy írásmódban, amely különbözik attól, amely a kiadó neve elemben rögzítve van. @hu
alternative label: parallel publisher's name
label: kustantajan rinnakkainen nimi @fi
label: har parallelt navn på utgiver @no
definition: Relaterer en manifestasjon til et navn på utgiver på et annet språk eller i et annet skriftsystem. @no
label: heeft parallelle naam van uitgever @nl
definition: Relateert een manifestatie aan een nomen dat is een naam van uitgever in een andere taal of schrift. @nl
alternative label: rinnakkainen kustantajan nimi @fi
label: له اسم موازي للناشر @ar
definition: يربط بين تجسيدة واسم ناشر في لغة أخرى أو نظام آخر للحروف. @ar
toolkit label: اسم موازي للناشر @ar
toolkit definition: تسمية هي اسم ناشر في لغة أخرى أو نظام آخر للحروف. @ar
label: kirjastaja rööpnimi @et
definition: Seostab kehastuse kirjastaja nimega teises keeles või kirjasüsteemis. @et
toolkit label: kirjastaja rööpnimi @et
toolkit definition: Kirjastaja nimi teises keeles või kirjasüsteemis. @et
label: ha come nome dell'editore parallelo @it
definition: Correla una manifestazione a un nome dell'editore in una lingua o scrittura diversa. @it
toolkit label: nome dell'editore parallelo @it
toolkit definition: Nome dell'editore in una lingua o scrittura diversa. @it
label: izdevēja paralēlais vārds/nosaukums @lv
definition: Sasaista manifestāciju ar nomenu, kas ir izdevēja vārds/nosaukums citā valodā vai rakstībā. @lv
toolkit label: izdevēja paralēlais vārds/nosaukums @lv
toolkit definition: Izdevēja vārds/nosaukums citā valodā vai rakstībā. @lv
alternative label: اسم موازي للناشر @ar
alternative label: 并列出版者名称 @zh-hans
label: 有并列出版者名称 @zh-hans
definition: 将一种载体表现与作为用另一种语言或文字的出版者名称的一个命名关联起来。 @zh-hans
toolkit label: 并列出版者名称 @zh-hans
toolkit definition: 作为用另一种语言或文字的出版者名称的一个命名 @zh-hans
alternative label: nombre del publicador paralelo @es

has parallel statement of responsibility relating to subseries (Deprecated)
status: Deprecated
definition: Relates a manifestation to a statement of responsibility relating to subseries in another language or script. (Deprecated)
type: Property
domain: C10007
lexical alias: parallelStatementOfResponsibilityRelatingToSubseries.en
instruction number: 2.12.15
toolkit label: parallel statement of responsibility relating to subseries (Deprecated)
toolkit definition: A statement of responsibility relating to subseries in another language or script. (Deprecated)
label: a pour mention de responsabilité parallèle relative à une sous-collection @fr
definition: Met une manifestation en relation avec une mention de responsabilité relative à une sous-collection dans une langue ou une écriture différentes de celles enregistrées dans un élément Mention de responsabilité relative à une sous-collection. @fr
toolkit label: mention de responsabilité parallèle relative à une sous-collection @fr
toolkit definition: Mention de responsabilité relative à une sous-collection dans une langue ou une écriture différentes de celles enregistrées dans un élément Mention de responsabilité relative à une sous-collection. @fr
toolkit label: mención paralela de responsabilidad relacionada con la subserie @es
toolkit definition: Una mención de responsabilidad relacionada con una subserie en una lengua y/o escritura que difiere de la registrada en el elemento mención de responsabilidad relacionada con la subserie. @es
label: har parallell upphovsuppgift till underserie @sv
toolkit label: parallell upphovsuppgift till underserie @sv
toolkit label: parallelle verantwoordellijkheidsvermelding gerelateerd aan onderreeks @nl
toolkit definition: Een verantwoordelijkheidsvermelding betreffende een onderreeks in een taal en/of schrift afwijkend van de vermelding zoals opgenomen in de verantwoordelijkheidsvermelding betreffende het element onderreeks. @nl
label: có thông tin trách nhiệm song song liên quan tới tiểu tùng thư @vi
definition: Liên kết biểu thị với thông tin trách nhiệm liên quan tới tiểu tùng thư trong ngôn ngữ hoặc hệ thống viết khác với được ghi trong thông tin trách nhiệm liên quan tới yếu tố tiểu tùng thư. @vi
toolkit label: thông tin trách nhiệm song song liên quan tới tiểu tùng thư @vi
toolkit definition: Thông tin trách nhiệm liên quan tới tiểu tùng thư trong ngôn ngữ hoặc hệ thống viết khác với được ghi trong thông tin trách nhiệm liên quan tới yếu tố tiểu tùng thư. @vi
label: har parallel ophavsangivelse relateret til underserie @da
definition: Relaterer en manifestation til en ophavsangivelse relateret til en underserie på et andet sprog og/eller i et andet alfabet end det som er anvendt ved angivelsen af en ophavsangivelse til en underserie. @da
toolkit label: parallel ophavsangivelse relateret til underserie @da
toolkit definition: Ophavsangivelse relateret til en underserie på et andet sprog og/eller i et andet alfabet end det som er anvendt ved angivelsen af en ophavsangivelse til en underserie. @da
label: hat parallele Verantwortlichkeitsangabe, die sich auf eine Unterreihe bezieht @de
definition: Setzt eine Manifestation mit einer Angabe, die sich auf eine Unterreihe bezieht, in einer Sprache und/oder einer Schrift, die von derjenigen abweicht, die im Element Verantwortlichkeitsangabe, die sich auf eine Unterreihe bezieht, erfasst ist, in Beziehung. @de
toolkit label: Parallele Verantwortlichkeitsangabe, die sich auf eine Unterreihe bezieht @de
toolkit definition: Eine Angabe, die sich auf eine Unterreihe bezieht, in einer Sprache und/oder einer Schrift, die von derjenigen abweicht, die im Element Verantwortlichkeitsangabe, die sich auf eine Unterreihe bezieht, erfasst ist. @de
label: té com a menció paral·lela de responsabilitat relativa a una subcol·lecció @ca
definition: Relaciona una manifestació amb una menció de responsabilitat relativa a la subcol·lecció en una llengua o una escriptura que difereix de l’enregistrada en un element Menció de responsabilitat relativa a una subcol·lecció. @ca
toolkit label: menció paral·lela de responsabilitat relativa a una subcol·lecció @ca
toolkit definition: Menció de responsabilitat relativa a la subcol·lecció en una llengua o una escriptura que difereix de l’enregistrada en un element Menció de responsabilitat relativa a una subcol·lecció. @ca
label: alasarjan rinnakkainen vastuullisuustieto @fi
definition: Liittää manifestaation alasarjan vastuullisuustietoon toisella kielellä ja/tai kirjoitusjärjestelmällä. @fi
toolkit label: alasarjan rinnakkainen vastuullisuustieto @fi
toolkit definition: Alasarjan vastuullisuustieto toisella kielellä ja/tai kirjoitusjärjestelmällä. @fi
toolkit label: parallell ansvarsangivelse knyttet til underserie @no
toolkit definition: En ansvarsangivelse som er knyttet til en underserie i et annet språk eller skriftsystem enn det som er registrert i ansvarsangivelsen knyttet til elementet for underserie. @no
label: έχει παράλληλη μνεία ευθύνης σχετική με την υποσειρά @el
definition: Συνδέει μια εκδήλωση με μια μνεία ευθύνης που σχετίζεται με μια υποσειρά σε μια γλώσσα ή γραφή που διαφέρει από εκείνη με την οποία καταχωρίστηκε σε μια μνεία ευθύνης που σχετίζεται με το στοιχείο της υποσειράς. @el
toolkit label: παράλληλη μνεία ευθύνης σχετική με την υποσειρά @el
toolkit definition: Μια μνεία ευθύνης που σχετίζεται με μια υποσειρά σε μια γλώσσα ή γραφή που διαφέρει από εκείνη με την οποία καταχωρίστηκε σε μια μνεία ευθύνης που σχετίζεται με το στοιχείο της υποσειράς. @el
sub property of: has statement of responsibility relating to subseries (Deprecated)
has element type: 6
label: van alsorozathoz kötődő párhuzamos szerzőségi közlése @hu
definition: Egy megjelenési formát hozzákapcsol egy szerzőségi közléshez, amely kötődik egy alsorozathoz olyan nyelven vagy írásmódban, amely különbözik attól, amely az alsorozathoz kapcsolódó szerzőségi közlés elemben rögzítve van. @hu
toolkit label: alsorozatra vonatkozó párhuzamos szerzőségi közlés @hu
toolkit definition: Egy szerzőségi közlés, amely egy alsorozathoz kötődik olyan nyelven vagy írásmódban, amely különbözik attól, amely az alsorozatra vonatkozó szerzőségi közlés elemben rögzítve van. @hu
has subproperty: P30114

has parallel statement of responsibility relating to named revision of edition
status: Published
definition: Relates a manifestation to a statement of responsibility relating to named revision of an edition in another language or script.
type: Property
domain: C10007
lexical alias: parallelStatementOfResponsibilityRelatingToNamedRevisionOfEdition.en
instruction number: 2.5.9
toolkit label: parallel statement of responsibility relating to named revision of edition
toolkit definition: A statement of responsibility relating to named revision of an edition in another language or script.
label: a pour mention de responsabilité parallèle relative à une révision nommée d’une édition @fr
definition: Met une manifestation en relation avec une mention de responsabilité relative à une révision nommée d’une édition dans une autre langue ou écriture. @fr
toolkit label: mention de responsabilité parallèle relative à une révision nommée d’une édition @fr
toolkit definition: Mention de responsabilité relative à une révision nommée d’une édition dans une autre langue ou écriture. @fr
toolkit label: declaración de responsabilidad paralela relacionada con la revisión nombrada de la edición @es
toolkit definition: Una declaración de responsabilidad relativa a la revisión nombrada de una edición en otro idioma o escritura. @es
label: har parallell upphovsuppgift som hänför sig till påföljande upplagebeteckning @sv
toolkit label: parallell upphovsuppgift som hänför sig till påföljande upplagebeteckning @sv
toolkit label: parallelle verantwoordelijkheidsvermelding gerelateerd aan benoemde herziening van editie @nl
toolkit definition: Een verantwoordelijkheidsvermelding gerelateerd aan een benoemde herziening van een editie in een andere taal of schrift. @nl
label: có thông tin trách nhiệm song song liên quan tới sửa chữa được định rõ của ấn bản @vi
definition: Liên kết biểu thị với thông tin trách nhiệm liên quan tới sửa chữa được định rõ của ấn bản trong ngôn ngữ hoặc hệ thống viết khác với được ghi trong thông tin trách nhiệm liên quan tới yếu tố sửa chữa được định rõ của ấn bản. @vi
toolkit label: thông tin trách nhiệm song song liên quan tới sửa chữa được định rõ của ấn bản @vi
toolkit definition: Thông tin trách nhiệm liên quan tới sửa chữa được định rõ của ấn bản trong ngôn ngữ hoặc hệ thống viết khác với được ghi trong thông tin trách nhiệm liên quan tới yếu tố sửa chữa được định rõ của ấn bản. @vi
label: har parallel ophavsangivelse, som relaterer til en navngivet revision af en udgave @da
definition: Relaterer en manifestation til en ophavsangivelse, som relaterer til en navngivet revision af en udgave på et andet sprog eller skriftsystem. @da
toolkit label: parallel ophavsangivelse, som relaterer til en navngivet revision af en udgave @da
toolkit definition: Ophavsangivelse, som relaterer til en navngivet revision af en udgave på et andet sprog eller skriftsystem. @da
label: hat parallele Verantwortlichkeitsangabe, die sich auf eine näher erläuterte Überarbeitung einer Ausgabe bezieht @de
definition: Setzt eine Manifestation in Beziehung zu einer Verantwortlichkeitsangabe, die sich auf eine näher erläuterte Überarbeitung einer Ausgabe in einer anderen Sprache oder einer anderen Schrift bezieht. @de
toolkit label: Parallele Verantwortlichkeitsangabe, die sich auf eine näher erläuterte Überarbeitung einer Ausgabe bezieht @de
toolkit definition: Eine Verantwortlichkeitsangabe, die sich auf eine näher erläuterte Überarbeitung einer Ausgabe in einer anderen Sprache oder einer anderen Schrift bezieht. @de
label: té com a menció paral·lela de responsabilitat relativa a una revisió explícita d’edició @ca
definition: Relaciona una manifestació amb una menció de responsabilitat relativa a una revisió explícita d’una edició en una altra llengua o escriptura. @ca
toolkit label: menció paral·lela de responsabilitat relativa a una revisió explícita d’edició @ca
toolkit definition: Menció de responsabilitat relativa a una revisió explícita d’una edició en una altra llengua o escriptura. @ca
definition: Liittää manifestaation nimettyyn uudistettuun painokseen liittyvään vastuullisuusmerkintöön toisella kielellä ja/tai kirjoitusjärjestelmällä. @fi
toolkit label: nimettyyn uudistettuun painokseen liittyvä rinnakkainen vastuullisuusmerkintö @fi
toolkit definition: Nimettyyn uudistettuun painokseen liittyvä vastuullisuusmerkintö toisella kielellä ja/tai kirjoitusjärjestelmällä. @fi
toolkit label: parallell ansvarsangivelse som er knyttet til en bestemt revisjon av en utgave @no
toolkit definition: En ansvarsangivelse knyttet til en bestemt revisjon av en utgave på et annet språk eller i et annet skriftsystem. @no
label: έχει παράλληλη μνεία ευθύνης σχετική με την κατονομαζόμενη αναθεώρηση της έκδοσης @el
definition: Συνδέει μια εκδήλωση με μια μνεία ευθύνης που σχετίζεται με μια κατονομαζόμενη αναθεώρηση μιας έκδοσης σε μια γλώσσα ή γραφή που διαφέρει από εκείνη με την οποία καταχωρίστηκε σε μια μνεία ευθύνης που σχετίζεται με μια κατονομαζόμενη αναθεώρηση του στοιχείου της έκδοσης. @el
toolkit label: παράλληλη μνεία ευθύνης σχετική με την κατονομαζόμενη αναθεώρηση της έκδοσης @el
toolkit definition: Μια μνεία ευθύνης που σχετίζεται με μια κατονομαζόμενη αναθεώρηση μιας έκδοσης σε μια γλώσσα ή γραφή που διαφέρει από εκείνη με την οποία καταχωρίστηκε σε μια μνεία ευθύνης που σχετίζεται με μια κατονομαζόμενη αναθεώρηση του στοιχείου της έκδοσης. @el
sub property of: has statement of responsibility relating to named revision of edition
has element type: 6
label: kiadás nevesített átdolgozásához kötődő párhuzamos felelősségi közlése a következő: @hu
definition: Egy megjelenési formát hozzákapcsol egy felelősségi közléshez, amely kötődik egy kiadás nevesített revíziójához olyan nyelven vagy írásmódban, amely különbözik attól, amely a kiadás nevesített revíziójához kapcsolódó szerzőségi közlés elemben rögzítve van. @hu
toolkit label: kiadás nevesített átdolgozásához kötődő párhuzamos felelősségi közlése: @hu
toolkit definition: Egy felelősségi közlés, amely kötődik egy kiadás nevesített revíziójához olyan nyelven vagy írásmódban, amely különbözik attól, amely a kiadás nevesített revíziójához kapcsolódó szerzőségi közlés elemben rögzítve van. @hu
label: nimettyyn uudistettuun painokseen liittyvä rinnakkainen vastuullisuusmerkintö @fi
label: har parallell ansvarsangivelse som er knyttet til en bestemt revisjon av en utgave @no
definition: Relaterer en manifestasjon til en ansvarsangivelse knyttet til en bestemt revisjon av en utgave på et annet språk eller i et annet skriftsystem. @no
label: heeft parallelle verantwoordelijkheidsvermelding gerelateerd aan benoemde herziening van editie @nl
definition: Relateert een manifestatie aan een verantwoordelijkheidsvermelding gerelateerd aan een benoemde herziening van een editie in een andere taal of schrift. @nl
label: له بيان موازي للمسئولية متعلقة بالمراجعة المسماة لطبعة @ar
definition: يربط بين تجسيدة وبيان مسئولية مرتبط بمراجعة مسماه لطبعة في لغة أخرى أو نظام آخر للحروف. @ar
toolkit label: بيان موازي للمسئولية متعلقة بالمراجعة المسماة لطبعة @ar
toolkit definition: بيان مسئولية مرتبط بمراجعة مسماه لطبعة في لغة أخرى أو نظام آخر للحروف. @ar
label: editsiooni nimelise uusversiooniga seotud rööpvastutusandmed @et
definition: Seostab kehastuse editsiooni nimelise uusversiooniga seotud vastutusandmetega teises keeles või kirjasüsteemis. @et
toolkit label: editsiooni nimelise uusversiooniga seotud rööpvastutusandmed @et
toolkit definition: Editsiooni nimelise uusversiooniga seotud vastutusandmed teises keeles või kirjasüsteemis. @et
label: ha come formulazione di responsabilità parallela relativa a una revisione identificata di un’edizione @it
definition: Correla una manifestazione a una formulazione di responsabilità relativa a una revisione identificata di un’edizione, in una lingua o scrittura diversa. @it
toolkit label: formulazione di responsabilità parallela relativa a una revisione identificata di un’edizione @it
toolkit definition: Formulazione di responsabilità relativa a una revisione identificata di un’edizione, in una lingua o scrittura diversa. @it
label: paralēlās atbildības ziņas saistītas ar pārstrādāto izdevumu @lv
definition: Sasaista manifestāciju ar atbildības ziņām saistītas ar pārstrādāto izdevumu citā valodā vai rakstībā. @lv
toolkit label: paralēlās atbildības ziņas saistītas ar pārstrādāto izdevumu @lv
toolkit definition: Atbildības ziņas saistītas ar pārstrādāto izdevumu citā valodā vai rakstībā. @lv
label: 有和版本的命名修订有关的并列责任说明 @zh-hans
definition: 将一种载体表现与和版本的命名修订有关的用另一种语言或文字的一个责任说明关联起来。 @zh-hans
toolkit label: 和版本的命名修订有关的并列责任说明 @zh-hans
toolkit definition: 和版本的命名修订有关的用另一种语言或文字的一个责任说明 @zh-hans
label: adlandırılmış basım revizyonu ile ilgili paralel sorumluluk bildirimi ile ilişkilidir @tr
definition: Bir gösterimi, bir baskının başka bir dilde veya senaryoda adlandırılmış revizyonuyla ilgili bir sorumluluk beyanıyla ilişkilendirir. @tr
toolkit label: basımın adlandırılmış revizyonuna ilişkin paralel sorumluluk bildirimi @tr
toolkit definition: Başka bir dildeki veya alfabedeki bir basımın adlandırılmış revizyonuyla ilgili bir sorumluluk bildirimi. @tr
label: tiene una declaración de responsabilidad paralela relacionada con la revisión nombrada de la edición @es

has parallel statement of responsibility relating to edition
status: Published
definition: Relates a manifestation to a statement of responsibility relating to the edition in another language or script.
type: Property
domain: C10007
lexical alias: parallelStatementOfResponsibilityRelatingToEdition.en
instruction number: 2.5.5
toolkit label: parallel statement of responsibility relating to edition
toolkit definition: A statement of responsibility relating to edition in another language or script.
label: a pour mention de responsabilité parallèle relative à une édition @fr
definition: Met une manifestation en relation avec une mention de responsabilité relative à une édition dans une autre langue ou écriture. @fr
toolkit label: mention de responsabilité parallèle relative à une édition @fr
toolkit definition: Mention de responsabilité relative à une édition dans une autre langue ou écriture. @fr
toolkit label: declaración de responsabilidad paralela relativa a la edición @es
toolkit definition: Una declaración de responsabilidad relativa a la edición en otra lengua o escritura. @es
label: har parallell upphovsuppgift som hänför sig till upplagan @sv
toolkit label: parallell upphovsuppgift som hänför sig till upplagan @sv
toolkit label: parallelle verantwoordelijkheidsvermelding gerelateerd aan editie @nl
toolkit definition: Een verantwoordelijkheidsvermelding gerelateerd aan editie in een andere taal of schrift. @nl
label: có thông tin trách nhiệm song song liên quan tới ấn bản @vi
definition: Liên kết biểu thị với thông tin trách nhiệm liên quan tới ấn bản trong ngôn ngữ hoặc hệ thống viết khác với được ghi trong thông tin trách nhiệm liên quan tới yếu tố ấn bản. @vi
toolkit label: thông tin trách nhiệm song song liên quan tới ấn bản @vi
toolkit definition: Thông tin trách nhiệm liên quan tới ấn bản trong ngôn ngữ hoặc hệ thống viết khác với được ghi trong thông tin trách nhiệm liên quan tới yếu tố ấn bản. @vi
label: har parallel ophavsangivelse, som relaterer til udgave @da
definition: Relaterer en manifestation til en ophavsangivelse, som relaterer til udgave på et andet sprog eller skriftsystem. @da
toolkit label: parallel ophavsangivelse, som relaterer til udgave @da
toolkit definition: Ophavsangivelse, som relaterer til udgave på et andet sprog eller skriftsystem. @da
label: hat parallele Verantwortlichkeitsangabe, die sich auf eine Ausgabe bezieht @de
definition: Setzt eine Manifestation in Beziehung zu einer Verantwortlichkeitsangabe, die sich auf eine Ausgabe in einer anderen Sprache oder einer anderen Schrift bezieht. @de
toolkit label: Parallele Verantwortlichkeitsangabe, die sich auf eine Ausgabe bezieht @de
toolkit definition: Eine Verantwortlichkeitsangabe, die sich auf eine Ausgabe in einer anderen Sprache oder einer anderen Schrift bezieht. @de
label: té com a menció paral·lela de responsabilitat relativa a una edició @ca
definition: Relaciona una manifestació amb una menció de responsabilitat relativa a una edició en una altra llengua o escriptura. @ca
toolkit label: menció paral·lela de responsabilitat relativa a una edició @ca
toolkit definition: Menció de responsabilitat relativa a una edició en una altra llengua o escriptura. @ca
definition: Liittää manifestaation painokseen liittyvään vastuullisuusmerkintöön toisella kielellä ja/tai kirjoitusjärjestelmällä. @fi
toolkit label: painokseen liittyvä rinnakkainen vastuullisuusmerkintö @fi
toolkit definition: Painokseen liittyvään vastuullisuusmerkintö toisella kielellä ja/tai kirjoitusjärjestelmällä. @fi
toolkit label: parallell ansvarsangivelse knyttet til utgave @no
toolkit definition: En ansvarsangivelse knyttet til utgave på et annet språk eller i et annet skriftsystem. @no
label: έχει παράλληλη μνεία ευθύνης σχετική με την έκδοση @el
definition: Συνδέει μια εκδήλωση με μια μνεία ευθύνης που σχετίζεται με την έκδοση σε μια γλώσσα ή γραφή που διαφέρει από εκείνη με την οποία καταχωρίστηκε σε μια μνεία ευθύνης που σχετίζεται με το στοιχείο της έκδοσης. @el
toolkit label: παράλληλη μνεία ευθύνης σχετική με την έκδοση @el
toolkit definition: Μια μνεία ευθύνης που σχετίζεται με την έκδοση σε μια γλώσσα ή γραφή που διαφέρει από εκείνη με την οποία καταχωρίστηκε σε μια μνεία ευθύνης που σχετίζεται με το στοιχείο της έκδοσης. @el
sub property of: has statement of responsibility relating to edition
has element type: 6
label: kiadáshoz kapcsolódó párhuzamos felelősségi közlése a következő: @hu
definition: Egy megjelenési formát hozzákapcsol egy felelősségi közléshez, amely kötődik egy kiadáshoz olyan nyelven vagy írásmódban, amely különbözik attól, amely a kiadáshoz kapcsolódó szerzőségi közlés elemben rögzítve van. @hu
toolkit label: kiadáshoz kapcsolódó párhuzamos felelősségi közlése: @hu
toolkit definition: Egy felelősségi közlés, amely egy kiadáshoz kötődik olyan nyelven vagy írásmódban, amely különbözik attól, amely a kiadásra vonatkozó szerzőségi közlés elemben rögzítve van. @hu
label: painokseen liittyvä rinnakkainen vastuullisuusmerkintö @fi
label: har parallell ansvarsangivelse knyttet til utgave @no
definition: Relaterer en manifestasjon til en ansvarsangivelse knyttet til utgave på et annet språk eller i et annet skriftsystem. @no
label: heeft parallelle verantwoordelijkheidsvermelding gerelateerd aan editie @nl
definition: Relateert een manifestatie aan een verantwoordelijkheidsvermelding gerelateerd aan editie in een andere taal of schrift. @nl
label: له بيان مسئولية موازي مرتبط بطبعة @ar
definition: يربط بين تجسيدة وبيان مسئولية مرتبط بطبعة بلغٍة أخرى أو نظام آخر للحروف. @ar
toolkit label: بيان مسئولية موازي مرتبط بطبعة @ar
toolkit definition: بيان مسئولية مرتبطة بطبعة في لغة أخرى أو نظام آخر للحروف. @ar
label: editsiooniga seotud rööpvastutusandmed @et
definition: Seostab kehastuse editsiooni vastutusandmetega teises keeles või kirjasüsteemis. @et
toolkit label: editsiooniga seotud rööpvastutusandmed @et
toolkit definition: Editsiooni vastutusandmed teises keeles või kirjasüsteemis. @et
label: ha come formulazione di responsabilità parallela relativa all’edizione @it
definition: Correla una manifestazione a una formulazione di responsabilità relativa all'edizione, in una lingua o scrittura diversa. @it
toolkit label: formulazione di responsabilità parallela relativa all’edizione @it
toolkit definition: Formulazione di responsabilità relativa all'edizione, in una lingua o scrittura diversa. @it
label: paralēlās izdevuma atbildības ziņas @lv
definition: Sasaista manifestāciju ar izdevuma atbildības ziņām citā valodā vai rakstībā. @lv
toolkit label: paralēlās izdevuma atbildības ziņas @lv
toolkit definition: Izdevuma atbildības ziņas citā valodā vai rakstībā. @lv
label: 有和版本有关的并列责任说明 @zh-hans
definition: 将一种载体表现与和版本有关的用另一种语言或文字的一个责任说明关联起来。 @zh-hans
toolkit label: 和版本有关的并列责任说明 @zh-hans
toolkit definition: 和版本有关的用另一种语言或文字的一个责任说明 @zh-hans
label: basım ile ilgili paralel sorumluluk bildirimi ile ilişkilidir @tr
definition: Bir gösterimi, başka bir dilde veya senaryodaki baskıyla ilgili bir sorumluluk beyanıyla ilişkilendirir. @tr
toolkit label: basıma ilişkin paralel sorumluluk bildirimi @tr
toolkit definition: Başka bir dilde veya alfabede basımla ilgili sorumluluk bildirimi @tr
label: tiene una declaración de responsabilidad paralela relativa a la edición @es

has parallel statement of responsibility relating to series
status: Published
definition: Relates a manifestation to a statement of responsibility relating to series in another language or script.
type: Property
domain: C10007
lexical alias: parallelStatementOfResponsibilityRelatingToSeries.en
instruction number: 2.12.7
toolkit label: parallel statement of responsibility relating to series
toolkit definition: A statement of responsibility relating to series in another language or script.
label: a pour mention de responsabilité parallèle relative à une collection @fr
definition: Met une manifestation en relation avec une mention de responsabilité relative à une collection dans une autre langue ou écriture. @fr
toolkit label: mention de responsabilité parallèle relative à une collection @fr
toolkit definition: Mention de responsabilité relative à une collection dans une autre langue ou écriture. @fr
toolkit label: declaración de responsabilidad paralela relativa a la serie @es
toolkit definition: Una declaración de responsabilidad relativa a series en otro idioma o escritura. @es
label: har parallell upphovsuppgift till serie @sv
toolkit label: parallell upphovsuppgift till serie @sv
toolkit label: parallelle verantwoordelijkheidsvermelding gerelateerd aan reeks @nl
toolkit definition: Een verantwoordelijkheidsvermelding gerelateerd aan reeks in een andere taal of schrift. @nl
label: có thông tin trách nhiệm song song liên quan tới tùng thư @vi
definition: Liên kết biểu thị với thông tin trách nhiệm liên quan tới tùng thư trong ngôn ngữ hoặc hệ thống viết khác với được ghi trong thông tin trách nhiệm liên quan tới yếu tố tùng thư. @vi
toolkit label: thông tin trách nhiệm song song liên quan tới tùng thư @vi
toolkit definition: Thông tin trách nhiệm liên quan tới tùng thư trong ngôn ngữ hoặc hệ thống viết khác với được ghi trong thông tin trách nhiệm liên quan tới yếu tố tùng thư. @vi
label: har parallel ophavsangivelse, som relaterer til serie @da
definition: Relaterer en manifestation til en ophavsangivelse, som relaterer til serie på et andet sprog eller skriftsystem. @da
toolkit label: parallel ophavsangivelse, som relaterer til serie @da
toolkit definition: Ophavsangivelse, som relaterer til serie på et andet sprog eller skriftsystem. @da
label: hat parallele Verantwortlichkeitsangabe, die sich auf eine Reihe bezieht @de
definition: Setzt eine Manifestation in Beziehung zu einer Verantwortlichkeitsangabe, die sich auf eine Reihe in einer anderen Sprache oder einer anderen Schrift bezieht. @de
toolkit label: Parallele Verantwortlichkeitsangabe, die sich auf eine Reihe bezieht @de
toolkit definition: Eine Verantwortlichkeitsangabe, die sich auf eine Reihe in einer anderen Sprache oder einer anderen Schrift bezieht. @de
label: té com a menció paral·lela de responsabilitat relativa a una col·lecció @ca
definition: Relaciona una manifestació amb una menció de responsabilitat relativa a una col·lecció en una altra llengua o escriptura. @ca
toolkit label: menció paral·lela de responsabilitat relativa a una col·lecció @ca
toolkit definition: Menció de responsabilitat relativa a una col·lecció en una altra llengua o escriptura. @ca
definition: Liittää manifestaation sarjan vastuullisuusmerkintöön toisella kielellä ja/tai kirjoitusjärjestelmällä. @fi
toolkit label: sarjan rinnakkainen vastuullisuusmerkintö @fi
toolkit definition: Sarjan vastuullisuusmerkintö toisella kielellä ja/tai kirjoitusjärjestelmällä. @fi
toolkit label: parallell ansvarsangivelse knyttet til serie @no
toolkit definition: En ansvarsangivelse knyttet til serie på et annet språk eller i et annet skriftsystem. @no
label: έχει παράλληλη μνεία ευθύνης σχετική με τη σειρά @el
definition: Συνδέει μια εκδήλωση με μια μνεία ευθύνης που σχετίζεται με τη σειρά σε μια γλώσσα ή γραφή που διαφέρει από εκείνη με την οποία καταχωρίστηκε σε μια μνεία ευθύνης που σχετίζεται με το στοιχείο της σειράς. @el
toolkit label: παράλληλη μνεία εθύνης σχετική με τη σειρά @el
toolkit definition: Μια μνεία ευθύνης που σχετίζεται με τη σειρά σε μια γλώσσα ή γραφή που διαφέρει από εκείνη με την οποία καταχωρίστηκε σε μια μνεία ευθύνης που σχετίζεται με το στοιχείο της σειράς. @el
sub property of: has statement of responsibility relating to series
has element type: 6
label: sorozathoz kapcsolódó párhuzamos felelősségi közlése a következő: @hu
definition: Hozzákapcsol egy megjelenési formát egy sorozatra vonatkozó felelősségi közléshez más nyelven vagy írásrendszerben. @hu
toolkit label: sorozathoz kapcsolódó párhuzamos felelősségi közlése: @hu
toolkit definition: Egy felelősségi közlés, amely egy sorozathoz kötődik olyan nyelven vagy írásmódban, amely különbözik attól, amely a sorozatra vonatkozó szerzőségi közlés elemben rögzítve van. @hu
alternative label: parallel statement of responsibility relating to subseries
alternative label: alasarjaan liittyvä rinnakkainen vastuullisuusmerkintö @fi
label: sarjan rinnakkainen vastuullisuusmerkintö @fi
label: har parallell ansvarsangivelse knyttet til serie @no
definition: Relaterer en manifestasjon til en ansvarsangivelse knyttet til serie på et annet språk eller i et annet skriftsystem. @no
alternative label: parallell ansvarsangivelse knyttet til underserie @no
alternative label: mention de responsabilité parallèle relative à une sous-collection @fr
label: heeft parallelle verantwoordelijkheidsvermelding gerelateerd aan reeks @nl
definition: Relateert een manifestatie aan een verantwoordelijkheidsvermelding gerelateerd aan reeks in een andere taal of schrift. @nl
label: له بيان موازي للمسئولية مرتبط بسلسلة @ar
definition: يربط بين تجسيدة وبيان مسئولية مرتبط بسلسلة في لغة أخرى أو نظام آخر للحروف. @ar
alternative label: بيان مسئولية بديل مرتبط بسلسلة فرعية @ar
toolkit label: بيان موازي للمسئولية مرتبط بسلسلة @ar
toolkit definition: بيان مسئولية مرتبط بسلسلة في لغة أخرى أو نظام آخر للحروف. @ar
alternative label: menció paral·lela de responsabilitat relativa a una subcol·lecció @ca
alternative label: har parallel ophavsangivelse, som relaterer til underserie @da
label: seeriaga seotud rööpvastutusandmed @et
definition: Seostab kehastuse seeria vastutusandmetega teises keeles või kirjasüsteemis. @et
alternative label: allseeriaga seotud rööpvastutusandmed @et
toolkit label: seeriaga seotud rööpvastutusandmed @et
toolkit definition: Seeria vastutusandmed teises keeles või kirjasüsteemis. @et
alternative label: Parallele Verantwortlichkeitsangabe, die sich auf eine Unterreihe bezieht @de
alternative label: kapcsolodó alsorozatra vonatkozó párhuzamos felelősségi közlése: @hu
label: ha come formulazione di responsabilità parallela relativa alla serie @it
definition: Correla una manifestazione a una formulazione di responsabilità relativa alla serie, in una lingua o scrittura diversa. @it
alternative label: formulazione di responsabilità parallela relativa alla sottoserie @it
toolkit label: formulazione di responsabilità parallela relativa alla serie @it
toolkit definition: Formulazione di responsabilità relativa alla serie, in una lingua o scrittura diversa. @it
label: sērijas paralēlās atbildības ziņas @lv
toolkit label: sērijas paralēlās atbildības ziņas @lv
toolkit definition: Sērijas atbildības ziņas citā valodā vai rakstībā. @lv

has parallel statement of responsibility relating to title proper
status: Published
definition: Relates a manifestation to a statement of responsibility relating to title proper in another language or script.
type: Property
domain: C10007
sub property of: has statement of responsibility relating to title proper
lexical alias: parallelStatementOfResponsibilityRelatingToTitleProper.en
instruction number: 2.4.3
toolkit label: parallel statement of responsibility relating to title proper
toolkit definition: A statement of responsibility relating to title proper in another language or script.
label: a pour mention de responsabilité parallèle relative à un titre propre @fr
definition: Met une manifestation en relation avec une mention de responsabilité relative à un titre propre dans une autre langue ou écriture. @fr
toolkit label: mention de responsabilité parallèle relative à un titre propre @fr
toolkit definition: Mention de responsabilité relative à un titre propre dans une autre langue ou écriture. @fr
toolkit label: declaración de responsabilidad paralela relativa al título propiamente dicho @es
toolkit definition: Una declaración de responsabilidad relativa al título propiamente dicho en otra lengua o escritura. @es
label: har parallell upphovsuppgift som hänför sig till huvudtiteln @sv
toolkit label: parallell upphovsuppgift som hänför sig till huvudtiteln @sv
toolkit label: parallelle verantwoordelijkheidsvermelding gerelateerd aan hoofdtitel @nl
toolkit definition: Een verantwoordelijkheidsvermelding gerelateerd aan hoofdtitel in een andere taal of schrift. @nl
label: có thông tin trách nhiệm song song liên quan tới nhan đề hợp thức @vi
definition: Liên kết biểu thị với thông tin trách nhiệm liên quan tới nhan đề hợp thức trong ngôn ngữ hoặc hệ thống viết khác với được ghi trong thông tin trách nhiệm liên quan tới yếu tố nhan đề hợp thức. @vi
toolkit label: thông tin trách nhiệm song song liên quan tới nhan đề hợp thức @vi
toolkit definition: Thông tin trách nhiệm liên quan tới nhan đề hợp thức trong ngôn ngữ hoặc hệ thống viết khác với được ghi trong thông tin trách nhiệm liên quan tới yếu tố nhan đề hợp thức. @vi
label: har parallel ophavsangivelse, som relaterer til hovedtitel @da
definition: Relaterer en manifestation til en ophavsangivelse, som relaterer til hovedtitel på et andet sprog eller skriftsystem. @da
toolkit label: parallel ophavsangivelse, som relaterer til hovedtitel @da
toolkit definition: Ophavsangivelse, som relaterer til hovedtitel på et andet sprog eller skriftsystem. @da
label: hat parallele Verantwortlichkeitsangabe, die sich auf einen Haupttitel bezieht @de
definition: Setzt eine Manifestation in Beziehung zu einer Verantwortlichkeitsangabe, die sich auf einen Haupttitel in einer anderen Sprache oder einer anderen Schrift bezieht. @de
toolkit label: Parallele Verantwortlichkeitsangabe, die sich auf einen Haupttitel bezieht @de
toolkit definition: Eine Verantwortlichkeitsangabe, die sich auf einen Haupttitel in einer anderen Sprache oder einer anderen Schrift bezieht. @de
label: té com a menció paral·lela de responsabilitat relativa a un títol propi @ca
definition: Relaciona una manifestació amb una menció de responsabilitat relativa a un títol propi en una altra llengua o escriptura. @ca
toolkit label: menció paral·lela de responsabilitat relativa a un títol propi @ca
toolkit definition: Menció de responsabilitat relativa a un títol propi en una altra llengua o escriptura. @ca
definition: Liittää manifestaation päänimekkeeseen liittyvään vastuullisuusmerkintöön toisella kielellä ja/tai kirjoitusjärjestelmällä. @fi
toolkit label: päänimekkeeseen liittyvä rinnakkainen vastuullisuusmerkintö @fi
toolkit definition: Päänimekkeeseen liittyvään vastuullisuusmerkintö toisella kielellä ja/tai kirjoitusjärjestelmällä. @fi
toolkit label: parallell ansvarsangivelse knyttet til hovedtittel @no
toolkit definition: En ansvarsangivelse knyttet til hovedtittel på et annet språk eller i et annet skriftsystem. @no
label: έχει παράλληλη μνεία ευθύνης σχετική με τον κύριο τίτλο @el
definition: Συνδέει μια εκδήλωση με μια μνεία ευθύνης που σχετίζεται με τον κύριο τίτλο σε μια γλώσσα ή γραφή που διαφέρει από εκείνη με την οποία καταχωρίστηκε σε μια μνεία ευθύνης που σχετίζεται με το στοιχείο του κύριου τίτλου. @el
toolkit label: παράλληλη μνεία ευθύνης σχετική με τον κύριο τίτλο @el
toolkit definition: Μια μνεία ευθύνης που σχετίζεται με τον κύριο τίτλο σε μια γλώσσα ή γραφή που διαφέρει από εκείνη με την οποία καταχωρίστηκε σε μια μνεία ευθύνης που σχετίζεται με το στοιχείο του κύριου τίτλου. @el
has element type: 6
label: főcímhez kapcsolódó párhuzamos felelősségi közlése a következő: @hu
definition: Hozzákapcsol egy megjelenési formát egy főcímre vonatkozó felelősségi közléshez más nyelven vagy írásrendszerben. @hu
toolkit label: főcímhez kapcsolódó párhuzamos felelősségi közlése: @hu
toolkit definition: Egy főcímre vonatkozó felelősségi közlés más nyelven vagy írásrendszerben. @hu
label: päänimekkeeseen liittyvä rinnakkainen vastuullisuusmerkintö @fi
label: har parallell ansvarsangivelse knyttet til hovedtittel @no
definition: Relaterer en manifestasjon til en ansvarsangivelse knyttet til hovedtittel på et annet språk eller i et annet skriftsystem. @no
label: heeft parallelle verantwoordelijkheidsvermelding gerelateerd aan hoofdtitel @nl
definition: Relateert een manifestatie aan een verantwoordelijkheidsvermelding gerelateerd aan hoofdtitel in een andere taal of schrift. @nl
label: له بيان موازي للمسئولية مرتبط بالعنوان نفسه @ar
definition: يربط بين تجسيدة وبيان مسئولية مرتبطة بالعنوان نفسه في لغة أخرى أو نظام آخر للحروف. @ar
toolkit label: بيان موازي للمسئولية مرتبط بالعنوان نفسه @ar
toolkit definition: بيان مسئولية مرتبطة بالعنوان نفسه في لغة أخرى أو نظام آخر للحروف. @ar
label: põhipealkirjaga seotud rööpvastutusandmed @et
definition: Seostab kehastuse põhipealkirjaga seotud vastutusandmetega teises keeles või kirjasüsteemis. @et
toolkit label: põhipealkirjaga seotud rööpvastutusandmed @et
toolkit definition: Põhipealkirjaga seotud vastutusandmed teises keeles või kirjasüsteemis. @et
label: paralēlās pamatnosaukuma atbildības ziņas @lv
definition: Sasaista manifestāciju ar pamatnosaukuma atbildības ziņām citā valodā vai rakstībā. @lv
toolkit label: paralēlās pamatnosaukuma atbildības ziņas @lv
toolkit definition: Pamatnosaukuma atbildības ziņas citā valodā vai rakstībā. @lv
label: 有和正题名有关的并列责任说明 @zh-hans
definition: 将一种载体表现与和正题名有关的用另一种语言或文字的一个责任说明关联起来。 @zh-hans
toolkit label: 和正题名有关的并列责任说明 @zh-hans
toolkit definition: 和正题名有关的用另一种语言或文字的一个责任说明 @zh-hans
label: esas başlık ile ilgili paralel sorumluluk bildirimi ile ilişkilidir @tr
definition: Bir gösterimi, başka bir dildeki veya alfabedeki uygun başlıkla ilgili bir sorumluluk bildirimiyle ilişkilendirir. @tr
toolkit label: uygun başlığa ilişkin paralel sorumluluk bildirimi @tr
toolkit definition: Başka bir dilde veya alfabede uygun başlıkla ilgili bir sorumluluk bildirimi. @tr
label: tiene una declaración de responsabilidad paralela relativa al título propiamente dicho @es
definition: Relaciona una manifestación con una declaración de responsabilidad relativa al título propiamente dicho en otra lengua o escritura. @es
has subproperty: P30116

has parallel name of distributor
status: Published
definition: Relates a manifestation to a nomen that is a name of distributor in another language or script.
type: Property
domain: C10007
lexical alias: parallelNameOfDistributor.en
instruction number: 2.9.5
toolkit label: parallel name of distributor
toolkit definition: A nomen that is a name of distributor in another language or script.
label: a pour forme parallèle d’un nom de diffuseur ou de distributeur @fr
definition: Met une manifestation en relation avec un nomen qui est un nom de diffuseur ou de distributeur dans une autre langue ou écriture. @fr
toolkit label: forme parallèle d’un nom de diffuseur ou de distributeur @fr
toolkit definition: Nomen qui est un nom de diffuseur ou de distributeur dans une autre langue ou écriture. @fr
toolkit label: nombre paralelo del distribuidor @es
toolkit definition: Un nomen que es un nombre de distribuidor en otro lenguaje o escritura. @es
label: har parallellt distributörsnamn @sv
toolkit label: parallellt distributörsnamn @sv
toolkit label: parallelle naam van distributeur @nl
toolkit definition: Een nomen dat is een naam van distributeur in een andere taal of schrift. @nl
label: có tên nhà phân phối song song @vi
definition: Liên kết biểu thị với tên nhà phân phối trong ngôn ngữ hoặc hệ thống viết khác với được dùng để ghi trong định danh của phiên bản được định rõ của yếu tố tên nhà phân phối. @vi
toolkit label: tên nhà phân phối song song @vi
toolkit definition: Tên nhà phân phối trong ngôn ngữ hoặc hệ thống viết khác với được dùng để ghi trong định danh của phiên bản được định rõ của yếu tố tên nhà phân phối. @vi
label: har parallelt navn på distributør @da
definition: Relaterer en manifestation til et navn på distributør på et andet sprog eller skriftsystem. @da
toolkit label: parallelt navn på distributør @da
toolkit definition: Navn på distributør på et andet sprog eller skriftsystem. @da
label: hat parallelen Vertriebsnamen @de
definition: Setzt eine Manifestation in Beziehung zu einem Vertriebsnamen in einer anderen Sprache oder einer anderen Schrift. @de
toolkit label: Paralleler Vertriebsname @de
toolkit definition: Ein Vertriebsname in einer anderen Sprache oder einer anderen Schrift. @de
label: té com a nom paral·lel de distribuïdor @ca
definition: Relaciona una manifestació amb un nomen que és un nom de distribuïdor en una altra llengua o escriptura. @ca
toolkit label: nom paral·lel de distribuïdor @ca
toolkit definition: Nomen que és un nom de distribuïdor en una altra llengua o escriptura. @ca
definition: Liittää manifestaation nomeniin, joka on jakajan nimeen toisella kielellä ja/tai kirjoitusjärjestelmällä. @fi
toolkit label: jakelijan rinnakkainen nimi @fi
toolkit definition: Nomen, joka on jakelijan nimi toisella kielellä ja/tai kirjoitusjärjestelmällä. @fi
toolkit definition: Et navn på distributør på et annet språk eller i et annet skriftsystem. @no
label: έχει παράλληλο όνομα του διαθέτη @el
definition: Συνδέει μια εκδήλωση με το όνομα ενός διαθέτη σε μια γλώσσα ή γραφή που διαφέρει από εκείνη με την οποία καταχωρίστηκε στο στοιχείο του ονόματος του διαθέτη. @el
toolkit label: παράλληλο όνομα διαθέτη @el
toolkit definition: Το όνομα ενός διαθέτη σε μια γλώσσα ή γραφή που διαφέρει από εκείνη με την οποία καταχωρίστηκε στο στοιχείο του ονόματος του διαθέτη. @el
sub property of: has name of distributor
has element type: 3
label: terjesztő párhuzamos neve a következő: @hu
definition: Hozzákapcsol egy megjelenési formát egy nomenhez, egy terjesztő nevéhez más nyelven vagy írásrendszerben. @hu
toolkit label: terjesztő párhuzamos neve: @hu
toolkit definition: Egy nomen, egy terjesztő neve más nyelven vagy írásrendszerben. @hu
alternative label: parallel distributor's name
label: jakelijan rinnakkainen nimi @fi
definition: Relaterer en manifestasjon til et navn på distributør på et annet språk eller i et annet skriftsystem. @no
label: heeft parallelle naam van distributeur @nl
definition: Relateert een manifestatie aan een nomen dat is een naam van distributeur in een andere taal of schrift. @nl
alternative label: rinnakkainen jakelijan nimi @fi
label: له اسم موازي للموزع @ar
definition: يربط بين تجسيدة واسم الموزع في لغة أخرى أو نظام آخر للحروف. @ar
toolkit label: اسم موازي للموزع @ar
toolkit definition: اسم الموزع في لغة أخرى أو نظام آخر للحروف. @ar
label: levitaja rööpnimi @et
definition: Seostab kehastuse levitaja nimega teises keeles või kirjasüsteemis. @et
toolkit label: levitaja rööpnimi @et
toolkit definition: Levitaja nimi teises keeles või kirjasüsteemis. @et
label: ha come nome del distributore parallelo @it
definition: Correla una manifestazione a un nome del distributore in una lingua o scrittura diversa. @it
toolkit label: nome del distributore parallelo @it
toolkit definition: Nome del distributore in una lingua o scrittura diversa. @it
label: izplatītāja paralēlais vārds/nosaukums @lv
definition: Sasaista manifestāciju ar nomenu, kas ir izplatītāja vārds/nosaukums citā valodā vai rakstībā. @lv
toolkit label: izplatītāja paralēlais vārds/nosaukums @lv
toolkit definition: Izplatītāja vārds/nosaukums citā valodā vai rakstībā. @lv
alternative label: اسم موازي للموزع @ar
alternative label: parallelt distributørsnavn @da
alternative label: 并列发行者名称 @zh-hans
label: 有发行者的并列名称 @zh-hans
definition: 将一种载体表现与作为另一种语言或文字的发行者名称的命名关联起来。 @zh-hans
toolkit label: 发行者的并列名称 @zh-hans
toolkit definition: 作为另一种语言或文字的发行者名称的命名 @zh-hans
alternative label: nombre de distribuidor paralelo @es
alternative label: terjesztő párhuzamos neve: @hu

has parallel title proper
status: Published
definition: Relates a manifestation to a nomen that is a title proper in another language or script.
type: Property
domain: C10007
sub property of: has title proper
lexical alias: parallelTitleProper.en
instruction number: 2.3.3
toolkit label: parallel title proper
toolkit definition: A nomen that is a title proper in another language or script.
label: a pour titre propre parallèle @fr
definition: Met une manifestation en relation avec un nomen qui est un titre propre dans une autre langue ou écriture. @fr
toolkit label: titre propre parallèle @fr
toolkit definition: Nomen qui est un titre propre dans une autre langue ou écriture. @fr
toolkit label: título paralelo propiamente dicho @es
toolkit definition: Un nomen que es un título propiamente dicho en otra lengua o escritura. @es
label: har parallell huvudtitel @sv
toolkit label: parallell huvudtitel @sv
toolkit label: parallelle hoofdtitel @nl
toolkit definition: Een nomen dat is een hoofdtitel in een andere taal en/of schrift. @nl
label: có nhan đề hợp thức song song @vi
definition: Liên kết biểu thị với nhan đề hợp thức trong ngôn ngữ hoặc hệ thống viết khác. @vi
scope note: Nhan đề lựa chọn trong ngôn ngữ hoặc hệ thống viết khác được xử lý như phần của nhan đề hợp thức song song. @vi
toolkit label: nhan đề hợp thức song song @vi
toolkit definition: Nhan đề hợp thức trong ngôn ngữ hoặc hệ thống viết khác. @vi
scope note: Een alternatieve titel in een andere taal of schrift wordt behandeld als onderdeel van de parallelle titel. @nl
label: har parallel hovedtitel @da
definition: Relaterer en manifestation til en hovedtitel på et andet sprog eller skriftsystem. @da
scope note: En alternativ titel på et andet sprog eller i et andet alfabet behandles som del af en parallel hovedtitel. @da
toolkit label: parallel hovedtitel @da
toolkit definition: Hovedtitel på et andet sprog eller skriftsystem. @da
label: hat Paralleltitel @de
definition: Setzt eine Manifestation in Beziehung zu einem Haupttitel in einer anderen Sprache oder einer anderen Schrift. @de
scope note: Ein Alternativtitel in einer anderen Sprache und/oder Schrift wird als Teil des Paralleltitels behandelt. @de
toolkit label: Paralleltitel @de
toolkit definition: Eine Haupttitel in einer anderen Sprache oder einer anderen Schrift. @de
label: té com a títol propi paral·lel @ca
definition: Relaciona una manifestació amb un nomen que és un títol propi en una altra llengua o escriptura. @ca
scope note: Un títol alternatiu en una altra llengua o escriptura es tracta com a part del títol propi paral·lel. @ca
toolkit label: títol propi paral·lel @ca
toolkit definition: Nomen que és un títol propi en una altra llengua o escriptura. @ca
definition: Liittää manifestaation nomeniin, joka on päänimeke toisella kielellä tai kirjoitusjärjestelmällä. @fi
toolkit label: rinnakkainen päänimeke @fi
toolkit definition: Nomen, joka on päänimeke toisella kielellä tai kirjoitusjärjestelmällä. @fi
toolkit label: parallell hovedtittel @no
toolkit definition: En hovedtittel på et annet språk eller i et annet skriftsystem. @no
label: έχει παράλληλο κύριο τίτλο @el
definition: Συνδέει μια εκδήλωση με έναν κύριο τίτλο σε μια άλλη γλώσσα ή γραφή. @el
scope note: Ένας εναλλακτικός τίτλος σε μια άλλη γλώσσα ή γραφή υποβάλλεται σε διαχείριση ως μέρος ενός κύριου παράλληλου τίτλου. @el
toolkit label: παράλληλος κύριος τίτλος @el
toolkit definition: Ένας κύριος τίτλος σε μια άλλη γλώσσα ή γραφή. @el
scope note: Un titre alternatif dans une autre langue ou écriture est traité comme faisant partie d’un titre propre parallèle. @fr
has element type: 3
label: párhuzamos főcíme a következő: @hu
definition: Hozzákapcsol egy megjelenési formához egy nomenhez, amely egy főcím más nyelven vagy írásrendszerben. @hu
scope note: Egy más nyelvű vagy más írásmódú alternatív címet egy párhuzamos valódi cím részének tekintenek. @hu
toolkit label: párhuzamos főcíme: @hu
toolkit definition: Egy nomen, amely egy főcím más nyelven vagy írásrendszerben @hu
label: rinnakkainen päänimeke @fi
label: har parallell hovedtittel @no
definition: Relaterer en manifestasjon til en hovedtittel på et annet språk eller i et annet skriftsystem. @no
scope note: En alternativ tittel på et annet språk eller i et annet skriftsystem behandles som del av en parallell hovedtittel. @no
label: heeft parallelle hoofdtitel @nl
definition: Relateert een manifestatie aan een nomen dat is een hoofdtitel in een andere taal en/of schrift. @nl
label: له عنوان موزاي @ar
definition: يربط بين تجسيدة وعنوان نفسه في لغة أخرى أو نظام آخر للحروف. @ar
toolkit label: عنوان موزاي @ar
toolkit definition: عنوان نفسه في لغة أخرى أو نظام آخر للحروف. @ar
label: rööppõhipealkiri @et
definition: Seostab kehastuse põhipealkirjaga teises keeles või kirjasüsteemis. @et
toolkit label: rööppõhipealkiri @et
toolkit definition: Põhipealkiri teises keeles või kirjasüsteemis. @et
label: ha come titolo proprio parallelo @it
definition: Correla una manifestazione a un titolo proprio in un'altra lingua e/o scrittura. @it
toolkit label: titolo proprio parallelo @it
toolkit definition: Titolo proprio in un'altra lingua e/o scrittura. @it
label: paralēlais pamatnosaukums @lv
definition: Sasaista manifestāciju ar nomenu, kas ir pamatnosaukums citā valodā vai rakstībā. @lv
toolkit label: paralēlais pamatnosaukums @lv
toolkit definition: Pamatnosaukums citā valodā vai rakstībā. @lv

has part manifestation
status: Published
definition: Relates a manifestation to a manifestation that is a discrete component of another manifestation.
type: Property
domain: C10007
lexical alias: partManifestation.en
toolkit label: part manifestation
toolkit definition: A manifestation that is a discrete component of another manifestation.
label: a pour partie de manifestation @fr
definition: Met une manifestation en relation avec une manifestation qui constitue une composante distincte d’une autre manifestation. @fr
toolkit label: partie de manifestation @fr
toolkit definition: Manifestation qui constitue une composante distincte d’une autre manifestation. @fr
toolkit label: manifestación parcial @es
toolkit definition: Una manifestación que es un componente discreto de otra manifestación. @es
sub property of: has related manifestation of manifestation
instruction number: 24.5
toolkit label: houder van manifestatie @nl
toolkit definition: Een manifestatie die een afzonderlijk onderdeel is van een andere manifestatie. @nl
label: là vỏ chứa của (biểu thị) @vi
definition: Liên kết biểu thị với biểu thị là bộ phận cấu thành tách biệt của biểu thị lớn hơn. @vi
toolkit label: vỏ chứa của (biểu thị) @vi
toolkit definition: Biểu thị là bộ phận cấu thành tách biệt của biểu thị lớn hơn. @vi
label: har delmanifestation @da
definition: Relaterer en manifestation til manifestation, som udgør en adskilt komponent af en større manifestation. @da
toolkit label: delmanifestation @da
toolkit definition: Manifestation, som udgør en adskilt komponent af en større manifestation. @da
definition: Setzt eine Manifestation in Beziehung zu einer Manifestation, die ein eigenständiger Bestandteil einer anderen Manifestation ist. @de
toolkit label: Teil-Manifestation @de
toolkit definition: Eine Manifestation, die ein eigenständiger Bestandteil einer anderen Manifestation ist. @de
label: té com a manifestació de part @ca
definition: Relaciona una manifestació amb una manifestació que és un component discret d’una altra manifestació. @ca
toolkit label: manifestació de part @ca
toolkit definition: Manifestació que és un component discret d’una altra manifestació. @ca
definition: Liittää manifestaation manifestaatioon, joka on toisen manifestaation itsenäinen osa. @fi
toolkit label: manifestaation osa @fi
toolkit definition: Manifestaatio, joka on toisen manifestaation itsenäinen osa. @fi
toolkit label: del av manifestasjon @no
toolkit definition: En manifestasjon som er en avgrenset bestanddel av en annen manifestasjon. @no
label: είναι περιέκτης της (εκδήλωση) @el
definition: Συνδέει μια εκδήλωση με μια εκδήλωση η οποία είναι διακριτό συστατικό μιας μεγαλύτερης εκδήλωσης. @el
toolkit label: περιέκτης της (εκδήλωση) @el
toolkit definition: Μια εκδήλωση η οποία είναι διακριτό συστατικό μιας μεγαλύτερης εκδήλωσης. @el
has element type: 2
label: rész-megjelenési formája a következő: @hu
definition: Hozzákapcsol egy megjelenési formát egy megjelenési formához, amely egy másik megjelenési forma elkülöníthető alkotórésze. @hu
toolkit label: tárolója (megjelenési forma) @hu
toolkit definition: Egy megjelenési forma, amely egy másik megjelenési forma elkülöníthető alkotórésze. @hu
alternative label: container of (manifestation)
alternative label: manifestaatio sisältää @fi
label: manifestaation osa @fi
label: har del av manifestasjon @no
definition: Relaterer en manifestasjon til en manifestasjon som er en avgrenset bestanddel av en annen manifestasjon. @no
alternative label: omfatter manifestasjon @no
alternative label: conteneur de (manifestation) @fr
label: heeft houder van manifestatie @nl
definition: Relateert een manifestatie aan een manifestatie die een afzonderlijk onderdeel is van een andere manifestatie. @nl
label: له جزء من تجسيدة @ar
definition: يربط بين تجسيدة وتجسيدة هي محتوى منفصل من تجسيدة أخرى. @ar
alternative label: يحتوي التجسيدة @ar
toolkit label: جزء من تجسيدة @ar
toolkit definition: تجسيدة هي محتوى منفصل من تجسيدة أخرى. @ar
alternative label: contenidor de (manifestació) @ca
alternative label: container af manifestation @da
label: kehastuse osa @et
definition: Seostab kehastuse kehastusega, mis on teise kehastuse eraldi osa. @et
alternative label: kehastus sisaldab @et
toolkit label: kehastuse osa @et
toolkit definition: Kehastus, mis on teise kehastuse eraldi osa. @et
label: hat Teil-Manifestation @de
alternative label: Enthält (Manifestation) @de
alternative label: tartalmazza a következő (megjelenési forma): @hu
label: ha come parte manifestazione @it
definition: Correla una manifestazione a una manifestazione che è una componente distinta di un'altra manifestazione. @it
toolkit label: parte manifestazione @it
toolkit definition: Manifestazione che è una componente distinta di un'altra manifestazione. @it
label: manifestācijas daļa @lv
definition: Sasaista manifestāciju ar manifestāciju, kas ir atsevišķa lielākas manifestācijas sastāvdaļa. @lv
toolkit label: manifestācijas daļa @lv
toolkit definition: Manifestācija, kas ir atsevišķa lielākas manifestācijas sastāvdaļa. @lv
alternative label: ……的整体（载体表现） @zh-hans
toolkit label: 部分载体表现 @zh-hans

is part of manifestation
status: Published
definition: Relates a manifestation to a manifestation that has another manifestation as a discrete component.
type: Property
domain: C10007
sub property of: has related manifestation of manifestation
lexical alias: partOfManifestation.en
toolkit label: part of manifestation
toolkit definition: A manifestation that has another manifestation as a discrete component.
label: est une partie de manifestation de @fr
definition: Met une manifestation en relation avec une manifestation qui a pour composante distincte une autre manifestation. @fr
toolkit label: partie de manifestation de @fr
toolkit definition: Manifestation qui a pour composante distincte une autre manifestation. @fr
toolkit label: parte de manifestación @es
toolkit definition: Una manifestación que tiene otra manifestación como un componente discreto. @es
instruction number: 24.5
toolkit label: opgenomen in manifestatie @nl
toolkit definition: Een manifestatie die een andere manifestatie als afzonderlijk onderdeel heeft. @nl
label: được chứa trong (biểu thị) @vi
definition: Liên kết biểu thị với biểu thị lớn hơn mà biểu thị là bộ phận cấu thành tách biệt @vi
toolkit label: được chứa trong (biểu thị) @vi
toolkit definition: Biểu thị lớn hơn mà biểu thị là bộ phận cấu thành tách biệt @vi
label: er del af manifestation @da
definition: Relaterer en manifestation til en manifestation, som har en anden manifestation som en adskilt komponent. @da
toolkit label: del af manifestation @da
toolkit definition: Manifestation, som har en anden manifestation som en adskilt komponent. @da
label: ist Teil von (Manifestation) @de
definition: Setzt eine Manifestation in Beziehung zu einer Manifestation, die eine andere Manifestation als eigenständigen Bestandteil enthält. @de
toolkit label: Teil von (Manifestation) @de
toolkit definition: Eine Manifestation, die eine andere Manifestation als eigenständigen Bestandteil enthält. @de
label: és part d’una manifestació @ca
definition: Relaciona una manifestació amb una manifestació que té una altra manifestació com a component discret. @ca
toolkit label: part d’una manifestació @ca
toolkit definition: Manifestació que té una altra manifestació com a component discret. @ca
definition: Liittää manifestaation manifestaatioon, jonka itsenäinenä osana on toinen manifestaatio. @fi
toolkit label: osa manifestaatiota @fi
toolkit definition: Manifestaatio, johon sisältyvä manifestaatio on itsenäinen osa toisesta manifestaatiosta. @fi
toolkit label: del av manifestasjon @no
toolkit definition: En manifestasjon som har en annen manifestasjon som en avgrenset bestanddel. @no
label: περιέχεται σε (εκδήλωση) @el
definition: Συνδέει μια εκδήλωση με μια μεγαλύτερη εκδήλωση στην οποία η εκδήλωση συνιστά διακριτό συστατικό. @el
toolkit label: περιέχεται σε (εκδήλωση) @el
toolkit definition: Μια μεγαλύτερη εκδήλωση στην οποία η εκδήλωση συνιστά διακριτό συστατικό. @el
has element type: 2
label: megjelenési forma része: @hu
definition: Hozzákapcsol egy megjelenési formát egy megjelenési formához, amelynek elkülöníthető alkotóelemként része egy másik megjelenési forma. @hu
toolkit label: része a következő megjelenési formának: @hu
toolkit definition: Egy megjelenési forma, amelynek elkülöníthető alkotóelemként része egy másik megjelenési forma. @hu
alternative label: contained in (manifestation)
alternative label: sisältyy manifestaatioon @fi
label: osa manifestaatiota @fi
label: har del av manifestasjon @no
definition: Relaterer en manifestasjon til en manifestasjon som har en annen manifestasjon som en avgrenset bestanddel. @no
alternative label: omfattes av manifestasjon @no
alternative label: contenu dans (manifestation) @fr
label: is opgenomen in manifestatie @nl
definition: Relateert een manifestatie aan een manifestatie die een andere manifestatie als afzonderlijk onderdeel heeft. @nl
label: هو جزء من تجسيدة @ar
definition: يربط بين تجسيدة وتجسيدة لها تجسيدة أخرى كمكون منفصل. @ar
alternative label: متضمن في تجسيدة @ar
toolkit label: جزء من تجسيدة @ar
toolkit definition: تجسيدة لها تجسيدة أخرى كمكون منفصل. @ar
alternative label: contingut en (manifestació) @ca
alternative label: indeholdt i manifestation @da
label: osa kehastusest @et
definition: Seostab kehastuse kehastusega, mille eraldi osaks on teine kehastus. @et
alternative label: sisaldub kehastuses @et
toolkit label: osa kehastusest @et
toolkit definition: Kehastus, mille eraldi osaks on teine kehastus. @et
alternative label: Enthalten in (Manifestation) @de
alternative label: tartalmazza a következő (megjelenési forma): @hu
label: è parte di manifestazione @it
definition: Correla una manifestazione a una manifestazione che ha come componente distinta un'altra manifestazione. @it
alternative label: contenuta in manifestazione @it
toolkit label: parte di manifestazione @it
toolkit definition: Manifestazione che ha come componente distinta un'altra manifestazione. @it
label: ir daļa manifestācijā @lv
definition: Sasaista manifestāciju ar manifestāciju, kam ir cita manrefestācija kā atsevišķa sastāvdaļa. @lv
toolkit label: daļa manifestācijā @lv
toolkit definition: Manifestācija, kam ir cita manrefestācija kā atsevišķa sastāvdaļa. @lv
toolkit label: 载体表现的部分 @zh-hans

has place of manifestation
status: Published
type: Property
lexical alias: placeOfManifestation.en
definition: Relates a manifestation to a place that is associated with the distribution, printing, duplicating, casting, publication, release, or issuing of a published manifestation, or the inscription, fabrication, construction, or other method of production of an unpublished manifestation.
domain: C10007
toolkit label: place of manifestation
toolkit definition: A place that is associated with the distribution, printing, duplicating, casting, publication, release, or issuing of a published manifestation, or the inscription, fabrication, construction, or other method of production of an unpublished manifestation.
sub property of: has related place of manifestation
has element type: 3
label: manifestaation paikka @fi
definition: Liittää manifestaation paikkaan, jossa julkaistu manifestaatio on kustannettu, julkaistu, ilmestynyt, painettu, monistettu, valettu kirjasintin osalta tai jaettu. Liittää manifestaation paikkaan, jossa julkaisematon manifestaatio on kaiverrettu, valmistettu, koottu tai muuten tuotettu. @fi
toolkit label: manifestaation paikka @fi
toolkit definition: Paikka, jossa julkaistu manifestaatio on kustannettu, julkaistu, ilmestynyt, painettu, monistettu, valattu kirjasintin osalta tai jaettu. Paikka, jossa julkaisematon manifestaatio on kaiverrettu, valmistettu, koottu tai muuten tuotettu. @fi
label: har sted for manifestasjon @no
definition: Relaterer en manifestasjon til et sted som forbindes med distribusjon, trykking, mangfordiggjøring, rollebesetting, publisering, tilgjengeliggjøring, utstedelse etc. for en publisert manifestasjon, eller instripsjon, fabrikasjon, konstruksjon etc. for en upublisert manifestasjon. @no
toolkit label: sted for manifestasjon @no
toolkit definition: Et sted som forbindes med distribusjon, trykking, mangfordiggjøring, rollebesetting, publisering, tilgjengeliggjøring, utstedelse etc. for en publisert manifestasjon, eller instripsjon, fabrikasjon, konstruksjon etc. for en upublisert manifestasjon. @no
label: a pour lieu d’une manifestation @fr
definition: Met une manifestation en relation avec un lieu qui est associé à la diffusion ou à la distribution, à l’impression, à la reproduction, au moulage, à la publication, à la mise à disposition ou à l’édition d’une manifestation publiée, ou à la scription, à la fabrication, à la construction ou à toute autre méthode de production d’une manifestation non publiée. @fr
toolkit label: lieu d’une manifestation @fr
toolkit definition: Lieu qui est associé à la diffusion ou à la distribution, à l’impression, à la reproduction, au moulage, à la publication, à la mise à disposition ou à l’édition d’une manifestation publiée, ou à la scription, à la fabrication, à la construction ou à toute autre méthode de production d’une manifestation non publiée. @fr
label: heeft plaats van manifestatie @nl
definition: Relateert een manifestatie aan een plaats die geassocieerd is met de distributie, het drukken, dupliceren, gieten, uitgeven, uitbrengen of uitvaardigen van een gepubliceerde manifestatie, of het afschrijven, fabriceren, construeren of andere methode van productie van een ongepubliceerde manifestatie. @nl
toolkit label: plaats van manifestatie @nl
toolkit definition: Een plaats die geassocieerd is met de distributie, het drukken, dupliceren, gieten, uitgeven, uitbrengen of uitvaardigen van een gepubliceerde manifestatie, of het afschrijven, fabriceren, construeren of andere methode van productie van een ongepubliceerde manifestatie. @nl
label: له مكان تجسيدة @ar
definition: يربط بين تجسيدة ومكان مرتبط بالتوزيع، أو الطباعة، أو إعادة الطباعة، أو الصب، أو النشر أو الإصدار، إلخ. لتجسيدة منشورة، أو التدوين أو التصنيع أو الإنشاء، إلخ. لتجسيدة غير منشورة. @ar
toolkit label: مكان تجسيدة @ar
toolkit definition: مكان مرتبط بالتوزيع، أو الطباعة، أو إعادة الطباعة، أو الصب، أو النشر أو الإصدار، إلخ. لتجسيدة منشورة، أو التدوين أو التصنيع أو الإنشاء، إلخ. لتجسيدة غير منشورة. @ar
label: té com a lloc d’una manifestació @ca
definition: Relaciona una manifestació amb un lloc que s’associa amb la distribució, la impressió, la reproducció, el modelat, la publicació, la posada en circulació o l’emissió d’una manifestació publicada o la inscripció, la fabricació, la construcció o un altre mètode de producció d’una manifestació no publicada. @ca
toolkit label: lloc d’una manifestació @ca
toolkit definition: Lloc que s’associa amb la distribució, la impressió, la reproducció, el modelat, la publicació, la posada en circulació o l’emissió d’una manifestació publicada o la inscripció, la fabricació, la construcció o un altre mètode de producció d’una manifestació no publicada. @ca
label: har sted for manifestation @da
definition: Relaterer en manifestation til et sted forbundet med distribution, trykning, duplikering, støbning, publicering, frigivelse, udgivelse etc. af en publiceret manifestation eller indskrift, fremstilling, konstruktion, ect. af en upubliceret manifestation. @da
toolkit label: sted for manifestation @da
toolkit definition: Sted forbundet med distribution, trykning, duplikering, støbning, publicering, frigivelse, udgivelse etc. af en publiceret manifestation eller indskrift, fremstilling, konstruktion, ect. af en upubliceret manifestation. @da
label: kehastuse koht @et
definition: Seostab kehastuse kohaga, mis on seotud avaldatud kehastuse levitamisega, trükkimisega, paljundamisega, valamisega, avaldamisega, väljalaskmisega, väljaandmisega vms, või avaldamata kehastuse inskribeerimisega, tootmisega, ehitamisega vms. @et
toolkit label: kehastuse koht @et
toolkit definition: Koht, mis on seotud avaldatud kehastuse levitamisega, trükkimisega, paljundamisega, valamisega, avaldamisega, väljalaskmisega, väljaandmisega vms, või avaldamata kehastuse inskribeerimisega, tootmisega, ehitamisega vms. @et
label: hat Geografikum einer Manifestation @de
definition: Setzt eine Manifestation in Beziehung zu einem Geografikum, das mit dem Vertrieb, dem Druck, der Vervielfältigung, dem Guss, der Veröffentlichung, dem Release oder der Herausgabe einer veröffentlichten Manifestation oder mit der Beschriftung, der Fabrikation, der Konstruktion oder einer anderen Entstehungsmethode einer unveröffentlichten Manifestation in Verbindung steht. @de
toolkit label: Geografikum einer Manifestation @de
toolkit definition: Ein Geografikum, das mit dem Vertrieb, dem Druck, der Vervielfältigung, dem Guss der Veröffentlichung, dem Release oder der Herausgabe einer veröffentlichten Manifestation oder mit der Beschriftung, der Fabrikation, der Konstruktion oder einer anderen Entstehungsmethode einer unveröffentlichten Manifestation in Verbindung steht. @de
label: megjelenési forma helye a következő: @hu
definition: Hozzákapcsol egy megjelenési formát egy helyhez, amely egy kiadott megjelenési forma terjesztéséhez, nyomtatásához, sokszorosításához, öntéséhez, kiadásához, kibocsájtásához, megjelentetéséhez stb., vagy egy kiadatlan megjelenési forma írásához, összeállításához, készítéséhez stb. kapcsolódik. @hu
toolkit label: megjelenési forma helye @hu
toolkit definition: Egy hely, amely összefügg a közzétett megjelenési forma terjesztésével, nyomtatásával, sokszorosításával, öntésével, közzétételével, megjelenésével, kiadásával stb., vagy a közzé nem tett megjelenési forma bejegyzésével, gyártásával, megépítésével. @hu
label: ha come luogo della manifestazione @it
definition: Correla una manifestazione a un luogo associato alla distribuzione, stampa, duplicazione, fusione, pubblicazione, diffusione o emissione, etc. di una manifestazione pubblicata, o all'iscrizione, fabbricazione, costruzione, etc., di una manifestazione non pubblicata. @it
toolkit label: luogo della manifestazione @it
toolkit definition: Luogo associato alla distribuzione, stampa, duplicazione, fusione, pubblicazione, diffusione o emissione, etc. di una manifestazione pubblicata, o all'iscrizione, fabbricazione, costruzione, etc., di una manifestazione non pubblicata. @it
label: manifestācijas vieta @lv
definition: Sasaista manifestāciju ar vietu, kas saistīta ar publicētas manifestācijas izplatīšanu, iespiešanu, pavairošanu, iesiešanu, publicēšanu, izlaišanu vai izdošanu u.tml. vai nepublicētas manifestācijas uzrakstīšanu, izgatavošanu, radīšanu u.tml. @lv
toolkit label: manifestācijas vieta @lv
toolkit definition: Vieta, kas saistīta ar publicētas manifestācijas izplatīšanu, iespiešanu, pavairošanu, iesiešanu, publicēšanu, izlaišanu vai izdošanu u.tml. vai nepublicētas manifestācijas uzrakstīšanu, izgatavošanu, radīšanu u.tml. @lv
label: 有载体表现的地点 @zh-hans
definition: 将一种载体表现与和一种出版载体表现的经销、印刷、复制、铸造、出版、发布或发行有关的一个地点、或者和一种非出版载体表现的镌刻、制造、构造或其他方式制作有关的一个地点关联起来。 @zh-hans
toolkit label: 载体表现的地点 @zh-hans
toolkit definition: 和一种出版载体表现的经销、印刷、复制、铸造、出版、发布或发行有关的一个地点、或者和一种非出版载体表现的镌刻、制造、构造或其他方式制作有关的一个地点 @zh-hans
label: gösterim yeri ile ilişkilidir @tr
definition: Bir gösterimi, yayınlanmış bir gösterimin dağıtımı, basımı, çoğaltılması, dökümü, yayınlanması, serbest bırakılması veya yayınlanması veya yayınlanmamış bir gösterimin kaydedilmesi, fabrikasyonu, inşası veya diğer üretim yöntemleri ile ilişkili bir yerle ilişkilendirir. @tr
toolkit label: gösterim yeri @tr
toolkit definition: Yayınlanmış bir gösterimin dağıtımı, basımı, çoğaltılması, dökümü, yayınlanması, piyasaya sürülmesi veya piyasaya çıkarılmasıyla veya yayınlanmamış bir gösterimin yazısı, fabrikasyonu, yapımı veya diğer üretim yöntemleriyle bağlantılı olan bir yer. @tr
label: tiene lugar de manifestación @es
definition: Relaciona una manifestación con un lugar asociado con la distribución, impresión, duplicación, fundición, publicación, lanzamiento o emisión de una manifestación publicada, o la inscripción, fabricación, construcción u otro método de producción de una manifestación no publicada. @es
toolkit label: lugar de manifestación @es
toolkit definition: Un lugar asociado con la distribución, impresión, duplicación, fundición, publicación, lanzamiento o emisión de una manifestación publicada, o la inscripción, fabricación, construcción u otro método de producción de una manifestación no publicada. @es
has subproperty: has place of manufacture
has subproperty: has place of production
has subproperty: has place of publication
has subproperty: has place of distribution
has subproperty: P30279

has platemaker agent
status: Published
definition: Relates a manifestation to an agent who is responsible for preparing plates used in the making of printed images or text in a manifestation.
type: Property
domain: C10007
lexical alias: platemakerAgent.en
toolkit label: platemaker agent
toolkit definition: An agent who is responsible for preparing plates used in the making of printed images or text in a manifestation.
label: a pour agent clicheur @fr
definition: Met une manifestation en relation avec un agent qui est responsable de la préparation des planches utilisées dans la réalisation d’images ou de textes imprimés dans une manifestation. @fr
toolkit label: agent clicheur @fr
toolkit definition: Agent qui est responsable de la préparation des planches utilisées pour la réalisation d’images ou de textes imprimés dans une manifestation. @fr
toolkit label: agente fabricante de placas @es
toolkit definition: Un agente que se encarga de preparar las placas utilizadas en la realización de imágenes impresas o texto en una manifestación. @es
instruction number: 18.5
toolkit label: plaatmaker-actor @nl
toolkit definition: Een actor die verantwoordelijk is voor het prepareren van platen gebruikt in het maken van gedrukte beelden of tekst in een manifestatie. @nl
label: có người tạo khuôn in @vi
definition: Liên kết biểu thị với tác nhân có liên quan tới chế tạo biểu thị theo trách nhiệm chuẩn bị khuôn in dùng trong sản xuất hình ảnh hoặc văn bản in. @vi
toolkit label: người tạo khuôn in @vi
toolkit definition: Tác nhân có liên quan tới chế tạo biểu thị theo trách nhiệm chuẩn bị khuôn in dùng trong sản xuất hình ảnh hoặc văn bản in. @vi
label: har agent, som er plademager @da
definition: Relaterer en manifestation til en agent, som er involveret i fremstillingen af en manifestation ved at forberede plader, som anvendes til fremstilling af trykte billeder eller tekst. @da
toolkit label: agent, som er plademager @da
toolkit definition: Agent, som er involveret i fremstillingen af en manifestation ved at forberede plader, som anvendes til fremstilling af trykte billeder eller tekst. @da
label: hat Druckformherstellerin/Druckformhersteller (Akteur) @de
definition: Setzt eine Manifestation in Beziehung zu einem Akteur, der für die Herstellung einer Manifestation verantwortlich ist, indem er Druckformen für die Produktion von gedruckten Bildern oder gedrucktem Text anfertigt. @de
toolkit label: Druckformherstellerin/Druckformhersteller (Akteur) @de
toolkit definition: Ein Akteur, der für die Herstellung einer Manifestation verantwortlich ist, indem er Druckformen für die Produktion von gedruckten Bildern oder gedrucktem Text anfertigt. @de
label: té com a agent gravador de planxes @ca
definition: Relaciona una manifestació amb un agent que és responsable de la preparació de les planxes usades en l’elaboració d’imatges impreses o text imprès en una manifestació. @ca
toolkit label: agent gravador de planxes @ca
toolkit definition: Agent que és responsable de la preparació de les planxes usades en l’elaboració d’imatges impreses o text imprès en una manifestació. @ca
definition: Liittää manifestaation toimijaan, joka on vastuussa manifestaation valmistamisesta valmistamalla painettujen kuvien tai tekstin valmistuksessa käytettäviä painolaattoja tai -levyjä. @fi
toolkit label: painolaatan valmistaja (toimija) @fi
toolkit definition: Toimija, joka on vastuussa manifestaation valmistamisesta valmistamalla painettujen kuvien tai tekstin valmistuksessa käytettäviä painolaattoja tai -levyjä. @fi
toolkit label: trykkplatemaker (agent) @no
toolkit definition: En agent som er involvert i framstillingen av en manifestasjon ved å klargjøre trykkplater som brukes ved produksjon av trykte bilder og/eller tekst. @no
label: έχει κατασκευαστή της εκτυπωτικής πλάκας @el
definition: Συνδέει μια εκδήλωση με έναν φορέα που εμπλέκεται στην κατασκευή μιας εκδήλωσης μέσω της προετοιμασίας των πλακών που χρησιμοποιούνται για την παραγωγή έντυπων εικόνων ή κειμένου. @el
toolkit label: κατασκευαστήςΕκτυπωτικήςΠλάκας @el
toolkit definition: Ένας φορέας που εμπλέκεται στην κατασκευή μιας εκδήλωσης μέσω της προετοιμασίας των πλακών που χρησιμοποιούνται για την παραγωγή έντυπων εικόνων ή κειμένου. @el
has element type: 2
label: nyomólemez-készítő ágense a következő: @hu
definition: Hozzákapcsol egy megjelenési formát egy ágenshez, amely felelős egy megjelenési forma gyártásáért oly módon, hogy nyomtatott képek vagy szövegek előállításánál használt lemezeket készít elő. @hu
toolkit label: nyomólemez-készítő ágens: @hu
toolkit definition: Egy ágens, amely felelős egy megjelenési forma gyártásáért oly módon, hogy nyomtatott képek vagy szövegek előállításánál használt lemezeket készít elő. @hu
alternative label: platemaker
alternative label: painolaatan valmistaja @fi
label: painolaatan valmistaja (toimija) @fi
label: har trykkplatemaker (agent) @no
definition: Relaterer en manifestasjon til en agent som er involvert i framstillingen av en manifestasjon ved å klargjøre trykkplater som brukes ved produksjon av trykte bilder og/eller tekst. @no
alternative label: trykkplatemaker @no
alternative label: graveur de planches @fr
label: heeft plaatmaker-actor @nl
definition: Relateert een manifestatie aan een actor die verantwoordelijk is voor het prepareren van platen gebruikt in het maken van gedrukte beelden of tekst in een manifestatie. @nl
label: له وكيل مصمم لوحات @ar
definition: يربط بين تجسيدة ووكيل مسئول عن تصنيع تجسيدة بإعداد اللوحات المستخدمة في إنتاج الصور المطبوعة أو النص. @ar
alternative label: مصمم لوحات @ar
toolkit label: وكيل مصمم لوحات @ar
toolkit definition: وكيل مسئول عن تصنيع تجسيدة بإعداد اللوحات المستخدمة في إنتاج الصور المطبوعة أو النص. @ar
alternative label: gravador de planxes @ca
alternative label: plademager @da
label: trükiplaadi valmistaja (tegija) @et
definition: Seostab kehastuse tegijaga, kes osaleb kehastuse valmistamises, valmistades ette plaadid piltide või teksti trükkimiseks. @et
alternative label: trükiplaadi valmistaja @et
toolkit label: trükiplaadi valmistaja (tegija) @et
toolkit definition: Tegija, kes osaleb kehastuse valmistamises, valmistades ette plaadid piltide või teksti trükkimiseks. @et
alternative label: nyomólemez-készítő: @hu
label: ha come preparatore di lastre agente @it
definition: Correla una manifestazione all'agente coinvolto nella manifattura di una manifestazione tramite la preparazione di lastre utilizzate per la produzione di immagini o testo stampati. @it
alternative label: preparatore di lastre @it
toolkit label: preparatore di lastre agente @it
toolkit definition: Agente coinvolto nella manifattura di una manifestazione tramite la preparazione di lastre utilizzate per la produzione di immagini o testo stampati. @it
label: presformas izgatavotājs (aģents) @lv
definition: Sasaista manifestāciju ar aģentu, kas iesaistīts manifestācijas ražošanā, sagatavojot plāksnes, ko izmanto iespiestu attēlu vai teksta izgatavošanā. @lv
toolkit label: presformas izgatavotājs (aģents) @lv
toolkit definition: Aģents, kas iesaistīts manifestācijas ražošanā, sagatavojot plāksnes, ko izmanto iespiestu attēlu vai teksta izgatavošanā. @lv
sub property of: has creator agent of manifestation
alternative label: Druckformhersteller @de
toolkit label: 制版者行为者 @zh-hans

has platemaker collective agent
status: Published
lexical alias: platemakerCollectiveAgent.en
definition: Relates a manifestation to a collective agent who is responsible for preparing plates used in the making of printed images or text in a manifestation.
toolkit label: platemaker collective agent
toolkit definition: A collective agent who is responsible for preparing plates used in the making of printed images or text in a manifestation.
type: Property
domain: C10007
has element type: 2
sub property of: has platemaker agent
label: painolaatan valmistaja (yhteistoimija) @fi
definition: Liittää manifestaation yhteistoimijaan, joka on vastuussa manifestaation valmistamisesta valmistamalla painettujen kuvien tai tekstin valmistuksessa käytettäviä painolaattoja tai -levyjä. @fi
toolkit label: painolaatan valmistaja (yhteistoimija) @fi
toolkit definition: Yhteistoimija, joka on vastuussa manifestaation valmistamisesta valmistamalla painettujen kuvien tai tekstin valmistuksessa käytettäviä painolaattoja tai -levyjä. @fi
label: har trykkplatemaker (kollektiv agent) @no
definition: Relaterer en manifestasjon til en kollektiv agent som er involvert i framstillingen av en manifestasjon ved å klargjøre trykkplater som brukes ved produksjon av trykte bilder og/eller tekst. @no
toolkit label: trykkplatemaker (kollektiv agent) @no
toolkit definition: En kollektiv agent som er involvert i framstillingen av en manifestasjon ved å klargjøre trykkplater som brukes ved produksjon av trykte bilder og/eller tekst. @no
label: a pour agent collectif clicheur @fr
definition: Met une manifestation en relation avec un agent collectif qui est responsable de la préparation des planches utilisées dans la réalisation d’images ou de textes imprimés dans une manifestation. @fr
toolkit label: agent collectif clicheur @fr
toolkit definition: Agent collectif qui est responsable de la préparation des planches utilisées pour la réalisation d’images ou de textes imprimés dans une manifestation. @fr
label: heeft plaatmaker-collectieve actor @nl
definition: Relateert een manifestatie aan een collectieve actor die verantwoordelijk is voor het prepareren van platen gebruikt in het maken van gedrukte beelden of tekst in een manifestatie. @nl
toolkit label: plaatmaker-collectieve actor @nl
toolkit definition: Een collectieve actor die verantwoordelijk is voor het prepareren van platen gebruikt in het maken van gedrukte beelden of tekst in een manifestatie. @nl
label: له وكيل جماعي مصمم لوحات @ar
definition: يربط بين تجسيدة ووكيل جماعي مسئول عن تصنيع تجسيدة بإعداد اللوحات المستخدمة في إنتاج الصور المطبوعة أو النص. @ar
toolkit label: وكيل جماعي مصمم لوحات @ar
toolkit definition: وكيل جماعي مسئول عن تصنيع تجسيدة بإعداد اللوحات المستخدمة في إنتاج الصور المطبوعة أو النص. @ar
label: té com a agent col·lectiu gravador de planxes @ca
definition: Relaciona una manifestació amb un agent col·lectiu que és responsable de la preparació de les planxes usades en l’elaboració d’imatges impreses o de text imprès. @ca
toolkit label: agent col·lectiu gravador de planxes @ca
toolkit definition: Agent col·lectiu que és responsable de la preparació de les planxes usades en l’elaboració d’imatges impreseso de text imprès. @ca
label: har kollektiv agent, som er plademager @da
definition: Relaterer en manifestation til en kollektiv agent, som er involveret i fremstillingen af en manifestation ved at forberede plader, som anvendes til fremstilling af trykte billeder eller tekst. @da
toolkit label: kollektiv agent, som er plademager @da
toolkit definition: Kollektiv agent, som er involveret i fremstillingen af en manifestation ved at forberede plader, som anvendes til fremstilling af trykte billeder eller tekst. @da
label: trükiplaadi valmistaja (kollektiiv) @et
definition: Seostab kehastuse kollektiiviga, kes osaleb kehastuse valmistamises, valmistades ette plaadid piltide või teksti trükkimiseks. @et
toolkit label: trükiplaadi valmistaja (kollektiiv) @et
toolkit definition: Kollektiiv, kes osaleb kehastuse valmistamises, valmistades ette plaadid piltide või teksti trükkimiseks. @et
label: hat Druckformherstellerin/Druckformhersteller (Gemeinschaftlicher Akteur) @de
definition: Setzt eine Manifestation in Beziehung zu einem gemeinschaftlichen Akteur, der für die Herstellung einer Manifestation verantwortlich ist, indem er Druckformen für die Produktion von gedruckten Bildern oder gedrucktem Text anfertigt. @de
toolkit label: Druckformherstellerin/Druckformhersteller (Gemeinschaftlicher Akteur) @de
toolkit definition: Ein gemeinschaftlicher Akteur, der für die Herstellung einer Manifestation verantwortlich ist, indem er Druckformen für die Produktion von gedruckten Bildern oder gedrucktem Text anfertigt. @de
label: nyomólemez-készítő kollektív ágense a következő: @hu
definition: Hozzákapcsol egy megjelenési formát egy kollektív ágenshez, amely felelős egy megjelenési forma gyártásáért oly módon, hogy nyomtatott képek vagy szövegek előállításánál használt lemezeket készít elő. @hu
toolkit label: nyomólemez-készítő kollektív ágens: @hu
toolkit definition: Egy kollektív ágens, amely felelős egy megjelenési forma gyártásáért oly módon, hogy nyomtatott képek vagy szövegek előállításánál használt lemezeket készít elő. @hu
label: ha come preparatore di lastre agente collettivo @it
definition: Correla una manifestazione all'agente collettivo coinvolto nella manifattura di una manifestazione, tramite la preparazione di lastre utilizzate nella produzione di immagini o testo stampati. @it
toolkit label: preparatore di lastre agente collettivo @it
toolkit definition: Agente collettivo coinvolto nella manifattura di una manifestazione, tramite la preparazione di lastre utilizzate nella produzione di immagini o testi stampati. @it
label: presformas izgatavotājs (grupa) @lv
definition: Sasaista manifestāciju ar grupu, kas iesaistīta manifestācijas ražošanā, sagatavojot plāksnes, ko izmanto iespiestu attēlu vai teksta izgatavošanā. @lv
toolkit label: presformas izgatavotājs (grupa) @lv
toolkit definition: Grupa, kas iesaistīta manifestācijas ražošanā, sagatavojot plāksnes, ko izmanto iespiestu attēlu vai teksta izgatavošanā. @lv
sub property of: has creator collective agent of manifestation
label: 有制版者集体行为者 @zh-hans
definition: 将一种载体表现与负责准备用于在一种载体表现中制作印刷图像或文字的印版的一个集体行为者关联起来。 @zh-hans
toolkit label: 制版者集体行为者 @zh-hans
toolkit definition: 负责准备用于在一种载体表现中制作印刷图像或文字的印版的一个集体行为者 @zh-hans
label: levhacı kolektif temsilcisi ile ilişkilidir @tr
definition: Bir gösterimi, bir gösterimdeki basılı görüntülerin veya metnin yapımında kullanılan plakaları hazırlamaktan sorumlu olan kolektif bir temsilciyle ilişkilendirir. @tr
toolkit label: plaka yapıcı kolektif temsilci @tr
toolkit definition: Bir gösterimdeki basılı görüntülerin veya metnin yapımında kullanılan plakaları hazırlamaktan sorumlu kolektif bir temsilci. @tr
label: tiene agente colectivo fabricante de placas @es
definition: Relaciona una manifestación con un agente colectivo que es responsable de preparar las placas utilizadas en la realización de imágenes impresas o texto en una manifestación. @es
toolkit label: agente colectivo fabricante de placas @es
toolkit definition: Un agente colectivo que es responsable de preparar las placas utilizadas en la realización de imágenes impresas o texto en una manifestación. @es
has subproperty: has collotyper collective agent
has subproperty: has platemaker corporate body
has subproperty: has platemaker family
has subproperty: P30384

has platemaker corporate body
status: Published
lexical alias: platemakerCorporateBody.en
definition: Relates a manifestation to a corporate body who is responsible for preparing plates used in the making of printed images or text in a manifestation.
toolkit label: platemaker corporate body
toolkit definition: A corporate body who is responsible for preparing plates used in the making of printed images or text in a manifestation.
type: Property
domain: C10007
has element type: 2
sub property of: has platemaker collective agent
label: painolaatan valmistaja (yhteisö) @fi
definition: Liittää manifestaation yhteisöön, joka on vastuussa manifestaation valmistamisesta valmistamalla painettujen kuvien tai tekstin valmistuksessa käytettäviä painolaattoja tai -levyjä. @fi
toolkit label: painolaatan valmistaja (yhteisö) @fi
toolkit definition: Yhteisö, joka on vastuussa manifestaation valmistamisesta valmistamalla painettujen kuvien tai tekstin valmistuksessa käytettäviä painolaattoja tai -levyjä. @fi
label: har trykkplatemaker (korporasjon) @no
definition: Relaterer en manifestasjon til en korporasjon som er involvert i framstillingen av en manifestasjon ved å klargjøre trykkplater som brukes ved produksjon av trykte bilder og/eller tekst. @no
toolkit label: trykkplatemaker (korporasjon) @no
toolkit definition: En korporasjon som er involvert i framstillingen av en manifestasjon ved å klargjøre trykkplater som brukes ved produksjon av trykte bilder og/eller tekst. @no
label: a pour collectivité clicheuse @fr
definition: Met une manifestation en relation avec une collectivité qui est responsable de la préparation des planches utilisées dans la réalisation d’images ou de textes imprimés dans une manifestation. @fr
toolkit label: collectivité clicheuse @fr
toolkit definition: Collectivité qui est responsable de la préparation des planches utilisées pour la réalisation d’images ou de textes imprimés dans une manifestation. @fr
label: heeft plaatmaker-corporatie @nl
definition: Relateert een manifestatie aan een corporatie die verantwoordelijk is voor het prepareren van platen gebruikt in het maken van gedrukte beelden of tekst in een manifestatie. @nl
toolkit label: plaatmaker-corporatie @nl
toolkit definition: Een corporatie die verantwoordelijk is voor het prepareren van platen gebruikt in het maken van gedrukte beelden of tekst in een manifestatie. @nl
label: له هيئة مصممة لوحات @ar
definition: يربط بين تجسيدة وهيئة مسئولة عن تصنيع تجسيدة بإعداد اللوحات المستخدمة في إنتاج الصور المطبوعة أو النص. @ar
toolkit label: هيئة مصممة لوحات @ar
toolkit definition: هيئة مسئولة عن تصنيع تجسيدة بإعداد اللوحات المستخدمة في إنتاج الصور المطبوعة أو النص. @ar
label: té com a entitat corporativa gravadora de planxes @ca
definition: Relaciona una manifestació amb una entitat corporativa que és responsable de la preparació de les planxes usades en la producció d’imatges impreses o de text imprès. @ca
toolkit label: entitat corporativa gravadora de planxes @ca
toolkit definition: Entitat corporativa que és responsable de la preparació de les planxes usades en la producció d’imatges impreses o de text imprès. @ca
label: har korporation, som er plademager @da
definition: Relaterer en manifestation til en korporation, som er involveret i fremstillingen af en manifestation ved at forberede plader, som anvendes til fremstilling af trykte billeder eller tekst. @da
toolkit label: korporation, som er plademager @da
toolkit definition: Korporation, som er involveret i fremstillingen af en manifestation ved at forberede plader, som anvendes til fremstilling af trykte billeder eller tekst. @da
label: trükiplaadi valmistaja (asutus) @et
definition: Seostab kehastuse asutusega, kes osaleb kehastuse valmistamises, valmistades ette plaadid piltide või teksti trükkimiseks. @et
toolkit label: trükiplaadi valmistaja (asutus) @et
toolkit definition: Asutus, kes osaleb kehastuse valmistamises, valmistades ette plaadid piltide või teksti trükkimiseks. @et
label: hat Druckformherstellerin/Druckformhersteller (Körperschaft) @de
definition: Setzt eine Manifestation in Beziehung zu einer Körperschaft, die für die Herstellung einer Manifestation verantwortlich ist, indem sie Druckformen für die Produktion von gedruckten Bildern oder gedrucktem Text anfertigt. @de
toolkit label: Druckformherstellerin/Druckformhersteller (Körperschaft) @de
toolkit definition: Eine Körperschaft, die für die Herstellung einer Manifestation verantwortlich ist, indem sie Druckformen für die Produktion von gedruckten Bildern oder gedrucktem Text anfertigt. @de
label: nyomólemez-készítő testülete a következő: @hu
definition: Hozzákapcsol egy megjelenési formát egy testülethez, amely felelős egy megjelenési forma gyártásáért oly módon, hogy nyomtatott képek vagy szövegek előállításánál használt lemezeket készít elő. @hu
toolkit label: nyomólemez-készítő testület: @hu
toolkit definition: Egy testület, amely felelős egy megjelenési forma gyártásáért oly módon, hogy nyomtatott képek vagy szövegek előállításánál használt lemezeket készít elő. @hu
label: ha come preparatore di lastre ente @it
definition: Correla una manifestazione all'ente coinvolto nella manifattura di una manifestazione, preparando lastre utilizzate nella produzione di immagini o testo stampati. @it
toolkit label: preparatore di lastre ente @it
toolkit definition: Ente coinvolto nella manifattura di una manifestazione, preparando lastre utilizzate nella produzione di immagini o testi stampati. @it
label: presformas izgatavotājs (institūcija) @lv
definition: Sasaista manifestāciju ar institūciju, kas iesaistīta manifestācijas ražošanā, sagatavojot plāksnes, ko izmanto iespiestu attēlu vai teksta izgatavošanā. @lv
toolkit label: presformas izgatavotājs (institūcija) @lv
toolkit definition: Institūcija, kas iesaistīta manifestācijas ražošanā, sagatavojot plāksnes, ko izmanto iespiestu attēlu vai teksta izgatavošanā. @lv
sub property of: has creator corporate body of manifestation
label: 有制版者团体 @zh-hans
definition: 将一种载体表现与负责准备用于在一种载体表现中制作印刷图像或文字的印版的一个团体关联起来。 @zh-hans
toolkit label: 制版者团体 @zh-hans
toolkit definition: 负责准备用于在一种载体表现中制作印刷图像或文字的印版的一个团体 @zh-hans
label: levhacı tüzel kişisi ile ilişkilidir @tr
definition: Bir gösterimi, bir gösterimdeki basılı görüntülerin veya metnin yapımında kullanılan plakaları hazırlamaktan sorumlu olan bir tüzel kişiyle ilişkilendirir. @tr
toolkit label: plaka yapıcı tüzel kişi @tr
toolkit definition: Basılı görüntülerin veya bir gösterimin metninin yapımında kullanılan plakaları hazırlamaktan sorumlu olan bir tüzel kişi. @tr
label: tiene cuerpo corporativo fabricante de placas @es
definition: Relaciona una manifestación con un cuerpo corporativo que es responsable de preparar las placas utilizadas en la realización de imágenes impresas o texto en una manifestación. @es
toolkit label: cuerpo corporativo fabricante de placas @es
toolkit definition: Un cuerpo corporativo que es responsable de preparar las placas utilizadas en la realización de imágenes impresas o texto en una manifestación. @es
has subproperty: has collotyper corporate body
has subproperty: P30413

has platemaker family
status: Published
lexical alias: platemakerFamily.en
definition: Relates a manifestation to a family who is responsible for preparing plates used in the making of printed images or text in a manifestation.
toolkit label: platemaker family
toolkit definition: A family who is responsible for preparing plates used in the making of printed images or text in a manifestation.
type: Property
domain: C10007
has element type: 2
sub property of: has platemaker collective agent
label: painolaatan valmistaja (suku) @fi
definition: Liittää manifestaation sukuun, joka on vastuussa manifestaation valmistamisesta valmistamalla painettujen kuvien tai tekstin valmistuksessa käytettäviä painolaattoja tai -levyjä. @fi
toolkit label: painolaatan valmistaja (suku) @fi
toolkit definition: Suku, joka on vastuussa manifestaation valmistamisesta valmistamalla painettujen kuvien tai tekstin valmistuksessa käytettäviä painolaattoja tai -levyjä. @fi
label: har trykkplatemaker (familie) @no
definition: Relaterer en manifestasjon til en familie som er involvert i framstillingen av en manifestasjon ved å klargjøre trykkplater som brukes ved produksjon av trykte bilder og/eller tekst. @no
toolkit label: trykkplatemaker (familie) @no
toolkit definition: En familie som er involvert i framstillingen av en manifestasjon ved å klargjøre trykkplater som brukes ved produksjon av trykte bilder og/eller tekst. @no
label: a pour famille clicheuse @fr
definition: Met une manifestation en relation avec une famille qui est responsable de la préparation des planches utilisées dans la réalisation d’images ou de textes imprimés dans une manifestation. @fr
toolkit label: famille clicheuse @fr
toolkit definition: Famille qui est responsable de la préparation des planches utilisées pour la réalisation d’images ou de textes imprimés dans une manifestation. @fr
label: heeft plaatmaker-familie @nl
definition: Relateert een manifestatie aan een familie die verantwoordelijk is voor het prepareren van platen gebruikt in het maken van gedrukte beelden of tekst in een manifestatie. @nl
toolkit label: plaatmaker-familie @nl
toolkit definition: Een familie die verantwoordelijk is voor het prepareren van platen gebruikt in het maken van gedrukte beelden of tekst in een manifestatie. @nl
label: له عائلة مصممة لوحات @ar
definition: يربط بين تجسيدة وعائلة مسئولة عن تصنيع تجسيدة بإعداد اللوحات المستخدمة في إنتاج الصور المطبوعة أو النص. @ar
toolkit label: عائلة مصممة لوحات @ar
toolkit definition: عائلة مسئولة عن تصنيع تجسيدة بإعداد اللوحات المستخدمة في إنتاج الصور المطبوعة أو النص. @ar
label: té com a família gravadora de planxes @ca
definition: Relaciona una manifestació amb una família que és responsable de la preparació de les planxes usades en l’elaboració d’imatges o de text imprès. @ca
toolkit label: família gravadora de planxes @ca
toolkit definition: Família que és responsable de la creació d’una manifestació amb la preparació de les planxes usades en l’elaboració d’imatges o de text imprès. @ca
label: har familie, som er plademager @da
definition: Relaterer en manifestation til en familie, som er involveret i fremstillingen af en manifestation ved at forberede plader, som anvendes til fremstilling af trykte billeder eller tekst. @da
toolkit label: familie, som er plademager @da
toolkit definition: Familie, som er involveret i fremstillingen af en manifestation ved at forberede plader, som anvendes til fremstilling af trykte billeder eller tekst. @da
label: trükiplaadi valmistaja (perekond) @et
definition: Seostab kehastuse perekonnaga, kes osaleb kehastuse valmistamises, valmistades ette plaadid piltide või teksti trükkimiseks. @et
toolkit label: trükiplaadi valmistaja (perekond) @et
toolkit definition: Perekond, kes osaleb kehastuse valmistamises, valmistades ette plaadid piltide või teksti trükkimiseks. @et
label: hat Druckformherstellerin/Druckformhersteller (Familie) @de
definition: Setzt eine Manifestation in Beziehung zu einer Familie, die für die Herstellung einer Manifestation verantwortlich ist, indem sie Druckformen für die Produktion von gedruckten Bildern oder gedrucktem Text anfertigt. @de
toolkit label: Druckformherstellerin/Druckformhersteller (Familie) @de
toolkit definition: Eine Familie, die für die Herstellung einer Manifestation verantwortlich ist, indem sie Druckformen für die Produktion von gedruckten Bildern oder gedrucktem Text anfertigt. @de
label: nyomólemez-készítő családja a következő: @hu
definition: Hozzákapcsol egy megjelenési formát egy családhoz, amely egy felelős megjelenési forma gyártásáért oly módon, hogy nyomtatott képek vagy szövegek előállításánál használt lemezeket készít elő. @hu
toolkit label: nyomólemez-készítő család: @hu
toolkit definition: Egy család, amely felelős egy megjelenési forma gyártásáért oly módon, hogy nyomtatott képek vagy szövegek előállításánál használt lemezeket készít elő. @hu
label: ha come preparatore di lastre famiglia @it
definition: Correla una manifestazione alla famiglia coinvolta nella manifattura di una manifestazione, preparando lastre utilizzate nella produzione di immagini o testo stampati. @it
toolkit label: preparatore di lastre famiglia @it
toolkit definition: Famiglia coinvolta nella manifattura di una manifestazione, preparando lastre utilizzate nella produzione di immagini o testi stampati. @it
label: presformas izgatavotājs (dzimta/ģimene) @lv
definition: Sasaista manifestāciju ar dzimtu/ģimeni, kas iesaistīta manifestācijas ražošanā, sagatavojot plāksnes, ko izmanto iespiestu attēlu vai teksta izgatavošanā. @lv
toolkit label: presformas izgatavotājs (dzimta/ģimene) @lv
toolkit definition: Dzimta/ģimene, kas iesaistīta manifestācijas ražošanā, sagatavojot plāksnes, ko izmanto iespiestu attēlu vai teksta izgatavošanā. @lv
sub property of: has creator family of manifestation
label: 有制版者家族 @zh-hans
definition: 将一种载体表现与负责准备用于在一种载体表现中制作印刷图像或文字的印版的一个家族关联起来。 @zh-hans
toolkit label: 制版者家族 @zh-hans
toolkit definition: 负责准备用于在一种载体表现中制作印刷图像或文字的印版的一个家族 @zh-hans
label: levhacı ailesi ile ilişkilidir @tr
definition: Bir gösterimi, bir gösterimdeki basılmış görüntüler veya metin yaparken kullanılan plakaları hazırlamakla sorumlu aileyle ilişkilendirir. @tr
toolkit label: Plaka yapıcı aile @tr
toolkit definition: Bir gösterimdeki basılmış görüntüler veya metin yaparken kullanılan plakaları hazırlamakla sorumlu aile. @tr
label: tiene familia fabricante de placas @es
definition: Relaciona una manifestación con una familia que es responsable de crear una manifestación al preparar placas utilizadas en la elaboración de imágenes o texto impreso. @es
toolkit label: familia fabricante de placas @es
toolkit definition: Una familia que es responsable de crear una manifestación al preparar placas utilizadas en la elaboración de imágenes o texto impreso. @es
has subproperty: has collotyper family
has subproperty: P30442

has platemaker person
status: Published
lexical alias: platemakerPerson.en
definition: Relates a manifestation to a person who is responsible for preparing plates used in the making of printed images or text in a manifestation.
toolkit label: platemaker person
toolkit definition: A person who is responsible for preparing plates used in the making of printed images or text in a manifestation.
type: Property
domain: C10007
has element type: 2
sub property of: has platemaker agent
label: painolaatan valmistaja (henkilö) @fi
definition: Liittää manifestaation henkilöön, joka on vastuussa manifestaation valmistamisesta valmistamalla painettujen kuvien tai tekstin valmistuksessa käytettäviä painolaattoja tai -levyjä. @fi
toolkit label: painolaatan valmistaja (henkilö) @fi
toolkit definition: Henkilö, joka on vastuussa manifestaation valmistamisesta valmistamalla painettujen kuvien tai tekstin valmistuksessa käytettäviä painolaattoja tai -levyjä. @fi
label: har trykkplatemaker (person) @no
definition: Relaterer en manifestasjon til en person som er involvert i framstillingen av en manifestasjon ved å klargjøre trykkplater som brukes ved produksjon av trykte bilder og/eller tekst. @no
toolkit label: trykkplatemaker (person) @no
toolkit definition: En person som er involvert i framstillingen av en manifestasjon ved å klargjøre trykkplater som brukes ved produksjon av trykte bilder og/eller tekst. @no
label: a pour personne clicheuse @fr
definition: Met une manifestation en relation avec une personne qui est responsable de la préparation des planches utilisées dans la réalisation d’images ou de textes imprimés dans une manifestation. @fr
toolkit label: personne clicheuse @fr
toolkit definition: Personne qui est responsable de la préparation des planches utilisées pour la réalisation d’images ou de textes imprimés dans une manifestation. @fr
label: heeft plaatmaker-persoon @nl
definition: Relateert een manifestatie aan een persoon die verantwoordelijk is voor het prepareren van platen gebruikt in het maken van gedrukte beelden of tekst in een manifestatie. @nl
toolkit label: plaatmaker-persoon @nl
toolkit definition: Een persoon die verantwoordelijk is voor het prepareren van platen gebruikt in het maken van gedrukte beelden of tekst in een manifestatie. @nl
label: له شخص مصمم لوحات @ar
definition: يربط بين تجسيدة وشخص مسئول عن تصنيع تجسيدة بإعداد اللوحات المستخدمة في إنتاج الصور المطبوعة أو النص. @ar
toolkit label: شخص مصمم لوحات @ar
toolkit definition: شخص مسئول عن تصنيع تجسيدة بإعداد اللوحات المستخدمة في إنتاج الصور المطبوعة أو النص. @ar
label: té com a persona gravadora de planxes @ca
definition: Relaciona una manifestació amb una persona que és responsable de la preparació de les planxes usades en l’elaboració d’imatges o de text imprès en una manifestació. @ca
toolkit label: persona gravadora de planxes @ca
toolkit definition: Persona que és responsable de la preparació de les planxes usades en l’elaboració d’imatges o de text imprès en una manifestació. @ca
label: har person, som er plademager @da
definition: Relaterer en manifestation til en person, som er involveret i fremstillingen af en manifestation ved at forberede plader, som anvendes til fremstilling af trykte billeder eller tekst. @da
toolkit label: person, som er plademager @da
toolkit definition: Person, som er involveret i fremstillingen af en manifestation ved at forberede plader, som anvendes til fremstilling af trykte billeder eller tekst. @da
label: trükiplaadi valmistaja (isik) @et
definition: Seostab kehastuse isikuga, kes osaleb kehastuse valmistamises, valmistades ette plaadid piltide või teksti trükkimiseks. @et
toolkit label: trükiplaadi valmistaja (isik) @et
toolkit definition: Isik, kes osaleb kehastuse valmistamises, valmistades ette plaadid piltide või teksti trükkimiseks. @et
label: hat Druckformherstellerin/Druckformhersteller (Person) @de
definition: Setzt eine Manifestation in Beziehung zu einer Person, die für die Herstellung einer Manifestation verantwortlich ist, indem sie Druckformen für die Produktion von gedruckten Bildern oder gedrucktem Text anfertigt. @de
toolkit label: Druckformherstellerin/Druckformhersteller (Person) @de
toolkit definition: Eine Person, die für die Herstellung einer Manifestation verantwortlich ist, indem sie Druckformen für die Produktion von gedruckten Bildern oder gedrucktem Text anfertigt. @de
label: nyomólemez-készítő személye a következő: @hu
definition: Hozzákapcsol egy megjelenési formát egy személyhez, aki felelős egy megjelenési forma gyártásáért oly módon, hogy nyomtatott képek vagy szövegek előállításánál használt lemezeket készít elő. @hu
toolkit label: nyomólemez-készítő személy: @hu
toolkit definition: Egy személy, aki felelős egy megjelenési forma gyártásáért oly módon, hogy nyomtatott képek vagy szövegek előállításánál használt lemezeket készít elő. @hu
label: ha come preparatore di lastre persona @it
definition: Correla una manifestazione alla persona coinvolta nella manifattura di una manifestazione, tramite la preparazione di lastre utilizzate nella produzione di immagini o testo stampati. @it
toolkit label: preparatore di lastre persona @it
toolkit definition: Persona coinvolta nella manifattura di una manifestazione, tramite la preparazione di lastre utilizzate nella produzione di immagini o testi stampati. @it
label: presformas izgatavotājs (persona) @lv
definition: Sasaista manifestāciju ar personu, kura iesaistīta manifestācijas ražošanā, sagatavojot plāksnes, ko izmanto iespiestu attēlu vai teksta izgatavošanā. @lv
toolkit label: presformas izgatavotājs (persona) @lv
toolkit definition: Persona, kura iesaistīta manifestācijas ražošanā, sagatavojot plāksnes, ko izmanto iespiestu attēlu vai teksta izgatavošanā. @lv
sub property of: has creator person of manifestation
label: 有制版者个人 @zh-hans
definition: 将一种载体表现与负责准备用于在一种载体表现中制作印刷图像和/或文字的平版的一个个人关联起来。 @zh-hans
toolkit label: 制版者个人 @zh-hans
toolkit definition: 负责准备用于在一种载体表现中制作印刷图像和/或文字的平版的一个个人 @zh-hans
label: levhacı kişisi ile ilişkilidir @tr
definition: Bir gösterimi, bir öğedeki basılı görsellerin veya metnin yapımında kullanılan levhaların hazırlanmasından sorumlu olan kişiyle ilişkilendirir. @tr
toolkit label: plaka yapıcı kişi @tr
toolkit definition: Bir gösterimde basılı resim veya metin yapımında kullanılan plakaları hazırlamaktan sorumlu kişi. @tr
label: tiene persona fabricante de planchas @es
definition: Relaciona una manifestación con una persona que se encarga de preparar las planchas utilizadas en la elaboración de imágenes impresas o texto en una manifestación. @es
toolkit label: persona fabricante de planchas @es
toolkit definition: Una persona que se encarga de preparar las planchas utilizadas en la elaboración de imágenes impresas o texto en una manifestación. @es
has subproperty: has collotyper person
has subproperty: P30355

has configuration of playback channels
status: Published
definition: Relates a manifestation to a number of sound channels used to make a recording.
type: Property
domain: C10007
sub property of: has sound characteristic
lexical alias: configurationOfPlaybackChannels.en
instruction number: 3.16.8
toolkit label: configuration of playback channels
toolkit definition: A number of sound channels used to make a recording.
label: a pour configuration des canaux de reproduction @fr
definition: Met une manifestation en relation avec un nombre de canaux sonores utilisés pour réaliser un enregistrement. @fr
toolkit label: configuration des canaux de reproduction @fr
toolkit definition: Nombre de canaux sonores utilisés pour réaliser un enregistrement. @fr
toolkit label: configuración de canales de reproducción @es
toolkit definition: Una serie de canales de sonido utilizados para realizar una grabación. @es
label: har antal ljudkanaler @sv
toolkit label: antal ljudkanaler @sv
toolkit label: configuratie van afspeelkanalen @nl
toolkit definition: Een aantal geluidskanalen gebruikt om een opname te maken. @nl
label: có cấu hình của kênh phát lại @vi
definition: Liên kết biểu thị với số lượng kênh âm thanh được sử dụng để tạo bản ghi. @vi
toolkit label: cấu hình của kênh phát lại @vi
toolkit definition: Số lượng kênh âm thanh được sử dụng để tạo bản ghi. @vi
label: har konfiguration af afspilningskanaler @da
definition: Relaterer en manifestation til et antal lydkanaler, som anvendes til at lave en indspilning. @da
toolkit label: konfiguration af afspilningskanaler @da
toolkit definition: Antal lydkanaler, som anvendes til at lave en indspilning. @da
label: hat Konfiguration von Wiedergabekanälen @de
definition: Setzt eine Manifestation in Beziehung zu einer Anzahl von Tonkanälen, die für die Wiedergabe einer Aufnahme verwendet werden. @de
toolkit label: Konfiguration von Wiedergabekanälen @de
toolkit definition: Eine Anzahl von Tonkanälen, die für die Wiedergabe einer Aufnahme verwendet werden. @de
label: té com a configuració de canals de reproducció @ca
definition: Relaciona una manifestació amb un nombre de canals de so usats per fer un enregistrament. @ca
toolkit label: configuració de canals de reproducció @ca
toolkit definition: Nombre de canals de so usats per fer un enregistrament. @ca
definition: Liittää manifestaation äänityksessä käytettyjen äänikanavien määrään. @fi
toolkit label: toistokanavien määrä @fi
toolkit definition: Äänityksessä käytettyjen äänikanavien määrä. @fi
toolkit label: konfigurasjon av kanaler for avspilling @no
toolkit definition: Et antall lydkanaler som brukes for å gjøre et opptak. @no
label: έχει διαμόρφωση των καναλιών αναπαραγωγής @el
definition: Συνδέει μια εκδήλωση με έναν αριθμό ηχητικών καναλιών που χρησιμοποιούνται για τη δημιουργία μιας ηχογράφησης. @el
toolkit label: διαμόρφωση των καναλιών αναπαραγωγής @el
toolkit definition: Ένας αριθμός ηχητικών καναλιών που χρησιμοποιούνται για τη δημιουργία μιας ηχογράφησης. @el
has element type: 4
label: visszajátszási csatornák konfigurációja a következő: @hu
definition: Hozzákapcsol egy megjelenési formát a hangcsatornák számához, amelyeket lemezfelvétel készítésekor használnak. @hu
toolkit label: visszajátszási csatornák konfigurációja: @hu
toolkit definition: Hangcsatornák száma, amelyeket lemezfelvétel készítésekor használnak @hu
label: toistokanavien määrä @fi
label: har konfigurasjon av kanaler for avspilling @no
definition: Relaterer en manifestasjon til et antall lydkanaler som brukes for å gjøre et opptak. @no
label: heeft configuratie van afspeelkanalen @nl
definition: Relateert een manifestatie aan een aantal geluidskanalen gebruikt om een opname te maken. @nl
label: له إعدادات قنوات التشغيل @ar
definition: يربط بين تجسيدة ورقم قنوات الصوت المستخدمة في تسجيل. @ar
toolkit label: إعدادات قنوات التشغيل @ar
toolkit definition: رقم قنوات الصوت المستخدمة في تسجيل. @ar
label: taasesituskanalite konfiguratsioon @et
definition: Seostab kehastuse salvestusel kasutatud helikanalite arvuga. @et
toolkit label: taasesituskanalite konfiguratsioon @et
toolkit definition: Salvestusel kasutatud helikanalite arv. @et
label: ha come configurazione dei canali di riproduzione @it
definition: Correla una manifestazione a un numero di canali audio utilizzati per realizzare una registrazione. @it
toolkit label: configurazione dei canali di riproduzione @it
toolkit definition: Numero di canali audio utilizzati per realizzare una registrazione. @it
label: atskaņošanas kanālu konfigurējums @lv
definition: Sasaista manifestāciju ar skaņu kanālu skaitu, kas izmantots, lai veiktu skaņu ierakstu. @lv
toolkit label: atskaņošanas kanālu konfigurējums @lv
toolkit definition: Skaņu kanālu skaits, kas izmantots, lai veiktu skaņu ierakstu. @lv
label: 有回放声道的配置 @zh-hans
definition: 将一种载体表现与用于制作一个录音制品的声道数关联起来。 @zh-hans
toolkit label: 回放声道的配置 @zh-hans
toolkit definition: 用于制作一个录音制品的声道数 @zh-hans
label: oynatma kanallarının konfigürasyonu ile ilişkilidir @tr
definition: Bir gösterimi, kayıt yapmak için kullanılan birkaç ses kanalı ile ilişkilendirir. @tr
toolkit label: oynatma kanallarının konfigürasyonu @tr
toolkit definition: Kayıt yapmak için kullanılan birkaç ses kanalı. @tr
label: tiene configuración de canales de reproducción @es

has details of configuration of playback channels
status: Published
type: Property
lexical alias: detailsOfConfigurationOfPlaybackChannels.en
definition: Relates a manifestation to details of a number of sound channels used to make a recording.
domain: C10007
instruction number: 3.16.8.4
toolkit label: details of configuration of playback channels
toolkit definition: Details of a number of sound channels used to make a recording.
toolkit label: detalles de configuración de canales de reproducción @es
toolkit definition: Detalles de una serie de canales de sonido utilizados para realizar una grabación. @es
sub property of: has details of sound characteristic
label: har detaljerad information om antal ljudkanaler @sv
toolkit label: detaljerad information om antal ljudkanaler @sv
toolkit label: details van afspeelkanalenconfiguratie @nl
toolkit definition: Details van een aantal geluidskanalen die gebruikt worden om een opname te maken. @nl
label: có chi tiết của cấu hình của kênh phát lại @vi
definition: Liên kết biểu thị với chi tiết của số lượng kênh âm thanh được sử dụng để tạo bản ghi. @vi
toolkit label: chi tiết của cấu hình của kênh phát lại @vi
toolkit definition: Chi tiết của số lượng kênh âm thanh được sử dụng để tạo bản ghi. @vi
label: har detaljer om konfiguration af afspilningskanaler @da
definition: Relaterer en manifestation til detaljer om et antal af lydkanaler, som anvendes til en indspilning. @da
toolkit label: detaljer om konfiguration af afspilningskanaler @da
toolkit definition: Detaljer om et antal af lydkanaler, som anvendes til en indspilning. @da
label: hat Details zur Konfiguration von Wiedergabekanälen @de
definition: Setzt eine Manifestation in Beziehung zu den Details zur Anzahl von Tonkanälen, die für die Wiedergabe einer Aufnahme verwendet werden. @de
toolkit label: Details zur Konfiguration von Wiedergabekanälen @de
toolkit definition: Details zur Anzahl von Tonkanälen, die für die Wiedergabe einer Aufnahme verwendet werden. @de
label: té com a particularitats de configuració de canals de reproducció @ca
definition: Relaciona una manifestació amb les particularitats d’un nombre de canals de so usats per fer un enregistrament. @ca
toolkit label: particularitats de configuració de canals de reproducció @ca
toolkit definition: Particularitats d’un nombre de canals de so usats per fer un enregistrament. @ca
definition: Liittää manifestaation tarkempiin tietoihin äänitteen tekoon käytettyjen äänikanavien määrästä. @fi
toolkit label: toistokanavien määrän tarkemmat tiedot @fi
toolkit definition: Tarkemmat tiedot äänitteen tekoon käytettyjen äänikanavien määrästä. @fi
toolkit label: detaljer vedrørende konfigurasjon av kanaler for avspilling @no
toolkit definition: Detaljer vedrørende et antall lydkanaler som brukes for å gjøre et opptak. @no
label: έχει λεπτομέρειες της διαμόρφωσης των καναλιών αναπαραγωγής @el
definition: Συνδέει μια εκδήλωση με τις λεπτομέρειες ενός αριθμού καναλιών ήχου που χρησιμοποιούνται για την κατασκευή μιας ηχογράφησης. @el
toolkit label: λεπτομέρειες της διαμόρφωσης των καναλιών αναπαραγωγής @el
toolkit definition: Λεπτομέρειες ενός αριθμού καναλιών ήχου που χρησιμοποιούνται για την κατασκευή μιας ηχογράφησης. @el
label: a pour particularités d’une configuration des canaux de reproduction @fr
definition: Met une manifestation en relation avec des particularités d’un nombre de canaux sonores utilisés pour réaliser un enregistrement. @fr
toolkit label: particularités d’une configuration des canaux de reproduction @fr
toolkit definition: Particularités d’un nombre de canaux sonores utilisés pour réaliser un enregistrement. @fr
has element type: 6
label: visszajátszási csatornák konfigurációjának részletei a következők: @hu
definition: Hozzákapcsol egy megjelenési formát lemezfelvétel készítésére használt hangcsatornák számának részleteihez. @hu
toolkit label: visszajátszási csatornák konfigurációjának részletei: @hu
toolkit definition: Lemezfelvétel készítésére használt hangcsatornák számának részletei. @hu
label: toistokanavien määrän tarkemmat tiedot @fi
label: har detaljer vedrørende konfigurasjon av kanaler for avspilling @no
definition: Relaterer en manifestasjon til detaljer vedrørende et antall lydkanaler som brukes for å gjøre et opptak. @no
label: heeft details van afspeelkanalenconfiguratie @nl
definition: Relateert een manifestatie aan details van een aantal geluidskanalen die gebruikt worden om een opname te maken. @nl
label: له تفاصيل إعدادات قنوات التشغل @ar
definition: يربط بين تجسيدة وتفاصيل عدد قنوات الصوت المستخدمة في إعداد تسجيل. @ar
toolkit label: تفاصيل إعدادات قنوات التشغل @ar
toolkit definition: تفاصيل عدد قنوات الصوت المستخدمة في إعداد تسجيل. @ar
label: taasesituskanalite konfiguratsiooni täpsustus @et
definition: Seostab kehastuse täpsemate andmetega salvestusel kasutatud helikanalite arvu kohta. @et
toolkit label: taasesituskanalite konfiguratsiooni täpsustus @et
toolkit definition: Täpsemad andmed salvestusel kasutatud helikanalite arvu kohta. @et
label: ha come particolari relativi alla configurazione dei canali di riproduzione @it
definition: Correla una manifestazione ai particolari relativi a un numero di canali audio utilizzati per realizzare una registrazione. @it
toolkit label: particolari relativi alla configurazione dei canali di riproduzione @it
toolkit definition: Particolari relativi a un numero di canali audio utilizzati per realizzare una registrazione. @it
label: detalizēti par atskaņošanas kanālu konfigurēšanu @lv
definition: Sasaista manifestāciju ar sīkāku informāciju par skaņu kanālu skaitu, kas lietots, lai veiktu skaņu ierakstu. @lv
toolkit label: detalizēti par atskaņošanas kanālu konfigurēšanu @lv
toolkit definition: Sīkāka informācija par skaņu kanālu skaitu, kas lietots, lai veiktu skaņu ierakstu. @lv
label: 有回放声道的配置的细节 @zh-hans
definition: 将一种载体表现与用于制作一个录音制品的声道数的细节关联起来。 @zh-hans
toolkit label: 回放声道的配置的细节 @zh-hans
toolkit definition: 用于制作一个录音制品的声道数的细节 @zh-hans
label: oynatma kanalları düzeninin ayrıntıları ile ilişkilidir @tr
definition: Bir gösterimi, kayıt yapmak için kullanılan bir dizi ses kanalının ayrıntılarıyla ilişkilendirir. @tr
toolkit label: oynatma kanallarının yapılandırma ayrıntıları @tr
toolkit definition: Bir kayıt yapmak için kullanılan bir dizi ses kanalının ayrıntıları. @tr
label: tiene detalles de configuración de canales de reproducción @es

has polarity
status: Published
definition: Relates a manifestation to a relationship of the colours and tones in an image of an object to the colours and tones of the object that is reproduced.
type: Property
domain: C10007
lexical alias: polarity.en
instruction number: 3.14
toolkit label: polarity
toolkit definition: A relationship of the colours and tones in an image of an object to the colours and tones of the object that is reproduced.
label: a pour polarité @fr
definition: Met une manifestation en relation avec une relation des couleurs et des tons d’une image d’un objet avec les couleurs et les tons de l’objet reproduit. @fr
toolkit label: polarité @fr
toolkit definition: Relation des couleurs et des tons d’une image d’un objet avec les couleurs et les tons de l’objet reproduit. @fr
toolkit label: polaridad @es
toolkit definition: Una relación de los colores y tonos de una imagen de un objeto con los colores y tonos del objeto que se reproduce. @es
label: har polaritet @sv
toolkit label: polaritet @sv
toolkit label: polariteit @nl
toolkit definition: Een relatie tussen de kleuren en tonen in een beeld en de kleuren en tonen van het object dat gereproduceerd is. @nl
label: có phân cực @vi
definition: Liên kết biểu thị với mối quan hệ của màu và sắc thái trong hình ảnh với màu và sắc thái của vật thể được sao chép. @vi
toolkit label: phân cực @vi
toolkit definition: Mối quan hệ của màu và sắc thái trong hình ảnh với màu và sắc thái của vật thể được sao chép. @vi
definition: Relaterer en manifestation til et forhold mellem farver og nuancer i et billede og farver og nuancer i den reproducerede genstand. @da
toolkit definition: Forhold mellem farver og nuancer i et billede og farver og nuancer i den reproducerede genstand. @da
label: hat Polarität @de
definition: Setzt eine Manifestation in Beziehung zum Verhältnis zwischen den Farben und Tönungen im Bild eines Objekts und den Farben und Tönungen des reproduzierten Objekts. @de
toolkit label: Polarität @de
toolkit definition: Ein Verhältnis zwischen den Farben und Tönungen im Bild eines Objekts und den Farben und Tönungen des reproduzierten Objekts. @de
label: té com a polaritat @ca
definition: Relaciona una manifestació amb una relació entre els colors i les tonalitats d’una imatge amb els colors i les tonalitats de l’objecte que es reprodueix. @ca
toolkit label: polaritat @ca
toolkit definition: Relació entre els colors i les tonalitats d’una imatge amb els colors i les tonalitats de l’objecte que es reprodueix. @ca
definition: Liittää manifestaation suhteeseen, joka kuvan väreillä ja valoisuudella on kuvan kohteen väreihin ja valoisuuteen. @fi
toolkit label: polariteetti @fi
toolkit definition: Suhde, joka kuvan väreillä ja valoisuudella on kuvan kohteen väreihin ja valoisuuteen. @fi
toolkit definition: Et forhold mellom fargene og tonene til et bilde og fargene og tonene til motivet som gjengis. @no
label: έχει πολικότητα @el
definition: Συνδέει μια εκδήλωση με μια σχέση των χρωμάτων και των αποχρώσεων σε μια εικόνα με τα χρώματα και τις αποχρώσεις του αναπαραγόμενου αντικειμένου. @el
toolkit label: πολικότητα @el
toolkit definition: Μια σχέση των χρωμάτων και των αποχρώσεων σε μια εικόνα με τα χρώματα και τις αποχρώσεις του αναπαραγόμενου αντικειμένου. @el
has element type: 4
label: polaritása a következő: @hu
definition: Hozzákapcsol egy megjelenési formát egy kép színei és tónusai, valamint a reprodukált objektum színei és tónusai között fennálló kapcsolathoz. @hu
toolkit label: polaritása: @hu
toolkit definition: Egy kép színei és tónusai, valamint a reprodukált objektum színei és tónusai között fennálló kapcsolat. @hu
label: polariteetti @fi
definition: Relaterer en manifestasjon til et forhold mellom fargene og tonene til et bilde og fargene og tonene til motivet som gjengis. @no
label: heeft polariteit @nl
definition: Relateert een manifestatie aan een relatie tussen de kleuren en tonen in een beeld en de kleuren en tonen van het object dat gereproduceerd is. @nl
label: له استقطاب ألوان @ar
definition: يربط بين تجسيدة وعلاقة خاصة بالألوان ودرجاتها في صورة ما والألوان ودرجاتها في الشيء المعاد إنتاجه. @ar
toolkit label: استقطاب ألوان @ar
toolkit definition: علاقة خاصة بالألوان ودرجاتها في صورة ما والألوان ودرجاتها في الشيء المعاد إنتاجه. @ar
label: polaarsus @et
definition: Seostab kehastuse pildi värvuste ja toonide ning reprodutseeritud objekti värvuste ja toonide suhtega. @et
toolkit label: polaarsus @et
toolkit definition: Pildi värvuste ja toonide ning reprodutseeritud objekti värvuste ja toonide suhe. @et
label: ha come polarità @it
definition: Correla una manifestazione a una relazione tra i colori e toni in un'immagine e i colori e toni dell'oggetto riprodotto. @it
toolkit label: polarità @it
toolkit definition: Relazione tra i colori e toni in un'immagine e i colori e toni dell'oggetto riprodotto. @it
label: polaritāte @lv
definition: Sasaista manifestāciju ar attēla krāsu un toņu atbilstību reproducētā objekta krāsās un toņos (piem., pozitīvs, negatīvs). @lv
toolkit label: polaritāte @lv
toolkit definition: Attēla krāsu un toņu atbilstība reproducētā objekta krāsās un toņos (piem., pozitīvs, negatīvs). @lv
label: 有极性 @zh-hans
definition: 将一种载体表现与一个对象的图像中色彩和色调与被复制对象的色彩和色调的关系关联起来。 @zh-hans
toolkit label: 极性 @zh-hans
toolkit definition: 一个对象的图像中色彩和色调与被复制对象的色彩和色调的关系 @zh-hans
label: polarite ile ilişkilidir @tr
definition: Bir gösterimi, bir nesnenin görüntüsündeki renklerin ve tonların, yeniden üretilen nesnenin renkleri ve tonlarıyla olan ilişkisine dair bir belirtiyle ilişkilidir. @tr
toolkit label: karşıt @tr
toolkit definition: Bir nesnenin görüntüsündeki renklerin ve tonların, yeniden üretilen nesnenin renkleri ve tonlarıyla olan ilişkisi. @tr
label: tiene polaridad @es
definition: Relaciona una manifestación con una relación de los colores y tonos de una imagen de un objeto con los colores y tonos del objeto que se reproduce. @es
has subproperty: P30196

has details of polarity
status: Published
type: Property
lexical alias: detailsOfPolarity.en
definition: Relates a manifestation to details of a relationship of the colours and tones in an image to the colours and tones of the object reproduced.
domain: C10007
instruction number: 3.14.1.4
toolkit label: details of polarity
toolkit definition: Details of a relationship of the colours and tones in an image to the colours and tones of the object reproduced.
toolkit label: detalles de polaridad @es
toolkit definition: Detalles de una relación de los colores y tonos de una imagen con los colores y tonos del objeto reproducido. @es
label: har detaljerad information om polaritet @sv
toolkit label: detaljerad information om polaritet @sv
toolkit label: details van polariteit @nl
toolkit definition: Details van een relatie tussen de kleuren en tonen in een beeld en de kleuren en tonen van de reproductie. @nl
label: có chi tiết của phân cực @vi
definition: Liên kết biểu thị với chi tiết của mối quan hệ của màu và sắc thái trong hình ảnh với màu và sắc thái của vật thể được sao chép. @vi
toolkit label: chi tiết của phân cực @vi
toolkit definition: Chi tiết của mối quan hệ của màu và sắc thái trong hình ảnh với màu và sắc thái của vật thể được sao chép. @vi
label: har detaljer om polaritet @da
definition: Relaterer en manifestation til detaljer om et forhold mellem farverne og nuancerne i et billede og farverne og nuancerne i den reproducerede genstand. @da
toolkit label: detaljer om polaritet @da
toolkit definition: Detaljer om et forhold mellem farverne og nuancerne i et billede og farverne og nuancerne i den reproducerede genstand. @da
label: hat Details zur Polarität @de
definition: Setzt eine Manifestation in Beziehung zu den Details zu dem Verhältnis der Farben und Tönungen in einem Bild zu den Farben und Tönungen des reproduzierten Objekts. @de
toolkit label: Details zur Polarität @de
toolkit definition: Details zu dem Verhältnis der Farben und Tönungen in einem Bild zu den Farben und Tönungen des reproduzierten Objekts. @de
label: té com a particularitats de polaritat @ca
definition: Relaciona una manifestació amb les particularitats d’una relació entre els colors i les tonalitats d’una imatge amb els colors i les tonalitats de l’objecte reproduït. @ca
toolkit label: particularitats de polaritat @ca
toolkit definition: Particularitats d’una relació entre els colors i les tonalitats d’una imatge amb els colors i les tonalitats de l’objecte reproduït. @ca
definition: Liittää manifestaation tarkempiin tietoihin suhteesta, joka kuvan väreillä ja valoisuudella on kuvan kohteen väreihin ja valoisuuteen. @fi
toolkit label: polariteetin tarkemmat tiedot @fi
toolkit definition: Tarkemmat tiedot suhteesta, joka kuvan väreillä ja valoisuudella on kuvan kohteen väreihin ja valoisuuteen. @fi
toolkit label: detaljer vedrørende polaritet @no
toolkit definition: Detaljer vedrørende forholdet mellom fargene og tonene til et bilde og fargene og tonene til motivet som gjengis. @no
label: έχει λεπτομέρειες της πολικότητας @el
definition: Συνδέει μια εκδήλωση με τις λεπτομέρειες μιας σχέσης των χρωμάτων και των αποχρώσεων σε μια εικόνα με τα χρώματα και τις αποχρώσεις του αναπαραγόμενου αντικειμένου. @el
toolkit label: λεπτομέρειες της πολικότητας @el
toolkit definition: Λεπτομέρειες μιας σχέσης των χρωμάτων και των αποχρώσεων σε μια εικόνα με τα χρώματα και τις αποχρώσεις του αναπαραγόμενου αντικειμένου. @el
label: a pour particularités d’une polarité @fr
definition: Met une manifestation en relation avec des particularités d’une relation des couleurs et des tons d’une image avec les couleurs et les tons de l’objet reproduit. @fr
toolkit label: particularités d’une polarité @fr
toolkit definition: Particularités d’une relation des couleurs et des tons d’une image avec les couleurs et les tons de l’objet reproduit. @fr
has element type: 6
label: polaritás részletei a következők: @hu
definition: Egy kép színei és tónusai, valamint a reprodukált tárgy színei és tónusai között fennálló viszony részletei. @hu
toolkit label: polaritás részletei: @hu
toolkit definition: Hozzákapcsol egy megjelenési formát egy kép színei és tónusai, valamint a reprodukált tárgy színei és tónusai között fennálló viszony részleteihez. @hu
label: polariteetin tarkemmat tiedot @fi
label: har detaljer vedrørende polaritet @no
definition: Relaterer en manifestasjon til detaljer vedrørende forholdet mellom fargene og tonene til et bilde og fargene og tonene til motivet som gjengis. @no
label: heeft details van polariteit @nl
definition: Relateert een manifestatie aan details van een relatie tussen de kleuren en tonen in een beeld en de kleuren en tonen van de reproductie. @nl
label: له تفاصيل عن استقطاب ألوان @ar
definition: يربط بين تجسيدة وتفاصيل علاقة الألوان ودرجاتها في صورة ما والألوان ودرجاتها في الشيء المعاد إنتاجه. @ar
toolkit label: تفاصيل عن استقطاب ألوان @ar
toolkit definition: تفاصيل علاقة الألوان ودرجاتها في صورة ما والألوان ودرجاتها في الشيء المعاد إنتاجه. @ar
label: polaarsuse täpsustus @et
definition: Seostab kehastuse täpsemate andmetega pildi värvuste ja toonide ning reprodutseeritud objekti värvuste ja toonide suhte kohta. @et
toolkit label: polaarsuse täpsustus @et
toolkit definition: Täpsemad andmed pildi värvuste ja toonide ning reprodutseeritud objekti värvuste ja toonide suhte kohta. @et
label: ha come particolari relativi alla polarità @it
definition: Correla una manifestazione ai particolari relativi a un relazione tra i colori e i toni in un'immagine e i colori e i toni dell'oggetto riprodotto. @it
toolkit label: particolari relativi alla polarità @it
toolkit definition: Particolari relativi a una relazione tra i colori e i toni in un'immagine e i colori e i toni dell'oggetto riprodotto. @it
label: detalizēti par polaritāti @lv
definition: Sasaista manifestāciju ar sīkāku informāciju par attēla krāsu un toņu atbilstību reproducētā objekta krāsām un toņiem. @lv
toolkit label: detalizēti par polaritāti @lv
toolkit definition: Sīkāka informācija par attēla krāsu un toņu atbilstību reproducētā objekta krāsām un toņiem. @lv
label: 有极性细节 @zh-hans
definition: 将一种载体表现与一个对象的图像中色彩和色调与被复制对象的色彩和色调的关系的细节关联起来。 @zh-hans
toolkit label: 极性细节 @zh-hans
toolkit definition: 一个对象的图像中色彩和色调与被复制对象的色彩和色调的关系的细节 @zh-hans
label: polarite ayrıntıları ile ilişkilidir @tr
definition: Bir gösterimi, görüntüdeki renklerin ve tonların yeniden üretilen nesnenin renk ve tonlarıyla olan ilişkisinin ayrıntılarıyla ilişkilendirir. @tr
toolkit label: polaritenin ayrıntıları @tr
toolkit definition: Bir görüntüdeki renkler ve tonlar ile yeniden üretilen nesnenin renkleri ve tonları arasındaki ilişkinin ayrıntıları. @tr
label: tiene detalles de polaridad @es
definition: Relaciona una manifestación con detalles de una relación de los colores y tonos de una imagen con los colores y tonos del objeto reproducido. @es

is preservation facsimile of item of
status: Published
type: Property
lexical alias: preservationFacsimileOfItemOf.en
definition: Relates a manifestation to an item that is used as the basis for an exact reproduction on preservation-quality media, such as acid-free permanent or archival paper.
domain: C10007
sub property of: is facsimile of item of
toolkit label: preservation facsimile of item of
toolkit definition: An item that is used as the basis for an exact reproduction on preservation-quality media, such as acid-free permanent or archival paper.
has element type: 2
label: säilytyskopio kappaleesta @fi
definition: Liittää manifestaation kappaleeseen, jota on käytetty täsmällisen ja arkistokelpoisen jäljennöksen pohjana. Jäljennöksen valmistuksessa on käytetty arkistokelpoista materiaalia, esim. arkistopaperia. @fi
toolkit label: säilytyskopio kappaleesta @fi
toolkit definition: Kappale, jota on käytetty täsmällisen ja arkistokelpoisen jäljennöksen pohjana. Jäljennöksen valmistuksessa on käytetty arkistokelpoista materiaalia, esim. arkistopaperia. @fi
label: er bevaringskopi av eksemplar av @no
definition: Relaterer en manifestasjon til et eksemplar som brukes som grunnlag for en nøyaktig reproduksjon på et medium av bevaringskvalitet, som for eksempel syrefritt papir eller arkivpapir. @no
toolkit label: bevaringskopi av eksemplar av @no
toolkit definition: Et eksemplar som brukes som grunnlag for en nøyaktig reproduksjon på et medium av bevaringskvalitet, som for eksempel syrefritt papir eller arkivpapir. @no
label: est un fac-similé de conservation d’un item de @fr
definition: Met une manifestation en relation avec un item qui sert de base à une reproduction exacte sur un support de qualité conservation, tel qu’un papier permanent sans acide ou un papier d’archivage. @fr
toolkit label: fac-similé de conservation d’un item de @fr
toolkit definition: Item qui sert de base à une reproduction exacte sur un support de qualité conservation, tel qu’un papier permanent sans acide ou un papier d’archivage. @fr
label: is conservatiefacsimile van item van @nl
definition: Relateert een manifestatie aan een Item dat gebruikt is als de basis voor een exacte reproductie op media van conserveringskwaliteit, zoals zuurvrij permanent- of archiefpapier. @nl
toolkit label: conservatiefacsimile van item van @nl
toolkit definition: Een Item dat gebruikt is als de basis voor een exacte reproductie op media van conserveringskwaliteit, zoals zuurvrij permanent- of archiefpapier. @nl
label: هو حفظ صورة طبق الأصل لمفردة لـ @ar
definition: يربط بين تجسيدة ومفردة تستخدم كأساس لعملية الإستنساخ الدقيق على وسيط ذي جودة تكفل الحفظ، مثل الأوراق الخالية من الأحماض وأوراق المحفوظات الأرشيفية. @ar
toolkit label: حفظ صورة طبق الأصل لمفردة لـ @ar
toolkit definition: مفردة تستخدم كأساس لعملية الإستنساخ الدقيق على وسيط ذي جودة تكفل الحفظ، مثل الأوراق الخالية من الأحماض وأوراق المحفوظات الأرشيفية. @ar
label: és facsímil de preservació d’un ítem de @ca
definition: Relaciona una manifestació amb un ítem que s’usa com a base d’una reproducció exacta en un suport de preservació de qualitat, com ara paper permanent no àcid o paper d’arxiu. @ca
toolkit label: facsímil de preservació d’un ítem de @ca
toolkit definition: Ítem que s’usa com a base d’una reproducció exacta en un suport de preservació de qualitat, com ara paper permanent no àcid o paper d’arxiu. @ca
label: er bevaringsfaksimile af eksemplar af @da
definition: Relaterer en manifestation til et eksemplar, som anvendes som grundlag for en nøjagtig reproduktion på et medium af bevaringskvalitet, såsom syrefrit permanent- eller arkivpapir. @da
toolkit label: bevaringsfaksimile af eksemplar af @da
toolkit definition: Eksemplar, som anvendes som grundlag for en nøjagtig reproduktion på et medium af bevaringskvalitet, såsom syrefrit permanent- eller arkivpapir. @da
label: säilituskoopia eksemplarist @et
definition: Seostab kehastuse eksemplariga, mida on kasutatud täpse reproduktsiooni tegemiseks arhiivikvaliteediga meediumil, nt happevabal vananemiskindlal ehk arhiivipaberil. @et
toolkit label: säilituskoopia eksemplarist @et
toolkit definition: Eksemplar, mida on kasutatud täpse reproduktsiooni tegemiseks arhiivikvaliteediga meediumil, nt happevabal vananemiskindlal ehk arhiivipaberil. @et
label: ist Bestandserhaltungsfaksimile eines Exemplars von @de
definition: Setzt eine Manifestation in Beziehung zu einem Exemplar, das als Grundlage für eine exakte Reproduktion auf bestandserhaltenden Medien, wie zum Beispiel säurefreiem Papier oder Archivpapier, verwendet wird. @de
toolkit label: Bestandserhaltungsfaksimile eines Exemplars von @de
toolkit definition: Ein Exemplar, das als Grundlage für eine exakte Reproduktion auf bestandserhaltenden Medien, wie zum Beispiel säurefreiem Papier oder Archivpapier, verwendet wird. @de
label: megőrzési hasonmása a következő példánynak: @hu
definition: Hozzákapcsol egy megjelenési formát egy példányhoz, amelyet pontos másolat alapjaként használnak egy olyan megőrzés-minőségű médiumon, mint például a savmentes tartós vagy archiváló papír. @hu
toolkit label: megőrzési hasonmása a következő példánynak: @hu
toolkit definition: Egy példány, amelyet pontos másolat alapjaként használnak egy olyan megőrzés-minőségű médiumon, mint például a savmentes tartós vagy archiváló papír. @hu
label: è facsimile per la conservazione di item di @it
definition: Correla una manifestazione a un item utilizzato come base per una riproduzione esatta su mezzi adatti alla conservazione, come carta non acida o carta da archivio. @it
toolkit label: facsimile per la conservazione di item di @it
toolkit definition: item utilizzato come base per una riproduzione esatta su mezzi adatti alla conservazione, come carta non acida o carta da archivio. @it
label: ir arhīvfaksimils vienībai @lv
definition: Sasaista manifestāciju ar vienību, kas ir izmantota par pamatu precīzai redprodukcijai uz kvalitatīva nesēja, piemēram, uz skābi nesaturoša papīra vai arhīvpapīra. @lv
toolkit label: ir arhīvfaksimils vienībai @lv
toolkit definition: Vienība, kas ir izmantota par pamatu precīzai redprodukcijai uz kvalitatīva nesēja, piemēram, uz skābi nesaturoša papīra vai arhīvpapīra. @lv
label: 是……的保存摹真品 @zh-hans
definition: 将一种载体表现与用作在脱酸的永久用纸或档案纸等具有保存品质的媒介上的精确复制品之基础的一个单件关联起来。 @zh-hans
toolkit label: ……的保存摹真品 @zh-hans
toolkit definition: 用作在脱酸的永久用纸或档案纸等具有保存品质的媒介上的精确复制品之基础的一个单件 @zh-hans
label: kopyasının koruma kopyasıdır @tr
definition: Bir gösterimi, asitsiz kalıcı veya arşiv kağıdı gibi koruma kalitesinde ortamlarda kesin bir coğaltmanın temeli olarak kullanılan bir kopyayla ilişkilendirir. @tr
toolkit label: Kopyanın koruma tıpkıbasımı @tr
toolkit definition: Asitsiz kalıcı veya arşiv kağıdı gibi koruma kalitesindeki ortamlarda birebir çoğaltma için temel olarak kullanılan bir kopya. @tr
label: es un facsímil de conservación del item de @es
definition: Relaciona una manifestación con un item que se utiliza como base para una reproducción exacta en medios con calidad de preservación, como papel permanente sin ácido o de archivo. @es
toolkit label: facsímil de conservación del item de @es
toolkit definition: Un item que se utiliza como base para una reproducción exacta en medios con calidad de preservación, como papel permanente sin ácido o de archivo. @es
has subproperty: P30301

is preservation facsimile of manifestation of
status: Published
definition: Relates a manifestation to a manifestation that is used as the basis for an exact reproduction on preservation-quality media, such as acid-free permanent or archival paper.
type: Property
domain: C10007
sub property of: is facsimile of manifestation of
lexical alias: preservationFacsimileOfManifestationOf.en
toolkit label: preservation facsimile of manifestation of
toolkit definition: A manifestation that is used as the basis for an exact reproduction on preservation-quality media, such as acid-free permanent or archival paper.
label: est un fac-similé de conservation d’une manifestation de @fr
definition: Met une manifestation en relation avec une manifestation qui sert de base à une reproduction exacte sur un support de qualité conservation, tel qu’un papier permanent sans acide ou un papier d’archivage. @fr
toolkit label: fac-similé de conservation d’une manifestation de @fr
toolkit definition: Manifestation qui sert de base à une reproduction exacte sur un support de qualité conservation, tel qu’un papier permanent sans acide ou un papier d’archivage. @fr
toolkit label: facsímil de preservación de la manifestación de @es
toolkit definition: Una manifestación que se utiliza como base para una reproducción exacta en medios con calidad de preservación, como papel permanente sin ácido o de archivo. @es
instruction number: 24.5
toolkit label: conservatiefacsimile van manifestatie van @nl
toolkit definition: Een manifestatie die gebruikt is als de basis voor een exacte reproductie op media van conserveringskwaliteit, zoals zuurvrij permanent- of archiefpapier. @nl
label: là bản sao chép bảo quản của (biểu thị) @vi
definition: Liên kết biểu thị với biểu thị được sử dụng như là cơ sở cho bản tái tạo trên phương tiện chất lượng bảo quản, như là giấy vĩnh cửu phi axit hoặc giấy lưu trữ. @vi
toolkit label: bản sao chép bảo quản của (biểu thị) @vi
toolkit definition: Biểu thị được sử dụng như là cơ sở cho bản tái tạo trên phương tiện chất lượng bảo quản, như là giấy vĩnh cửu phi axit hoặc giấy lưu trữ. @vi
label: er bevaringsfaksimile af manifestation af @da
definition: Relaterer en manifestation til en manifestation, som anvendes som grundlag for en nøjagtig reproduktion på et medium af bevaringskvalitet, såsom syrefrit permanent- eller arkivpapir. @da
toolkit label: bevaringsfaksimile af manifestation af @da
toolkit definition: Manifestation, som anvendes som grundlag for en nøjagtig reproduktion på et medium af bevaringskvalitet, såsom syrefrit permanent- eller arkivpapir. @da
label: ist Bestandserhaltungsfaksimile einer Manifestation von @de
definition: Setzt eine Manifestation in Beziehung zu einer Manifestation, die als Grundlage für eine exakte Reproduktion auf bestandserhaltenden Medien, wie zum Beispiel säurefreiem Papier oder Archivpapier, verwendet wird. @de
toolkit label: Bestandserhaltungsfaksimile einer Manifestation von @de
toolkit definition: Eine Manifestation, die als Grundlage für eine exakte Reproduktion auf bestandserhaltenden Medien, wie zum Beispiel säurefreiem Papier oder Archivpapier, verwendet wird. @de
label: és facsímil de preservació d’una manifestació de @ca
definition: Relaciona una manifestació amb una manifestació que s’usa com a base d’una reproducció exacta en un suport de preservació de qualitat, com ara paper permanent no àcid o paper d’arxiu. @ca
toolkit label: facsímil de preservació d’una manifestació de @ca
toolkit definition: Manifestació que s’usa com a base d’una reproducció exacta en un suport de preservació de qualitat, com ara paper permanent no àcid o paper d’arxiu. @ca
definition: Liittää manifestaation manifestaatioon, jota on käytetty täsmällisen ja arkistokelpoisen jäljennöksen pohjana. Jäljennöksen valmistuksessa on käytetty arkistokelpoista materiaalia, esim. arkistopaperia. @fi
toolkit label: säilytyskopio manifestaatiosta @fi
toolkit definition: Manifestaatio, jota on käytetty täsmällisen ja arkistokelpoisen jäljennöksen pohjana. Jäljennöksen valmistuksessa on käytetty arkistokelpoista materiaalia, esim. arkistopaperia. @fi
toolkit label: bevaringskopi av manifestasjon av @no
toolkit definition: En manifestasjon som brukes som utgangspunkt for en eksakt reproduksjon på et medium av bevaringskvalitet, for eksempel syrefritt pergament eller arkivpapir. @no
label: είναι διατήρηση του ομοιότυπου της (εκδήλωση) @el
definition: Συνδέει μια εκδήλωση με μια εκδήλωση η οποία χρησιμοποιείται ως η βάση για μια αναπαραγωγή ακριβείας σε μέσα διατήρησης της ποιότητας, όπως μόνιμο αντιόξινο ή αρχειακό χαρτί. @el
toolkit label: διατήρηση ομοιότυπου της (εκδήλωση) @el
toolkit definition: Μια εκδήλωση η οποία χρησιμοποιείται ως η βάση για μια αναπαραγωγή ακριβείας σε μέσα διατήρησης της ποιότητας, όπως μόνιμο αντιόξινο ή αρχειακό χαρτί. @el
has element type: 2
label: megőrzési hasonmása a következő megjelenési formának: @hu
definition: Hozzákapcsol egy megjelenési formát egy megjelenési formához, amelyet pontos másolat alapjaként használnak egy olyan megőrzés-minőségű médiumon, mint például a savmentes tartós vagy archiváló papír. @hu
toolkit label: megőrzési hasonmása a következő megjelenési formának: @hu
toolkit definition: Egy megjelenési forma, amelyet pontos másolat alapjaként használnak egy olyan megőrzés-minőségű médiumon, mint például a savmentes tartós vagy archiváló papír. @hu
label: säilytyskopio manifestaatiosta @fi
label: er bevaringskopi av manifestasjon av @no
definition: Relaterer en manifestasjon til en manifestasjon som brukes som utgangspunkt for en eksakt reproduksjon på et medium av bevaringskvalitet, for eksempel syrefritt pergament eller arkivpapir. @no
label: is conservatiefacsimile van manifestatie van @nl
definition: Relateert een manifestatie aan een manifestatie die gebruikt is als de basis voor een exacte reproductie op media van conserveringskwaliteit, zoals zuurvrij permanent- of archiefpapier. @nl
label: هو حفظ طبق الأصل لتجسيدة لـ @ar
definition: يربط بين تجسيدة وتجسيدة تستخدم كأساس لإعادة إنتاج طبق الأصل على وسيط حفظ عالي الجودة، مثل الأوراق الخالية من الأحماض أو أوراق المحفوظات الأرشيفية. @ar
toolkit label: حفظ طبق الأصل لتجسيدة لـ @ar
toolkit definition: تجسيدة تستخدم كأساس لإعادة إنتاج طبق الأصل على وسيط حفظ عالي الجودة، مثل الأوراق الخالية من الأحماض أو أوراق المحفوظات الأرشيفية. @ar
label: säilituskoopia kehastusest @et
definition: Seostab kehastuse kehastusega, mida on kasutatud täpse reproduktsiooni tegemiseks arhiivikvaliteediga meediumil, nt happevabal vananemiskindlal ehk arhiivipaberil. @et
toolkit label: säilituskoopia kehastusest @et
toolkit definition: Kehastus, mida on kasutatud täpse reproduktsiooni tegemiseks arhiivikvaliteediga meediumil, nt happevabal vananemiskindlal ehk arhiivipaberil. @et
label: è facsimile per la conservazione di una manifestazione di @it
definition: Correla una manifestazione a una manifestazione utilizzata come base per una riproduzione esatta su mezzi idonei alla conservazione, come la carta permanente non acida o carta da archivio. @it
toolkit label: facsimile per la conservazione di una manifestazione di @it
toolkit definition: Manifestazione utilizzata come base per una riproduzione esatta su mezzi idonei alla conservazione, come la carta permanente non acida o carta da archivio. @it
label: ir arhīvfaksimils manifestācijai @lv
definition: Sasaista manifestāciju ar manifestāciju, kas ir izmantota par pamatu precīzai redprodukcijai uz kvalitatīva nesēja, piemēram, uz skābi nesaturoša papīra vai arhīvpapīra. @lv
toolkit label: ir arhīvfaksimils manifestācijai @lv
toolkit definition: Manifestācija, kas ir izmantota par pamatu precīzai redprodukcijai uz kvalitatīva nesēja, piemēram, uz skābi nesaturoša papīra vai arhīvpapīra. @lv
label: 是……的载体表现的保存摹真品 @zh-hans
definition: 将一种载体表现与作为在诸如脱酸永久纸或档案纸等具有保存品质的媒介上的精确复制品之基础的一种载体表现关联起来。 @zh-hans
toolkit label: ……的载体表现的保存摹真品 @zh-hans
toolkit definition: 作为在诸如脱酸永久纸或档案纸等具有保存品质的媒介上的精确复制品之基础的一种载体表现 @zh-hans
label: gösteriminin koruma kopyasıdır @tr
definition: Bir gösterimi, asitsiz kalıcı veya arşiv kağıdı gibi koruma kaliteli ortamda tıpatıp yeniden üretimi için temel olarak kullanılan bir gösterim ile ilişkilendirir. @tr
toolkit label: gösteriminin koruma tıpkıbasımı @tr
toolkit definition: Asitsiz kalıcı veya arşiv kağıdı gibi koruma kaliteli ortamda tıpatıp röprodüksiyon için temel olarak kullanılan bir gösterim. @tr
label: es un facsímil de preservación de la manifestación de @es
definition: Relaciona una manifestación con una manifestación que se utiliza como base para una reproducción exacta en medios con calidad de preservación, como papel permanente sin ácido o de archivo. @es
has subproperty: P30045

has presentation format
status: Published
definition: Relates a manifestation to a format that is used in the production of a projected image.
type: Property
domain: C10007
sub property of: has projection characteristic of motion picture film
lexical alias: presentationFormat.en
instruction number: 3.17.2
toolkit label: presentation format
toolkit definition: A format that is used in the production of a projected image.
label: a pour format de projection @fr
definition: Met une manifestation en relation avec un format qui est utilisé pour la production d’une image projetée. @fr
toolkit label: format de projection @fr
toolkit definition: Format qui est utilisé pour la production d’une image projetée. @fr
toolkit label: formato de presentación @es
toolkit definition: Un formato que se utiliza en la producción de una imagen proyectada. @es
label: har filmprojektionssystem @sv
toolkit label: filmprojektionssystem @sv
toolkit label: presentatieformaat @nl
toolkit definition: Een formaat dat gebruikt is bij de productie van een geprojecteerd beeld. @nl
label: có định dạng trình bày @vi
definition: Liên kết biểu thị với định dạng được yêu cầu trong sản xuất hình ảnh chiếu. @vi
toolkit label: định dạng trình bày @vi
toolkit definition: Định dạng được yêu cầu trong sản xuất hình ảnh chiếu. @vi
label: har fremvisningsformat @da
definition: Relaterer en manifestation til et format, som er anvendt ved fremstillingen af et projiceret billede. @da
toolkit label: fremvisningsformat @da
toolkit definition: Format, som er anvendt ved fremstillingen af et projiceret billede. @da
label: hat Wiedergabeformat @de
definition: Setzt eine Manifestation in Beziehung zu einem Format, das bei der Entstehung eines projizierten Bilds verwendet wird. @de
toolkit label: Wiedergabeformat @de
toolkit definition: Ein Format, das bei der Entstehung eines projizierten Bilds verwendet wird. @de
label: té com a format de presentació @ca
definition: Relaciona una manifestació amb un format que s’usa en la producció d’una imatge projectada. @ca
toolkit label: format de presentació @ca
toolkit definition: Format que s’usa en la producció d’una imatge projectada. @ca
definition: Liittää manifestaation heijastettavan kuvan tuottamisessa käytettävään formaattiin. @fi
toolkit label: esitysformaatti @fi
toolkit definition: Heijastettavan kuvan tuottamisessa käytettävä formaatti. @fi
toolkit label: visningsformat @no
toolkit definition: Et format som brukes ved produksjon av et projisert bilde. @no
label: έχει μορφότυπο της παρουσίασης @el
definition: Συνδέει μια εκδήλωση με ένα μορφότυπο που χρησιμοποιείται στην παραγωγή μιας προβαλλόμενης εικόνας. @el
toolkit label: μορφότυπο παρουσίασης @el
toolkit definition: Ένα μορφότυπο που χρησιμοποιείται στην παραγωγή μιας προβαλλόμενης εικόνας. @el
has element type: 4
label: prezentációs formátuma a következő: @hu
definition: Hozzákapcsol egy megjelenési formát egy formátumhoz, amelyet egy kivetített kép előállításához használnak. @hu
toolkit label: prezentációs formátuma: @hu
toolkit definition: Egy formátum, amelyet egy kivetített kép előállításához használnak. @hu
label: esitysformaatti @fi
label: har visningsformat @no
definition: Relaterer en manifestasjon til et format som brukes ved produksjon av et projisert bilde. @no
label: heeft presentatieformaat @nl
definition: Relateert een manifestatie aan een formaat dat gebruikt is bij de productie van een geprojecteerd beeld. @nl
label: له شكل عرض @ar
definition: يربط بين تجسيدة وشكل مستخدم في إنتاج صورة مرئية. @ar
toolkit label: شكل عرض @ar
toolkit definition: شكل مستخدم في إنتاج صورة مرئية. @ar
label: esitusformaat @et
definition: Seostab kehastuse formaadiga, mida on kasutatud projitseeritava pildi tootmisel. @et
toolkit label: esitusformaat @et
toolkit definition: Formaat, mida on kasutatud projitseeritava pildi tootmisel. @et
label: ha come formato di presentazione @it
definition: Correla una manifestazione a un formato usato nella produzione di un'immagine proiettata. @it
toolkit label: formato di presentazione @it
toolkit definition: Formato usato nella produzione di un'immagine proiettata. @it
label: attēlošanas formāts @lv
definition: Sasaista manifestāciju ar formātu, kas lietots projicējamā attēla izgatavošanā. @lv
toolkit label: attēlošanas formāts @lv
toolkit definition: Formāts, kas lietots projicējamā attēla izgatavošanā. @lv
label: 有呈现格式 @zh-hans
definition: 将一种载体表现与用于一个投影图像制作的格式关联起来。 @zh-hans
toolkit label: 呈现格式 @zh-hans
toolkit definition: 用于一个投影图像制作的格式 @zh-hans
label: sunum formatı ile ilişkilidir @tr
definition: Bir gösterimi, yansıtılan bir görüntünün üretiminde kullanılan bir formatla ilişkilendirir. @tr
toolkit label: sunum formatı @tr
toolkit definition: Yansıtılan bir görüntünün üretiminde kullanılan bir format. @tr
label: tiene formato de presentación @es

has details of presentation format
status: Published
type: Property
lexical alias: detailsOfPresentationFormat.en
definition: Relates a manifestation to details of a format that is used in the production of a projected image.
domain: C10007
instruction number: 3.17.2.4
toolkit label: details of presentation format
toolkit definition: Details of a format that is used in the production of a projected image.
toolkit label: detalles del formato de presentación @es
toolkit definition: Detalles de un formato que se utiliza en la producción de una imagen proyectada. @es
label: har detaljerad information om filmprojektionssystem @sv
toolkit label: detaljerad information om filmprojektionssystem @sv
toolkit label: details van presentatieformaat @nl
toolkit definition: Details van een formaat gebruikt voor de productie van een geprojecteerd beeld. @nl
label: có chi tiết của định dạng trình bày @vi
definition: Liên kết biểu thị với chi tiết của định dạng được yêu cầu trong sản xuất hình ảnh chiếu. @vi
toolkit label: chi tiết của định dạng trình bày @vi
toolkit definition: Chi tiết của định dạng được yêu cầu trong sản xuất hình ảnh chiếu. @vi
label: har detaljer om fremvisningsformat @da
definition: Relaterer en manifestation til detaljer om et format, som anvendes ved fremstillingen af et projiceret billede. @da
toolkit label: detaljer om fremvisningsformat @da
toolkit definition: Detaljer om et format, som anvendes ved fremstillingen af et projiceret billede. @da
label: hat Details zum Wiedergabeformat @de
definition: Setzt eine Manifestation in Beziehung zu den Details zu dem Format, das bei der Entstehung eines projizierten Bilds verwendet wird. @de
toolkit label: Details zum Wiedergabeformat @de
toolkit definition: Details zu dem Format, das bei der Entstehung eines projizierten Bilds verwendet wird. @de
label: té com a particularitats de format de presentació @ca
definition: Relaciona una manifestació amb les particularitats d’un format que s’usa en la producció d’una imatge projectada. @ca
toolkit label: particularitats de format de presentació @ca
toolkit definition: Particularitats d’un format que s’usa en la producció d’una imatge projectada. @ca
definition: Liittää manifestaation tarkempiin tietoihin heijastettavan kuvan tuottamisessa käytettävästä formaatista. @fi
toolkit label: esitysformaatin tarkemmat tiedot @fi
toolkit definition: Tarkemmat tiedot heijastettavan kuvan tuottamisessa käytettävästä formaatista. @fi
toolkit label: detaljer vedrørende visningsformat @no
toolkit definition: Detaljer vedrørende formatet som er brukt ved produksjon av et projisert bilde. @no
label: έχει λεπτομέρειες του μορφότυπου παρουσίασης @el
definition: Συνδέει μια εκδήλωση με τις λεπτομέρειες ενός μορφότυπου που χρησιμοποιείται για την παραγωγή μιας προβαλλόμενης εκόνας. @el
toolkit label: λεπτομέρειες του μορφότυπου της παρουσίασης @el
toolkit definition: Λεπτομέρειες ενός μορφότυπου που χρησιμοποιείται για την παραγωγή μιας προβαλλόμενης εκόνας. @el
label: a pour particularités d’un format de projection @fr
definition: Met une manifestation en relation avec des particularités d’un format qui est utilisé pour la production d’une image projetée. @fr
toolkit label: particularités d’un format de projection @fr
toolkit definition: Particularités d’un format qui est utilisé pour la production d’une image projetée. @fr
has element type: 6
label: prezentációs formátum részletei a következők: @hu
definition: Hozzákapcsol egy megjelenési formát egy kivetített kép előállításánál használt formátum részleteihez. @hu
toolkit label: prezentációs formátum részletei: @hu
toolkit definition: Egy kivetített kép előállításánál használt formátum részletei. @hu
label: esitysformaatin tarkemmat tiedot @fi
label: har detaljer vedrørende visningsformat @no
definition: Relaterer en manifestasjon til detaljer vedrørende formatet som er brukt ved produksjon av et projisert bilde. @no
label: heeft details van presentatieformaat @nl
definition: Relateert een manifestatie aan details van een formaat gebruikt voor de productie van een geprojecteerd beeld. @nl
label: له تفاصيل شكل عرض @ar
definition: يربط بين تجسيدة وتفاصيل شكل مستخدم في إنتاج صورة مرئية. @ar
toolkit label: تفاصيل شكل عرض @ar
toolkit definition: تفاصيل شكل مستخدم في إنتاج صورة مرئية. @ar
label: esitusformaadi täpsustus @et
definition: Seostab kehastuse täpsemate andmetega formaadi kohta, mida on kasutatud projitseeritava pildi tootmisel. @et
toolkit label: esitusformaadi täpsustus @et
toolkit definition: Täpsemad andmed formaadi kohta, mida on kasutatud projitseeritava pildi tootmisel. @et
label: ha come particolari relativi al formato di presentazione @it
definition: Correla una manifestazione ai particolari relativi a un formato utilizzato nella produzione di un'immagine proiettata. @it
toolkit label: particolari relativi al formato di presentazione @it
toolkit definition: Particolari relativi a un formato utilizzato nella produzione di un'immagine proiettata. @it
label: detalizēti par attēlošanas formātu @lv
definition: Sasaista manifestāciju ar sīkāku informāciju par formātu projicētā attēla rādīšanai. @lv
toolkit label: detalizēti par attēlošanas formātu @lv
toolkit definition: Sīkāka informācija par formātu projicētā attēla rādīšanai. @lv
label: 有呈现格式细节 @zh-hans
definition: 将一种载体表现与用于一个投影图像制作的格式的细节关联起来。 @zh-hans
toolkit label: 呈现格式细节 @zh-hans
toolkit definition: 用于一个投影图像制作的格式的细节 @zh-hans
label: sunum formatının ayrıntıları ile ilişkilidir @tr
definition: Bir gösterimi, yansıtılan bir görüntünün üretiminde kullanılan bir formatın ayrıntılarıyla ilişkilendirir. @tr
toolkit label: sunum formatının ayrıntıları @tr
toolkit definition: Yansıtılan bir görüntünün üretiminde kullanılan formatın ayrıntıları. @tr
label: tiene detalles del formato de presentación @es
definition: Relaciona una manifestación con detalles de un formato que se utiliza en la producción de una imagen proyectada. @es

has printer agent
status: Published
definition: Relates a manifestation to an agent who is responsible for manufacturing a printed manifestation that embodies text, notated music, cartographic image, notated movement, or still image content using a device that transfers ink or a similar medium to a surface.
type: Property
domain: C10007
sub property of: has manufacturer agent
lexical alias: printerAgent.en
toolkit label: printer agent
toolkit definition: An agent who is responsible for manufacturing a printed manifestation that embodies text, notated music, cartographic image, notated movement, or still image content using a device that transfers ink or a similar medium to a surface.
label: a pour agent imprimeur @fr
definition: Met une manifestation en relation avec un agent qui est responsable de la fabrication d’une manifestation imprimée matérialisant du texte, de la musique notée, un contenu cartographique, du mouvement noté ou un contenu visuel fixe à l’aide d’un dispositif qui transfère de l’encre ou un médium semblable sur une surface. @fr
toolkit label: agent imprimeur @fr
toolkit definition: Agent qui est responsable de la fabrication d’une manifestation imprimée matérialisant du texte, de la musique notée, un contenu cartographique, du mouvement noté ou un contenu visuel fixe à l’aide d’un dispositif qui transfère de l’encre ou un médium semblable sur une surface. @fr
toolkit label: agente impresor @es
toolkit definition: Un agente que es responsable de fabricar una manifestación impresa que materializa texto, música notada, imagen cartográfica, movimiento notado o contenido de imagen fija utilizando un dispositivo que transfiere tinta o un medio similar a una superficie. @es
instruction number: 18.5
toolkit label: drukker-actor @nl
toolkit definition: Een actor die verantwoordelijk is voor het vervaardigen van een gedrukte manifestatie die omvat tekst, bladmuziek, cartografische content, bewegingsnotatie, of stilstaand beeld-content met gebruik van een apparaat dat inkt of een soortgelijk medium overbrengt op een oppervlak. @nl
label: có người in @vi
definition: Liên kết biểu thị với tác nhân có liên quan tới chế tạo biểu thị của văn bản in, âm nhạc ký hiệu, v.v..., từ chữ in hoặc khuôn in, như là sách, báo, tạp chí, biểu ngữ, bảng tổng phổ, v.v... @vi
toolkit label: người in @vi
toolkit definition: Tác nhân có liên quan tới chế tạo biểu thị của văn bản in, âm nhạc ký hiệu, v.v..., từ chữ in hoặc khuôn in, như là sách, báo, tạp chí, biểu ngữ, bảng tổng phổ, v.v... @vi
label: har agent, som er trykker @da
definition: Relaterer en manifestation til en agent, som er involveret i fremstillingen af en manifestation af trykt tekst, noteret musik etc. fra typer eller plader, såsom en bog, en avis, et magasin, et tværformat, et partitur etc. @da
toolkit label: agent, som er trykker @da
toolkit definition: Agent, som er involveret i fremstillingen af en manifestation af trykt tekst, noteret musik etc. fra typer eller plader, såsom en bog, en avis, et magasin, et tværformat, et partitur etc. @da
label: hat Druckerin/Drucker (Akteur) @de
definition: Setzt eine Manifestation in Beziehung zu einem Akteur, der für die Herstellung einer Manifestation von gedrucktem Text, Noten oder anderem Inhalt durch Drucktypen oder Druckformen verantwortlich ist. @de
toolkit label: Druckerin/Drucker (Akteur) @de
toolkit definition: Ein Akteur, der für die Herstellung einer Manifestation von gedrucktem Text, Noten oder anderem Inhalt durch Drucktypen oder Druckformen verantwortlich ist. @de
label: té com a agent impressor @ca
definition: Relaciona una manifestació amb un agent que és responsable de la fabricació d’una manifestació impresa que materialitza text, música notada, imatge cartogràfica, moviment notat o contingut d’imatge fixa usant un mecanisme que transfereix tinta o un mitjà similar a una superfície. @ca
toolkit label: agent impressor @ca
toolkit definition: Agent que és responsable de la fabricació d’una manifestació impresa que materialitza text, música notada, imatge cartogràfica, moviment notat o contingut d’imatge fixa usant un mecanisme que transfereix tinta o un mitjà similar a una superfície. @ca
definition: Liittää manifestaation toimijaan, joka on vastuussa painetun tekstin, nuottiaineiston tai muun manifestaation valmistamiseen painolaatalta tai -levyltä. @fi
toolkit label: painaja (toimija) @fi
toolkit definition: Toimija, joka osallistuu painetun tekstin, nuottiaineiston tai muun manifestaation valmistamiseen painolaatalta tai -levyltä. @fi
toolkit label: trykker (agent) @no
toolkit definition: En agent som er involvert i framstillingen av en manifestasjon av trykt tekst, nedskrevet musikk, etc., ved hjelp av typer eller plater, f.eks. en bok, en avis, et tidsskrift, en løpeseddel eller et partitur. @no
label: έχει τυπογράφο @el
definition: Συνδέει μια εκδήλωση με έναν φορέα που εμπλέκεται στην κατασκευή μιας εκδήλωσης ενός έντυπου κειμένου, μουσικής σημειογραφίας κ.λπ. από τυπογραφικά στοιχεία ή πλάκες, όπως ένα βιβλίο, εφημερίδα, περιοδικό, αφίσα, παρτιτούρα κ.λπ. @el
toolkit label: τυπογράφος @el
toolkit definition: Ένας φορέας που εμπλέκεται στην κατασκευή μιας εκδήλωσης ενός έντυπου κειμένου, μιας μουσικής σημειογραφίας κ.λπ. από τυπογραφικά στοιχεία ή πλάκες, όπως ένα βιβλίο, εφημερίδα, περιοδικό, αφίσα, παρτιτούρα κ.λπ. @el
has element type: 2
label: nyomdász ágense a következő: @hu
definition: Hozzákapcsol egy megjelenési formát egy ágenshez, amely felelős egy nyomtatott szöveg, kottázott zene vagy egyéb tartalom forrásának nyomdai szedésből vagy lemezekből történő gyártásáért. @hu
toolkit label: nyomdász ágens: @hu
toolkit definition: Egy ágens, amely felelős egy nyomtatott szöveg, kottázott zene vagy egyéb tartalom forrásának nyomdai szedésből vagy lemezekből történő gyártásáért. @hu
alternative label: printer
alternative label: kirjanpainaja @fi
label: painaja (toimija) @fi
label: har trykker (agent) @no
definition: Relaterer en manifestasjon til en agent som er involvert i framstillingen av en manifestasjon av trykt tekst, nedskrevet musikk, etc., ved hjelp av typer eller plater, f.eks. en bok, en avis, et tidsskrift, en løpeseddel eller et partitur. @no
alternative label: trykker @no
scope note: Includes the manufacture of a book, newspaper, magazine, broadside, or score.
alternative label: imprimeur @fr
label: heeft drukker-actor @nl
definition: Relateert een manifestatie aan een actor die verantwoordelijk is voor het vervaardigen van een gedrukte manifestatie die omvat tekst, bladmuziek, cartografische content, bewegingsnotatie, of stilstaand beeld-content met gebruik van een apparaat dat inkt of een soortgelijk medium overbrengt op een oppervlak. @nl
label: له وكيل طابع @ar
definition: يربط بين تجسيدة ووكيل مسئول عن صناعة تجسيدة لنص مطبوع، أو موسيقى مدونة، إلخ، من صفحة أو لوحة، مثل كتاب، أو صحيفة، أو مجلة، أو ملصق، أو نوتة موسيقيه، إلخ. @ar
alternative label: طابع @ar
toolkit label: وكيل طابع @ar
toolkit definition: وكيل مسئول عن صناعة تجسيدة لنص مطبوع، أو موسيقى مدونة، إلخ، من صفحة أو لوحة، مثل كتاب، أو صحيفة، أو مجلة، أو ملصق، أو نوتة موسيقيه، إلخ. @ar
alternative label: impressor @ca
label: trükkija (tegija) @et
definition: Seostab kehastuse tegijaga, kes osaleb trükise, noodi vms kehastuse valmistamises, trükkides trükilaolt või -plaadilt raamatuid, ajalehti, ajakirju, plakateid, partituure jms. @et
alternative label: trükkija @et
alternative label: trükikoda @et
alternative label: trükkal @et
toolkit label: trükkija (tegija) @et
toolkit definition: Tegija, kes osaleb trükise, noodi vms kehastuse valmistamises, trükkides trükilaolt või -plaadilt raamatuid, ajalehti, ajakirju, plakateid, partituure jms. @et
alternative label: Idetartozik egy könyv, hírlap, magazin, egyoldalas nyomtatvány vagy partitúra gyártója. @hu
label: ha come stampatore agente @it
definition: Correla una manifestazione all'agente coinvolto nella manifattura di una manifestazione di testo a stampa, musica notata, etc., da tipi o lastre, come un libro, giornale, rivista, foglio sciolto, partitura, etc. @it
alternative label: stampatore @it
toolkit label: stampatore agente @it
toolkit definition: Agente coinvolto nella manifattura di una manifestazione di testo a stampa, musica notata, etc., da tipi o lastre, come un libro, giornale, rivista, foglio sciolto, partitura, etc. @it
scope note: Omvat de vervaardiging van een boek, krant, tijdschrift, pamfletvel of partituur. @nl
label: iespiedējs (aģents) @lv
definition: Sasaista manifestāciju ar aģentu, kas iesaistīts iespiesta teksta, nošu u.tml. manifestāciju ražošanā no burtu salikuma vai plāksnēm. @lv
toolkit label: iespiedējs (aģents) @lv

has printer collective agent
status: Published
lexical alias: printerCollectiveAgent.en
definition: Relates a manifestation to a collective agent who is responsible for manufacturing a printed manifestation that embodies text, notated music, cartographic image, notated movement, or still image content using a device that transfers ink or a similar medium to a surface.
toolkit label: printer collective agent
toolkit definition: A collective agent who is responsible for manufacturing a printed manifestation that embodies text, notated music, cartographic image, notated movement, or still image content using a device that transfers ink or a similar medium to a surface.
type: Property
domain: C10007
has element type: 2
sub property of: has manufacturer collective agent
sub property of: has printer agent
label: painaja (yhteistoimija) @fi
definition: Liittää manifestaation yhteistoimijaan, joka on vastuussa painetun tekstin, nuottiaineiston tai muun sisällön manifestaation valmistamisesta painolaatalta tai -levyltä. @fi
toolkit label: painaja (yhteistoimija) @fi
toolkit definition: Yhteistoimija, joka on vastuussa painetun tekstin, nuottiaineiston tai muun sisällön manifestaation valmistamisesta painolaatalta tai -levyltä. @fi
label: har trykker (kollektiv agent) @no
definition: Relaterer en manifestasjon til en kollektiv agent som er involvert i framstillingen av en manifestasjon av trykt tekst, nedskrevet musikk, etc., ved hjelp av typer eller plater, f.eks. en bok, en avis, et tidsskrift, en løpeseddel eller et partitur. @no
toolkit label: trykker (kollektiv agent) @no
toolkit definition: En kollektiv agent som er involvert i framstillingen av en manifestasjon av trykt tekst, nedskrevet musikk, etc., ved hjelp av typer eller plater, f.eks. en bok, en avis, et tidsskrift, en løpeseddel eller et partitur. @no
scope note: Includes the manufacture of a book, newspaper, magazine, broadside, or score.
label: a pour agent collectif imprimeur @fr
definition: Met une manifestation en relation avec un agent collectif qui est responsable de la fabrication d’une manifestation imprimée matérialisant du texte, de la musique notée, un contenu cartographique, du mouvement noté ou un contenu visuel fixe à l’aide d’un dispositif qui transfère de l’encre ou un médium semblable sur une surface. @fr
toolkit label: agent collectif imprimeur @fr
toolkit definition: Agent collectif qui est responsable de la fabrication d’une manifestation imprimée matérialisant du texte, de la musique notée, un contenu cartographique, du mouvement noté ou un contenu visuel fixe à l’aide d’un dispositif qui transfère de l’encre ou un médium semblable sur une surface. @fr
label: heeft drukker-collectieve actor @nl
definition: Relateert een manifestatie aan een collectieve actor die verantwoordelijk is voor het vervaardigen van een gedrukte manifestatie die omvat tekst, bladmuziek, cartografische content, bewegingsnotatie, of stilstaand beeld-content met gebruik van een apparaat that inkt of een soortgelijk medium overbrengt op een oppervlak. @nl
toolkit label: drukker-collectieve actor @nl
toolkit definition: Een collectieve actor die verantwoordelijk is voor het vervaardigen van een gedrukte manifestatie die omvat tekst, bladmuziek, cartografische content, bewegingsnotatie, of stilstaand beeld-content met gebruik van een apparaat that inkt of een soortgelijk medium overbrengt op een oppervlak. @nl
label: له وكيل جماعي طابع @ar
definition: يربط بين تجسيدة ووكيل جماعي مسئول عن صناعة تجسيدة لنص مطبوع، أو موسيقى مدونة، إلخ، من صفحة أو لوحة، مثل كتاب، أو صحيفة، أو مجلة، أو ملصق، أو نوتة موسيقيه، إلخ. @ar
toolkit label: وكيل جماعي طابع @ar
toolkit definition: وكيل جماعي مسئول عن صناعة تجسيدة لنص مطبوع، أو موسيقى مدونة، إلخ، من صفحة أو لوحة، مثل كتاب، أو صحيفة، أو مجلة، أو ملصق، أو نوتة موسيقيه، إلخ. @ar
label: té com a agent col·lectiu impressor @ca
definition: Relaciona una manifestació amb un agent col·lectiu que és responsable de la fabricació d’una manifestació impresa que materialitza text, música notada, imatge cartogràfica, moviment notat o contingut d’imatge fixa usant un mecanisme que transfereix tinta o un mitjà similar a una superfície. @ca
toolkit label: agent col·lectiu impressor @ca
toolkit definition: Agent col·lectiu que és responsable de la fabricació d’una manifestació impresa que materialitza text, música notada, imatge cartogràfica, moviment notat o contingut d’imatge fixa usant un mecanisme que transfereix tinta o un mitjà similar a una superfície. @ca
label: har kollektiv agent, som er trykker @da
definition: Relaterer en manifestation til en kollektiv agent, som er involveret i fremstillingen af en manifestation af trykt tekst, noteret musik etc. fra typer eller plader, såsom en bog, en avis, et magasin, et tværformat, et partitur etc. @da
toolkit label: kollektiv agent, som er trykker @da
toolkit definition: Kollektiv agent, som er involveret i fremstillingen af en manifestation af trykt tekst, noteret musik etc. fra typer eller plader, såsom en bog, en avis, et magasin, et tværformat, et partitur etc. @da
label: trükkija (kollektiiv) @et
definition: Seostab kehastuse kollektiiviga, kes osaleb trükise, noodi vms kehastuse valmistamises, trükkides trükilaolt või -plaadilt raamatuid, ajalehti, ajakirju, plakateid, partituure jms. @et
toolkit label: trükkija (kollektiiv) @et
toolkit definition: Kollektiiv, kes osaleb trükise, noodi vms kehastuse valmistamises, trükkides trükilaolt või -plaadilt raamatuid, ajalehti, ajakirju, plakateid, partituure jms. @et
label: hat Druckerin/Drucker (Gemeinschaftlicher Akteur) @de
definition: Setzt eine Manifestation in Beziehung zu einem gemeinschaftlichen Akteur, der für die Herstellung einer Manifestation von gedrucktem Text, Noten oder anderem Inhalt durch Drucktypen oder Druckformen verantwortlich ist. @de
toolkit label: Druckerin/Drucker (Gemeinschaftlicher Akteur) @de
toolkit definition: Ein gemeinschaftlicher Akteur, der für die Herstellung einer Manifestation von gedrucktem Text, Noten oder anderem Inhalt durch Drucktypen oder Druckformen verantwortlich ist. @de
label: nyomdász kollektív ágense a következő: @hu
definition: Hozzákapcsol egy megjelenési formát egy kollektív ágenshez, amely felelős egy nyomtatott szöveg, zenei lejegyzés vagy egyéb tartalom megjelenési formájának nyomdai szedésből vagy lemezekből történő gyártásáért. @hu
toolkit label: nyomdász kollektív ágens: @hu
toolkit definition: Egy kollektív ágens, amely felelős egy nyomtatott szöveg, zenei lejegyzés vagy egyéb tartalom megjelenési formájának nyomdai szedésből vagy lemezekből történő gyártásáért. @hu
label: ha come stampatore agente collettivo @it
definition: Correla una manifestazione all'agente collettivo coinvolto nella manifattura di una manifestazione di testo a stampa, musica notata, etc., da tipi o lastre, come un libro, giornale, rivista, foglio sciolto, partitura, etc. @it
toolkit label: stampatore agente collettivo @it
toolkit definition: Agente collettivo coinvolto nella manifattura di una manifestazione di testo a stampa, musica notata, etc., da tipi o lastre, come un libro, giornale, rivista, foglio sciolto, partitura, etc. @it
scope note: Omvat de vervaardiging van een boek, krant, tijdschrift, pamfletvel of partituur. @nl
label: iespiedējs (grupa) @lv
definition: Sasaista manifestāciju ar grupu, kas iesaistīta iespiesta teksta, nošu u.tml. manifestāciju ražošanā no burtu salikuma vai plāksnēm. @lv
toolkit label: iespiedējs (grupa) @lv
toolkit definition: Grupa, kas iesaistīta iespiesta teksta, nošu u.tml. manifestāciju ražošanā no burtu salikuma vai plāksnēm. @lv
scope note: Ietver grāmatas, laikraksta, žurnāla, plakāta, vai partitūras ražošanu. @lv
scope note: Sisältää kirjan, sanomalehden, aikakauslehden, julisteen tai partituurin valmistamisen. @fi
scope note: Comprend la fabrication d’un livre, d’un journal, d’un magazine, d’un placard ou d’une partition. @fr
scope note: ويشمل صناعة كتاب، أو صحيفة، أو مجلة، أو ملصق، أو نوتة موسيقية. @ar
scope note: Omfatter produktion af en bog, avis, tidsskrift, tværformat eller partitur. @da
scope note: Darunter fällt die Herstellung eines Buchs, einer Zeitung, eines Magazins, eines Einblattdrucks oder einer Partitur. @de
scope note: Inclou la fabricació d’un llibre, un diari, un magazín, un full solt o una partitura. @ca
label: 有印刷者集体行为者 @zh-hans
definition: 将一种载体表现与负责生产用活字或平版印刷文字、乐谱或其他内容的一种载体表现的一个集体行为者关联起来。 @zh-hans
toolkit label: 印刷者集体行为者 @zh-hans
toolkit definition: 负责生产用活字或平版印刷文字、乐谱或其他内容的一种载体表现的一个集体行为者 @zh-hans
scope note: 包括图书、报纸、杂志、大张印刷品或总谱的生产。 @zh-hans
scope note: Idetartozik egy könyv, hírlap, magazin, egyoldalas nyomtatvány vagy partitúra gyártója. @hu
label: matbaacı kolektif temsilcisi ile ilişkilidir @tr
definition: Basılı metin, notalı müzik veya tip veya plakalardan diğer içeriklerin bir gösterimini üretmekten sorumlu kolektif bir temsilciye bir gösterimi ilişkilendirir. @tr
toolkit label: yazıcı kolektif temsilcisi @tr
toolkit definition: Basılı metin, notalı müzik veya tip veya plakalardan diğer içeriklerin bir gösterimini üretmekten sorumlu kolektif bir temsilci. @tr
scope note: matbaacı kolektif temsilcisi ile ilişkilidir @tr
label: tiene agente colectivo impresor @es

has printer corporate body
status: Published
lexical alias: printerCorporateBody.en
definition: Relates a manifestation to a corporate body who is responsible for manufacturing a printed manifestation that embodies text, notated music, cartographic image, notated movement, or still image content using a device that transfers ink or a similar medium to a surface.
toolkit label: printer corporate body
toolkit definition: A corporate body who is responsible for manufacturing a printed manifestation that embodies text, notated music, cartographic image, notated movement, or still image content using a device that transfers ink or a similar medium to a surface.
type: Property
domain: C10007
has element type: 2
sub property of: has manufacturer corporate body
sub property of: has printer collective agent
label: painaja (yhteisö) @fi
definition: Liittää manifestaation yhteisöön, joka on vastuussa painetun tekstin, nuottiaineiston tai muun sisällön manifestaation valmistamiseen painolaatalta tai -levyltä. @fi
toolkit label: painaja (yhteisö) @fi
toolkit definition: Yhteisö, joka on vastuussa painetun tekstin, nuottiaineiston tai muun sisällön manifestaation valmistamiseen painolaatalta tai -levyltä. @fi
label: har trykker (korporasjon) @no
definition: Relaterer en manifestasjon til en korporasjon som er involvert i framstillingen av en manifestasjon av trykt tekst, nedskrevet musikk, etc., ved hjelp av typer eller plater, f.eks. en bok, en avis, et tidsskrift, en løpeseddel eller et partitur. @no
toolkit label: trykker (korporasjon) @no
toolkit definition: En korporasjon som er involvert i framstillingen av en manifestasjon av trykt tekst, nedskrevet musikk, etc., ved hjelp av typer eller plater, f.eks. en bok, en avis, et tidsskrift, en løpeseddel eller et partitur. @no
scope note: Includes the manufacture of a book, newspaper, magazine, broadside, or score.
label: a pour collectivité imprimeuse @fr
definition: Met une manifestation en relation avec une collectivité qui est responsable de la fabrication d’une manifestation imprimée matérialisant du texte, de la musique notée, un contenu cartographique, du mouvement noté ou un contenu visuel fixe à l’aide d’un dispositif qui transfère de l’encre ou un médium semblable sur une surface. @fr
toolkit label: collectivité imprimeuse @fr
toolkit definition: Collectivité qui est responsable de la fabrication d’une manifestation imprimée matérialisant du texte, de la musique notée, un contenu cartographique, du mouvement noté ou un contenu visuel fixe à l’aide d’un dispositif qui transfère de l’encre ou un médium semblable sur une surface. @fr
label: heeft drukker-corporatie @nl
definition: Relateert een manifestatie aan een corporatie die verantwoordelijk is voor het vervaardigen van een gedrukte manifestatie die omvat tekst, bladmuziek, cartografische content, bewegingsnotatie, of stilstaand beeld-content met gebruik van een apparaat that inkt of een soortgelijk medium overbrengt op een oppervlak. @nl
toolkit label: drukker-corporatie @nl
toolkit definition: Een corporatie die verantwoordelijk is voor het vervaardigen van een gedrukte manifestatie die omvat tekst, bladmuziek, cartografische content, bewegingsnotatie, of stilstaand beeld-content met gebruik van een apparaat that inkt of een soortgelijk medium overbrengt op een oppervlak. @nl
label: له هيئة طابع @ar
definition: يربط بين تجسيدة وهيئة مسئولة عن صناعة تجسيدة لنص مطبوع، أو موسيقى مدونة، إلخ، من صفحة أو لوحة، مثل كتاب، أو صحيفة، أو مجلة، أو ملصق، أو نوتة موسيقيه، إلخ. @ar
toolkit label: هيئة طابع @ar
toolkit definition: هيئة مسئولة عن صناعة تجسيدة لنص مطبوع، أو موسيقى مدونة، إلخ، من صفحة أو لوحة، مثل كتاب، أو صحيفة، أو مجلة، أو ملصق، أو نوتة موسيقيه، إلخ. @ar
label: té com a entitat corporativa impressora @ca
definition: Relaciona una manifestació amb una entitat corporativa que és responsable de la fabricació d’una manifestació impresa que materialitza text, música notada, imatge cartogràfica, moviment notat o contingut d’imatge fixa usant un mecanisme que transfereix tinta o un mitjà similar a una superfície. @ca
toolkit label: entitat corporativa impressora @ca
toolkit definition: Entitat corporativa que és responsable de la fabricació d’una manifestació impresa que materialitza text, música notada, imatge cartogràfica, moviment notat o contingut d’imatge fixa usant un mecanisme que transfereix tinta o un mitjà similar a una superfície. @ca
label: har korporation, som er trykker @da
definition: Relaterer en manifestation til en korporation, som er involveret i fremstillingen af en manifestation af trykt tekst, noteret musik etc. fra typer eller plader, såsom en bog, en avis, et magasin, et tværformat, et partitur etc. @da
toolkit label: korporation, som er trykker @da
toolkit definition: Korporation, som er involveret i fremstillingen af en manifestation af trykt tekst, noteret musik etc. fra typer eller plader, såsom en bog, en avis, et magasin, et tværformat, et partitur etc. @da
label: trükkija (asutus) @et
definition: Seostab kehastuse asutusega, kes osaleb trükise, noodi vms kehastuse valmistamises, trükkides trükilaolt või -plaadilt raamatuid, ajalehti, ajakirju, plakateid, partituure jms. @et
toolkit label: trükkija (asutus) @et
toolkit definition: Asutus, kes osaleb trükise, noodi vms kehastuse valmistamises, trükkides trükilaolt või -plaadilt raamatuid, ajalehti, ajakirju, plakateid, partituure jms. @et
label: hat Druckerin/Drucker (Körperschaft) @de
definition: Setzt eine Manifestation in Beziehung zu einer Körperschaft, die für die Herstellung einer Manifestation von gedrucktem Text, Noten oder anderem Inhalt durch Drucktypen oder Druckformen verantwortlich ist. @de
toolkit label: Druckerin/Drucker (Körperschaft) @de
toolkit definition: Eine Körperschaft, die für die Herstellung einer Manifestation von gedrucktem Text, Noten oder anderem Inhalt durch Drucktypen oder Druckformen verantwortlich ist. @de
label: nyomdász testülete a következő: @hu
definition: Hozzákapcsol egy megjelenési formát egy testülethez, amely felelős egy nyomtatott szöveg, zenei lejegyzés vagy egyéb tartalom megjelenési formájának nyomdai szedésből vagy lemezekből történő gyártásáért. @hu
toolkit label: nyomdász testület: @hu
toolkit definition: Egy testület, amely felelős egy nyomtatott szöveg, zenei lejegyzés vagy egyéb tartalom megjelenési formájának nyomdai szedésből vagy lemezekből történő gyártásáért. @hu
label: ha come stampatore ente @it
definition: Correla una manifestazione all'ente coinvolto nella manifattura di una manifestazione di testo a stampa, musica notata, etc., da tipi o lastre, come un libro, giornale, rivista, foglio sciolto, partitura, etc. @it
toolkit label: stampatore ente @it
toolkit definition: Ente coinvolto nella manifattura di una manifestazione di testo a stampa, musica notata, etc., da tipi o lastre, come un libro, giornale, rivista, foglio sciolto, partitura, etc. @it
scope note: Omvat de vervaardiging van een boek, krant, tijdschrift, pamfletvel of partituur. @nl
label: iespiedējs (institūcija) @lv
definition: Sasaista manifestāciju ar institūciju, kas iesaistīta iespiesta teksta, nošu u.tml. manifestāciju ražošanā no burtu salikuma vai plāksnēm. @lv
toolkit label: iespiedējs (institūcija) @lv
toolkit definition: Institūcija, kas iesaistīta iespiesta teksta, nošu u.tml. manifestāciju ražošanā no burtu salikuma vai plāksnēm. @lv
scope note: Ietver grāmatas, laikraksta, žurnāla, plakāta, vai partitūras ražošanu. @lv
scope note: Sisältää kirjan, sanomalehden, aikakauslehden, julisteen tai partituurin valmistamisen. @fi
scope note: Comprend la fabrication d’un livre, d’un journal, d’un magazine, d’un placard ou d’une partition. @fr
scope note: ويشمل صناعة كتاب، أو صحيفة، أو مجلة، أو ملصق، أو نوتة موسيقية. @ar
scope note: Omfatter produktion af en bog, avis, tidsskrift, tværformat eller partitur. @da
scope note: Darunter fällt die Herstellung eines Buchs, einer Zeitung, eines Magazins, eines Einblattdrucks oder einer Partitur. @de
scope note: Inclou la fabricació d’un llibre, un diari, un magazín, un full solt o una partitura. @ca
label: 有印刷者团体 @zh-hans
definition: 将一种载体表现与负责生产用活字或平版印刷文字、乐谱或其他内容的一种载体表现的一个团体关联起来。 @zh-hans
toolkit label: 印刷者团体 @zh-hans
toolkit definition: 负责生产用活字或平版印刷文字、乐谱或其他内容的一种载体表现的一个团体 @zh-hans
scope note: 包括图书、报纸、杂志、大张印刷品或总谱的生产。 @zh-hans
scope note: Idetartozik egy könyv, hírlap, magazin, egyoldalas nyomtatvány vagy partitúra gyártója. @hu
label: matbaacı tüzel kişisi ile ilişkilidir @tr
definition: Bir gösterimi, basılı metin, notalı müzik plaka ya da diğer türlerden olan içeriğin bir gösterimi üretmekten sorumlu olan tüzel kişilikle ilişkilendirir. @tr
toolkit label: Yazıcı tüzel kişi @tr
toolkit definition: Basılı metin, notalı müzik veya daktilo veya plakalardan diğer içeriklerin bir gösterimini üretmekten sorumlu bir tüzel kişi. @tr
scope note: matbaacı tüzel kişisi ile ilişkilidir @tr
label: tiene cuerpo corporativo impresor @es

has printer family
status: Published
lexical alias: printerFamily.en
definition: Relates a manifestation to a family who is responsible for manufacturing a printed manifestation that embodies text, notated music, cartographic image, notated movement, or still image content using a device that transfers ink or a similar medium to a surface.
toolkit label: printer family
toolkit definition: A family who is responsible for manufacturing a printed manifestation that embodies text, notated music, cartographic image, notated movement, or still image content using a device that transfers ink or a similar medium to a surface.
type: Property
domain: C10007
has element type: 2
sub property of: has manufacturer family
sub property of: has printer collective agent
label: painaja (suku) @fi
definition: Liittää manifestaation sukuun, joka on vastuussa painetun tekstin, nuottiaineiston tai muun sisällön manifestaation valmistamiseen painolaatalta tai -levyltä. @fi
toolkit label: painaja (suku) @fi
toolkit definition: Suku, joka on vastuussa painetun tekstin, nuottiaineiston tai muun sisällön manifestaation valmistamiseen painolaatalta tai -levyltä. @fi
label: har trykker (familie) @no
definition: Relaterer en manifestasjon til en familie som er involvert i framstillingen av en manifestasjon av trykt tekst, nedskrevet musikk, etc., ved hjelp av typer eller plater, f.eks. en bok, en avis, et tidsskrift, en løpeseddel eller et partitur. @no
toolkit label: trykker (familie) @no
toolkit definition: En familie som er involvert i framstillingen av en manifestasjon av trykt tekst, nedskrevet musikk, etc., ved hjelp av typer eller plater, f.eks. en bok, en avis, et tidsskrift, en løpeseddel eller et partitur. @no
scope note: Includes the manufacture of a book, newspaper, magazine, broadside, or score.
label: a pour famille imprimeuse @fr
definition: Met une manifestation en relation avec une famille qui est responsable de la fabrication d’une manifestation imprimée matérialisant du texte, de la musique notée, un contenu cartographique, du mouvement noté ou un contenu visuel fixe à l’aide d’un dispositif qui transfère de l’encre ou un médium semblable sur une surface. @fr
toolkit label: famille imprimeuse @fr
toolkit definition: Famille qui est responsable de la fabrication d’une manifestation imprimée matérialisant du texte, de la musique notée, un contenu cartographique, du mouvement noté ou un contenu visuel fixe à l’aide d’un dispositif qui transfère de l’encre ou un médium semblable sur une surface. @fr
label: heeft drukker-familie @nl
definition: Relateert een manifestatie aan een familie die verantwoordelijk is voor het vervaardigen van een gedrukte manifestatie die omvat tekst, bladmuziek, cartografische content, bewegingsnotatie, of stilstaand beeld-content met gebruik van een apparaat that inkt of een soortgelijk medium overbrengt op een oppervlak. @nl
toolkit label: drukker-familie @nl
toolkit definition: Een familie die verantwoordelijk is voor het vervaardigen van een gedrukte manifestatie die omvat tekst, bladmuziek, cartografische content, bewegingsnotatie, of stilstaand beeld-content met gebruik van een apparaat that inkt of een soortgelijk medium overbrengt op een oppervlak. @nl
label: له عائلة طابع @ar
definition: يربط بين تجسيدة وعائلة مسئولة عن صناعة تجسيدة لنص مطبوع، أو موسيقى مدونة، إلخ، من صفحة أو لوحة، مثل كتاب، أو صحيفة، أو مجلة، أو ملصق، أو نوتة موسيقيه، إلخ. @ar
toolkit label: عائلة طابع @ar
toolkit definition: عائلة مسئولة عن صناعة تجسيدة لنص مطبوع، أو موسيقى مدونة، إلخ، من صفحة أو لوحة، مثل كتاب، أو صحيفة، أو مجلة، أو ملصق، أو نوتة موسيقيه، إلخ. @ar
label: té com a família impressora @ca
definition: Relaciona una manifestació amb una família que és responsable de la fabricació d’una manifestació impresa que materialitza text, música notada, imatge cartogràfica, moviment notat o contingut d’imatge fixa usant un mecanisme que transfereix tinta o un mitjà similar a una superfície. @ca
toolkit label: família impressora @ca
toolkit definition: Família que és responsable de la fabricació d’una manifestació impresa que materialitza text, música notada, imatge cartogràfica, moviment notat o contingut d’imatge fixa usant un mecanisme que transfereix tinta o un mitjà similar a una superfície. @ca
label: har familie, som er trykker @da
definition: Relaterer en manifestation til en familie, som er involveret i fremstillingen af en manifestation af trykt tekst, noteret musik etc. fra typer eller plader, såsom en bog, en avis, et magasin, et tværformat, et partitur etc. @da
toolkit label: familie, som er trykker @da
toolkit definition: Familie, som er involveret i fremstillingen af en manifestation af trykt tekst, noteret musik etc. fra typer eller plader, såsom en bog, en avis, et magasin, et tværformat, et partitur etc. @da
label: trükkija (perekond) @et
definition: Seostab kehastuse perekonnaga, kes osaleb trükise, noodi vms kehastuse valmistamisel, trükkides trükilaolt või -plaadilt raamatuid, ajalehti, ajakirju, plakateid, partituure jms. @et
toolkit label: trükkija (perekond) @et
toolkit definition: Perekond, kes osaleb trükise, noodi vms kehastuse valmistamisel, trükkides trükilaolt või -plaadilt raamatuid, ajalehti, ajakirju, plakateid, partituure jms. @et
label: hat Druckerin/Drucker (Familie) @de
definition: Setzt eine Manifestation in Beziehung zu einer Familie, die für die Herstellung einer Manifestation von gedrucktem Text, Noten oder anderem Inhalt durch Drucktypen oder Druckformen verantwortlich ist. @de
toolkit label: Druckerin/Drucker (Familie) @de
toolkit definition: Eine Familie, die für die Herstellung einer Manifestation von gedrucktem Text, Noten oder anderem Inhalt durch Drucktypen oder Druckformen verantwortlich ist. @de
label: nyomdász családja a következő: @hu
definition: Hozzákapcsol egy megjelenési formát egy családhoz, amely felelős egy nyomtatott szöveg, zenei lejegyzés vagy egyéb tartalom megjelenési formájának nyomdai szedésből vagy lemezekből történő gyártásáért. @hu
toolkit label: nyomdász család: @hu
toolkit definition: Egy család, amely felelős egy nyomtatott szöveg, zenei lejegyzés vagy egyéb tartalom megjelenési formájának nyomdai szedésből vagy lemezekből történő gyártásáért. @hu
label: ha come stampatore famiglia @it
definition: Correla una manifestazione alla famiglia coinvolta nella manifattura di una manifestazione di testo a stampa, musica notata, etc., da tipi o lastre, come un libro, un giornale, una rivista, un volantino, una partitura, etc. @it
toolkit label: stampatore famiglia @it
toolkit definition: Famiglia coinvolta nella manifattura di una manifestazione di testo a stampa, musica notata, etc., da tipi o lastre, come un libro, un giornale, una rivista, un volantino, una partitura, etc. @it
scope note: Omvat de vervaardiging van een boek, krant, tijdschrift, pamfletvel of partituur. @nl
label: iespiedējs (dzimta/ģimene) @lv
definition: Sasaista manifestāciju ar dzimtu/ģimeni, kas iesaistīta iespiesta teksta, nošu u.tml. manifestāciju ražošanā no burtu salikuma vai plāksnēm. @lv
toolkit label: iespiedējs (dzimta/ģimene) @lv
toolkit definition: Dzimta/ģimene, kas iesaistīta iespiesta teksta, nošu u.tml. manifestāciju ražošanā no burtu salikuma vai plāksnēm. @lv
scope note: Ietver grāmatas, laikraksta, žurnāla, plakāta, vai partitūras ražošanu. @lv
scope note: Sisältää kirjan, sanomalehden, aikakauslehden, julisteen tai partituurin valmistamisen. @fi
scope note: Comprend la fabrication d’un livre, d’un journal, d’un magazine, d’un placard ou d’une partition. @fr
scope note: ويشمل صناعة كتاب، أو صحيفة، أو مجلة، أو ملصق، أو نوتة موسيقية. @ar
scope note: Omfatter produktion af en bog, avis, tidsskrift, tværformat eller partitur. @da
scope note: Darunter fällt die Herstellung eines Buchs, einer Zeitung, eines Magazins, eines Einblattdrucks oder einer Partitur. @de
scope note: Inclou la fabricació d’un llibre, un diari, un magazín, un full solt o una partitura. @ca
label: 有印刷者家族 @zh-hans
definition: 将一种载体表现与负责生产用活字或平版印刷文字、乐谱或其他内容的一种载体表现的一个家族关联起来。 @zh-hans
toolkit label: 印刷者家族 @zh-hans
toolkit definition: 负责生产用活字或平版印刷文字、乐谱或其他内容的一种载体表现的一个家族 @zh-hans
scope note: 包括图书、报纸、杂志、大张印刷品或总谱的生产。 @zh-hans
scope note: Idetartozik egy könyv, hírlap, magazin, egyoldalas nyomtatvány vagy partitúra gyártója. @hu
label: matbaacı ailesi ile ilişkilidir @tr
definition: Bir gösterimi; basılmış metin, notalı müzik veya türden ya da plakadan alınmış diğer içeriklerin üretiminden sorumlu aileyle ilişkilendirir. @tr
toolkit label: Yazıcı aile @tr
toolkit definition: Basılmış metin, notalı müzik veya türden ya da plakadan alınmış diğer içeriklerin üretiminden sorumlu aile. @tr
scope note: matbaacı ailesi ile ilişkilidir @tr
label: tiene familia impresora @es

has printer person
status: Published
lexical alias: printerPerson.en
definition: Relates a manifestation to a person who is responsible for manufacturing a printed manifestation that embodies text, notated music, cartographic image, notated movement, or still image content using a device that transfers ink or a similar medium to a surface.
toolkit label: printer person
toolkit definition: A person who is responsible for manufacturing a printed manifestation that embodies text, notated music, cartographic image, notated movement, or still image content using a device that transfers ink or a similar medium to a surface.
type: Property
domain: C10007
has element type: 2
sub property of: has manufacturer person
sub property of: has printer agent
label: painaja (henkilö) @fi
definition: Liittää manifestaation henkilöön, joka on vastuussa painetun tekstin, nuottiaineiston tai muun sisällön manifestaation valmistamisesta painolaatalta tai -levyltä. @fi
toolkit label: painaja (henkilö) @fi
toolkit definition: Henkilö, joka on vastuussa painetun tekstin, nuottiaineiston tai muun sisällön manifestaation valmistamisesta painolaatalta tai -levyltä. @fi
label: har trykker (person) @no
definition: Relaterer en manifestasjon til en person som er involvert i framstillingen av en manifestasjon av trykt tekst, nedskrevet musikk, etc., ved hjelp av typer eller plater, f.eks. en bok, en avis, et tidsskrift, en løpeseddel eller et partitur. @no
toolkit label: trykker (person) @no
toolkit definition: En person som er involvert i framstillingen av en manifestasjon av trykt tekst, nedskrevet musikk, etc., ved hjelp av typer eller plater, f.eks. en bok, en avis, et tidsskrift, en løpeseddel eller et partitur. @no
scope note: Includes the manufacture of a book, newspaper, magazine, broadside, or score.
label: a pour personne imprimeuse @fr
definition: Met une manifestation en relation avec une personne qui est responsable de la fabrication d’une manifestation imprimée matérialisant du texte, de la musique notée, un contenu cartographique, du mouvement noté ou un contenu visuel fixe à l’aide d’un dispositif qui transfère de l’encre ou un médium semblable sur une surface. @fr
toolkit label: personne imprimeuse @fr
toolkit definition: Personne qui est responsable de la fabrication d’une manifestation imprimée matérialisant du texte, de la musique notée, un contenu cartographique, du mouvement noté ou un contenu visuel fixe à l’aide d’un dispositif qui transfère de l’encre ou un médium semblable sur une surface. @fr
label: heeft drukker-persoon @nl
definition: Relateert een manifestatie aan een persoon die verantwoordelijk is voor het vervaardigen van een gedrukte manifestatie die omvat tekst, bladmuziek, cartografische content, bewegingsnotatie, of stilstaand beeld-content met gebruik van een apparaat that inkt of een soortgelijk medium overbrengt op een oppervlak. @nl
toolkit label: drukker-persoon @nl
toolkit definition: Een persoon die verantwoordelijk is voor het vervaardigen van een gedrukte manifestatie die omvat tekst, bladmuziek, cartografische content, bewegingsnotatie, of stilstaand beeld-content met gebruik van een apparaat that inkt of een soortgelijk medium overbrengt op een oppervlak. @nl
label: له شخص طابع @ar
definition: يربط بين تجسيدة وشخص مسئول عن صناعة تجسيدة لنص مطبوع، أو موسيقى مدونة، إلخ، من صفحة أو لوحة، مثل كتاب، أو صحيفة، أو مجلة، أو ملصق، أو نوتة موسيقيه، إلخ. @ar
toolkit label: شخص طابع @ar
toolkit definition: شخص مسئول عن صناعة تجسيدة لنص مطبوع، أو موسيقى مدونة، إلخ، من صفحة أو لوحة، مثل كتاب، أو صحيفة، أو مجلة، أو ملصق، أو نوتة موسيقيه، إلخ. @ar
label: té com a persona impressora @ca
definition: Relaciona una manifestació amb una persona que és responsable de la fabricació d’una manifestació impresa que materialitza text, música notada, imatge cartogràfica, moviment notat o contingut d’imatge fixa usant un mecanisme que transfereix tinta o un mitjà similar a una superfície. @ca
toolkit label: persona impressora @ca
toolkit definition: Persona que és responsable de la fabricació d’una manifestació impresa que materialitza text, música notada, imatge cartogràfica, moviment notat o contingut d’imatge fixa usant un mecanisme que transfereix tinta o un mitjà similar a una superfície. @ca
label: har person, som er trykker @da
definition: Relaterer en manifestation til en person, som er involveret i fremstillingen af en manifestation af trykt tekst, noteret musik etc. fra typer eller plader, såsom en bog, en avis, et magasin, et tværformat, et partitur etc. @da
toolkit label: person, som er trykker @da
toolkit definition: Person, som er involveret i fremstillingen af en manifestation af trykt tekst, noteret musik etc. fra typer eller plader, såsom en bog, en avis, et magasin, et tværformat, et partitur etc. @da
label: trükkija (isik) @et
definition: Seostab kehastuse isikuga, kes osaleb trükise, noodi vms kehastuse valmistamises, trükkides trükilaolt või -plaadilt raamatuid, ajalehti, ajakirju, plakateid, partituure jms. @et
toolkit label: trükkija (isik) @et
toolkit definition: Isik, kes osaleb trükise, noodi vms kehastuse valmistamises, trükkides trükilaolt või -plaadilt raamatuid, ajalehti, ajakirju, plakateid, partituure jms. @et
label: hat Druckerin/Drucker (Person) @de
definition: Setzt eine Manifestation in Beziehung zu einer Person, die für die Herstellung einer Manifestation von gedrucktem Text, Noten oder anderem Inhalt durch Drucktypen oder Druckformen verantwortlich ist. @de
toolkit label: Druckerin/Drucker (Person) @de
toolkit definition: Eine Person, die für die Herstellung einer Manifestation von gedrucktem Text, Noten oder anderem Inhalt durch Drucktypen oder Druckformen verantwortlich ist. @de
label: nyomdász személye a következő: @hu
definition: Hozzákapcsol egy megjelenési formát egy személyhez, aki felelős egy nyomtatott szöveg, kottázott zene vagy egyéb tartalom megjelenési formájának nyomdai szedésből vagy lemezekből történő gyártásáért. @hu
toolkit label: nyomdász személy: @hu
toolkit definition: Egy személy, aki felelős egy nyomtatott szöveg, kottázott zene vagy egyéb tartalom megjelenési formájának nyomdai szedésből vagy lemezekből történő gyártásáért. @hu
label: ha come stampatore persona @it
definition: Correla una manifestazione alla persona coinvolta nella manifattura di una manifestazione di testo a stampa, musica notata, etc., da tipi o lastre, come un libro, un giornale, una rivista, un foglio sciolto, una partitura, etc. @it
toolkit label: stampatore persona @it
toolkit definition: Persona coinvolta nella manifattura di una manifestazione di testo a stampa, musica notata, etc., da tipi o lastre, come un libro, un giornale, una rivista, un foglio sciolto, una partitura, etc. @it
scope note: Omvat de vervaardiging van een boek, krant, tijdschrift, pamfletvel of partituur. @nl
label: iespiedējs (persona) @lv
definition: Sasaista manifestāciju ar personu, kura iesaistīta iespiesta teksta, nošu u.tml. manifestāciju ražošanā no burtu salikuma vai plāksnēm. @lv
toolkit label: iespiedējs (persona) @lv
toolkit definition: Persona, kura iesaistīta iespiesta teksta, nošu u.tml. manifestāciju ražošanā no burtu salikuma vai plāksnēm. @lv
scope note: Ietver grāmatas, laikraksta, žurnāla, plakāta, vai partitūras ražošanu. @lv
scope note: Sisältää kirjan, sanomalehden, aikakauslehden, julisteen tai partituurin valmistuksen. @fi
scope note: Comprend la fabrication d’un livre, d’un journal, d’un magazine, d’un placard ou d’une partition. @fr
scope note: ويشمل صناعة كتاب، أو صحيفة، أو مجلة، أو ملصق، أو نوتة موسيقية. @ar
scope note: Omfatter produktion af en bog, avis, tidsskrift, tværformat eller partitur. @da
scope note: Darunter fällt die Herstellung eines Buchs, einer Zeitung, eines Magazins, eines Einblattdrucks oder einer Partitur. @de
scope note: Inclou la fabricació d’un llibre, un diari, un magazín, un full solt o una partitura. @ca
label: 有印刷者个人 @zh-hans
definition: 将一种载体表现与负责生产用活字或平版印刷文字、乐谱或其他内容的一种载体表现的一个个人关联起来。 @zh-hans
toolkit label: 印刷者个人 @zh-hans
toolkit definition: 负责生产用活字或平版印刷文字、乐谱或其他内容的一种载体表现的一个个人 @zh-hans
scope note: 包括图书、报纸、杂志、大张印刷品或总谱的生产 @zh-hans
scope note: Idetartozik egy könyv, hírlap, magazin, egyoldalas nyomtatvány vagy partitúra gyártója. @hu
label: matbaacı kişisi ile ilişkilidir @tr
definition: Bir gösterimi, basılı metin, notalı müzik veya plakalardan diğer içeriklerin bir gösterimi üretmekten sorumlu bir kişiyle ilişkilendirir. @tr
toolkit label: yazıcı @tr
toolkit definition: Basılı metin, notalı müzik veya diğer içeriklerin kalıp veya dizgi kullanılarak bir gösteriminin üretiminden sorumlu olan kişi. @tr
scope note: matbaacı kişisi ile ilişkilidir @tr
label: tiene persona impresora @es

has printmaker agent
status: Published
definition: Relates a manifestation to an agent who is responsible for creating a manifestation by making a relief, intaglio, or planographic printing surface.
type: Property
domain: C10007
toolkit label: printmaker agent
toolkit definition: An agent who is responsible for creating a manifestation by making a relief, intaglio, or planographic printing surface.
label: a pour agent graveur d’estampe @fr
definition: Met une manifestation en relation avec un agent qui est responsable de la création d’une manifestation en préparant un élément d’impression en relief, en creux ou planographique. @fr
toolkit label: agent graveur d’estampe @fr
toolkit definition: Agent qui est responsable de la création d’une manifestation en préparant un élément d’impression en relief, en creux ou planographique. @fr
toolkit label: agente impresor @es
toolkit definition: Un agente que se encarga de crear una manifestación mediante la realización de una superficie de impresión en relieve, calcografía o planográfica. @es
instruction number: 18.5
toolkit label: prentmaker-actor @nl
toolkit definition: Een actor die verantwoordelijk is voor het creëren van een manifestatie middels het vervaardigen van een hoogdruk, diepdruk of vlakdruk oppervlak. @nl
label: có người tạo bản in @vi
definition: Liên kết biểu thị với tác nhân có liên quan tới chế tạo biểu thị theo trách nhiệm tạo hình đắp nổi, hình chạm chìm, hoặc mặt in phẳng. @vi
toolkit label: người tạo bản in @vi
toolkit definition: Tác nhân có liên quan tới chế tạo biểu thị theo trách nhiệm tạo hình đắp nổi, hình chạm chìm, hoặc mặt in phẳng. @vi
label: har agent, som er grafiker @da
definition: Relaterer en manifestation til en agent, som er involveret i fremstillingen af en manifestation ved at lave en relief-, dybtryks- eller fladtryksoverflade. @da
toolkit label: agent, som er grafiker @da
toolkit definition: Agent, som er involveret i fremstillingen af en manifestation ved at lave en relief-, dybtryks- eller fladtryksoverflade. @da
label: hat Druckgrafikerin/Druckgrafiker (Akteur) @de
definition: Setzt eine Manifestation in Beziehung zu einem Akteur, der für die Herstellung einer Manifestation verantwortlich ist, indem er eine Hochdruck-, Tiefdruck- oder Flachdruckoberfläche erstellt. @de
toolkit label: Druckgrafikerin/Druckgrafiker (Akteur) @de
toolkit definition: Ein Akteur, der für die Herstellung einer Manifestation verantwortlich ist, indem er eine Hochdruck-, Tiefdruck- oder Flachdruckoberfläche erstellt. @de
label: té com a agent gravador d’estampes @ca
definition: Relaciona una manifestació amb un agent que és responsable de la creació d’una manifestació fent una superfície d’impressió en relleu, gravada en profunditat o planogràfica. @ca
toolkit label: agent gravador d’estampes @ca
toolkit definition: Agent que és responsable de la creació d’una manifestació fent una superfície d’impressió en relleu, gravada en profunditat o planogràfica. @ca
definition: Liittää manifestaation toimijaan, joka osallistuu manifestaation valmistamiseen valmistamalla kohokuvan, syväpainon tai laakapainon painopinnan. @fi
toolkit label: kuvalaatan valmistaja (toimija) @fi
toolkit definition: Toimija, joka osallistuu manifestaation valmistamiseen valmistamalla kohokuvan, syväpainon tai laakapainon painopinnan. @fi
toolkit label: grafiker (agent) @no
toolkit definition: En agent som er involvert i framstillingen av en manifestasjon ved å lage en overflate for relieff-, intaglio- eller plantrykk. @no
label: έχει χαράκτη @el
definition: Συνδέει μια εκδήλωση με έναν φορέα που εμπλέκεται στην κατασκευή μιας εκδήλωσης δημιουργώντας μια ανάγλυφη επιφάνεια εκτύπωσης, μια βαθυτυπία ή μια επιπεδοτυπία. @el
toolkit label: χαράκτης @el
toolkit definition: Ένας φορέας που εμπλέκεται στην κατασκευή μιας εκδήλωσης δημιουργώντας μια ανάγλυφη επιφάνεια εκτύπωσης, μια βαθυτυπία ή μια επιπεδοτυπία. @el
has element type: 2
label: nyomtatványkészítő ágense a következő: @hu
definition: Hozzákapcsol egy megjelenési formát egy ágenshez, amely felelős egy megjelenési forma gyártásáért oly módon, hogy egy domború, mélynyomásos (intaglio) vagy síknyomásos felületet készít. @hu
toolkit label: nyomtatványkészítő ágens: @hu
toolkit definition: Egy ágens, amely felelős egy megjelenési forma gyártásáért oly módon, hogy egy domború, mélynyomásos (intaglio) vagy síknyomásos felületet készít. @hu
alternative label: printmaker
alternative label: kuvalaatan valmistaja @fi
label: kuvalaatan valmistaja (toimija) @fi
label: har grafiker (agent) @no
definition: Relaterer en manifestasjon til en agent som er involvert i framstillingen av en manifestasjon ved å lage en overflate for relieff-, intaglio- eller plantrykk. @no
alternative label: grafiker @no
alternative label: graveur d’estampe @fr
label: heeft prentmaker-actor @nl
definition: Relateert een manifestatie aan een actor die verantwoordelijk is voor het creëren van een manifestatie middels het vervaardigen van een hoogdruk, diepdruk of vlakdruk oppervlak. @nl
label: له وكيل طباع @ar
definition: يربط بين تجسيدة ووكيل مسئول عن تصنيع تجسيدة بإعداد الأسطح المستخدمة في الطباعة من خلال سطح طباعة بارز، أو غائر، أو مستوي. @ar
alternative label: طباع @ar
toolkit label: وكيل طباع @ar
toolkit definition: وكيل مسئول عن تصنيع تجسيدة بإعداد الأسطح المستخدمة في الطباعة من خلال سطح طباعة بارز، أو غائر، أو مستوي @ar
alternative label: gravador d’estampes @ca
label: graafika trükkija (tegija) @et
definition: Seostab kehastuse tegijaga, kes osaleb kehastuse valmistamises, tehes kõrgtrüki, sügavtrüki või lametrüki teel tõmmiseid. @et
alternative label: graafika trükkija @et
toolkit label: graafika trükkija (tegija) @et
toolkit definition: Tegija, kes osaleb kehastuse valmistamises, tehes kõrgtrüki, sügavtrüki või lametrüki teel tõmmiseid. @et
alternative label: nyomtatványkészítő: @hu
label: ha come preparatore di stampe agente @it
definition: Correla una manifestazione all'agente coinvolto nella manifattura di una manifestazione tramite la realizzazione di una superficie di stampa in rilievo, a intaglio o planografica. @it
alternative label: preparatore di stampe @it
toolkit label: preparatore di stampe agente @it
toolkit definition: Agente coinvolto nella manifattura di una manifestazione tramite la realizzazione di una superficie di stampa in rilievo, a intaglio o planografica. @it
label: gravīru meistars (aģents) @lv
definition: Sasaista manifestāciju ar aģentu, kas iesaistīts manifestācijas ražošanā, veidojot reljefa, dobspiedes vai gludspieduma drukāšanas virsmu. @lv
toolkit label: gravīru meistars (aģents) @lv
toolkit definition: Aģents, kas iesaistīts manifestācijas ražošanā, veidojot reljefa, dobspiedes vai gludspieduma drukāšanas virsmu. @lv
sub property of: has creator agent of manifestation
lexical alias: printmakerAgent.en
alternative label: Druckgrafiker @de
alternative label: 印版制作者 @zh-hans
toolkit label: 印版制作者行为者 @zh-hans

has printmaker collective agent
status: Published
definition: Relates a manifestation to a collective agent who is responsible for creating a manifestation by making a relief, intaglio, or planographic printing surface.
toolkit label: printmaker collective agent
toolkit definition: A collective agent who is responsible for creating a manifestation by making a relief, intaglio, or planographic printing surface.
type: Property
domain: C10007
has element type: 2
label: kuvalaatan valmistaja (yhteistoimija) @fi
definition: Liittää manifestaation yhteistoimijaan, joka on vastuussa manifestaation valmistamisesta valmistamalla kohokuvan, syväpainon tai laakapainon painopinnan. @fi
toolkit label: kuvalaatan valmistaja (yhteistoimija) @fi
toolkit definition: Yhteistoimija, joka on vastuussa manifestaation valmistamisesta valmistamalla kohokuvan, syväpainon tai laakapainon painopinnan. @fi
label: har grafiker (kollektiv agent) @no
definition: Relaterer en manifestasjon til en kollektiv agent som er involvert i framstillingen av en manifestasjon ved å lage en overflate for relieff-, intaglio- eller plantrykk. @no
toolkit label: grafiker (kollektiv agent) @no
toolkit definition: En kollektiv agent som er involvert i framstillingen av en manifestasjon ved å lage en overflate for relieff-, intaglio- eller plantrykk. @no
label: a pour agent collectif graveur d’estampe @fr
definition: Met une manifestation en relation avec un agent collectif qui est responsable de la création d’une manifestation en préparant un élément d’impression en relief, en creux ou planographique. @fr
toolkit label: agent collectif graveur d’estampe @fr
toolkit definition: Agent collectif qui est responsable de la création d’une manifestation en préparant un élément d’impression en relief, en creux ou planographique. @fr
label: heeft prentmaker-collectieve actor @nl
definition: Relateert een manifestatie aan een collectieve actor die verantwoordelijk is voor het creëren van een manifestatie middels het vervaardigen van een hoogdruk, diepdruk of vlakdruk oppervlak. @nl
toolkit label: prentmaker-collectieve actor @nl
toolkit definition: Een collectieve actor die verantwoordelijk is voor het creëren van een manifestatie middels het vervaardigen van een hoogdruk, diepdruk of vlakdruk oppervlak. @nl
label: له وكيل جماعي طباع @ar
definition: يربط بين تجسيدة ووكيل جماعي مسئول عن تصنيع تجسيدة بإعداد الأسطح المستخدمة في الطباعة من خلال سطح طباعة بارز، أو غائر، أو مستوي @ar
toolkit label: وكيل جماعي طباع @ar
toolkit definition: وكيل جماعي مسئول عن تصنيع تجسيدة بإعداد الأسطح المستخدمة في الطباعة من خلال سطح طباعة بارز، أو غائر، أو مستوي @ar
label: té com a agent col·lectiu gravador d’estampes @ca
definition: Relaciona una manifestació amb un agent col·lectiu que és responsable de la creació d’una manifestació fent una superfície d’impressió en relleu, gravada en profunditat o planogràfica. @ca
toolkit label: agent col·lectiu gravador d’estampes @ca
toolkit definition: Agent col·lectiu que és responsable de la creació d’una manifestació fent una superfície d’impressió en relleu, gravada en profunditat o planogràfica. @ca
label: har kollektiv agent, som er grafiker @da
definition: Relaterer en manifestation til en kollektiv agent, som er involveret i fremstillingen af en manifestation ved at lave en relief-, dybtryks- eller fladtryksoverflade. @da
toolkit label: kollektiv agent, som er grafiker @da
toolkit definition: Kollektiv agent, som er involveret i fremstillingen af en manifestation ved at lave en relief-, dybtryks- eller fladtryksoverflade. @da
label: graafika trükkija (kollektiiv) @et
definition: Seostab kehastuse kollektiiviga, kes osaleb kehastuse valmistamises, tehes kõrgtrüki, sügavtrüki või lametrüki teel tõmmiseid. @et
toolkit label: graafika trükkija (kollektiiv) @et
toolkit definition: Kollektiiv, kes osaleb kehastuse valmistamises, tehes kõrgtrüki, sügavtrüki või lametrüki teel tõmmiseid. @et
label: hat Druckgrafikerin/Druckgrafiker (Gemeinschaftlicher Akteur) @de
definition: Setzt eine Manifestation in Beziehung zu einem gemeinschaftlichen Akteur, der für die Herstellung einer Manifestation verantwortlich ist, indem er eine Hochdruck-, Tiefdruck- oder Flachdruckoberfläche erstellt. @de
toolkit label: Druckgrafikerin/Druckgrafiker (Gemeinschaftlicher Akteur) @de
toolkit definition: Ein gemeinschaftlicher Akteur, der für die Herstellung einer Manifestation verantwortlich ist, indem er eine Hochdruck-, Tiefdruck- oder Flachdruckoberfläche erstellt. @de
label: nyomtatványkészítő kollektív ágense a következő: @hu
definition: Hozzákapcsol egy megjelenési formát egy kollektív ágenshez, amely felelős egy megjelenési forma gyártásáért oly módon, hogy egy domború, mélynyomásos (intaglio) vagy síknyomásos felületet készít. @hu
toolkit label: nyomtatványkészítő kollektív ágens: @hu
toolkit definition: Egy kollektív ágens, amely felelős egy megjelenési forma gyártásáért oly módon, hogy egy domború, mélynyomásos (intaglio) vagy síknyomásos felületet készít. @hu
label: ha come preparatore di stampe agente collettivo @it
definition: Correla una manifestazione all'agente collettivo coinvolto nella manifattura di una manifestazione tramite la preparazione di una superficie di stampa in rilievo, a intaglio o planografica. @it
toolkit label: preparatore di stampe agente collettivo @it
toolkit definition: Agente collettivo coinvolto nella manifattura di una manifestazione tramite la preparazione di una superficie di stampa in rilievo, a intaglio o planografica. @it
label: gravīru meistars (grupa) @lv
definition: Sasaista manifestāciju ar grupu, kas iesaistīta manifestācijas ražošanā, veidojot reljefa, dobspiedes vai gludspieduma drukāšanas virsmu. @lv
toolkit label: gravīru meistars (grupa) @lv
toolkit definition: Grupa, kas iesaistīta manifestācijas ražošanā, veidojot reljefa, dobspiedes vai gludspieduma drukāšanas virsmu. @lv
sub property of: has printmaker agent
sub property of: has creator collective agent of manifestation
lexical alias: printmakerCollectiveAgent.en
label: 有印版制作者集体行为者 @zh-hans
definition: 将一种载体表现与通过制作浮雕、凹版或平版印刷表面对一种载体表现的创建负责的一个集体行为者关联起来。 @zh-hans
toolkit label: 印版制作者集体行为者 @zh-hans
toolkit definition: 通过制作浮雕、凹版或平版印刷表面对一种载体表现的创建负责的一个集体行为者 @zh-hans
label: baskı sanatçısı kolektif temsilcisi ile ilişkilidir @tr
definition: Bir gösterimi, bir kabartma, oyma veya planografik baskı yüzeyi yaparak bir gösterim yaratmaktan sorumlu olan kolektif bir temsilciyle ilişkilendirir. @tr
toolkit label: Grafiker kolektif temsilcisi @tr
toolkit definition: Kabartma, oyma veya planografik baskı yüzeyi yaparak bir tezahür yaratmaktan sorumlu kolektif bir temsilci. @tr
label: tiene agente colectivo impresor @es
definition: Relaciona una manifestación con un agente colectivo que es responsable de crear una manifestación mediante la realización de una superficie de impresión en relieve, calcografía o planográfica. @es
toolkit label: agente colectivo impresor @es
toolkit definition: Un agente colectivo que es responsable de crear una manifestación mediante la realización de una superficie de impresión en relieve, calcografía o planográfica. @es
has subproperty: has engraver collective agent
has subproperty: has etcher collective agent
has subproperty: has lithographer collective agent
has subproperty: has printmaker corporate body
has subproperty: has printmaker family
has subproperty: P30381

has printmaker corporate body
status: Published
definition: Relates a manifestation to a corporate body who is responsible for creating a manifestation by making a relief, intaglio, or planographic printing surface.
toolkit label: printmaker corporate body
toolkit definition: A corporate body who is responsible for creating a manifestation by making a relief, intaglio, or planographic printing surface.
type: Property
domain: C10007
has element type: 2
label: kuvalaatan valmistaja (yhteisö) @fi
definition: Liittää manifestaation yhteisöön, joka on vastuussa manifestaation valmistamisesta valmistamalla kohokuvan, syväpainon tai laakapainon painopinnan. @fi
toolkit label: kuvalaatan valmistaja (yhteisö) @fi
toolkit definition: Yhteisö, joka on vastuussa manifestaation valmistamisesta valmistamalla kohokuvan, syväpainon tai laakapainon painopinnan. @fi
label: har grafiker (korporasjon) @no
definition: Relaterer en manifestasjon til en korporasjon som er involvert i framstillingen av en manifestasjon ved å lage en overflate for relieff-, intaglio- eller plantrykk. @no
toolkit label: grafiker (korporasjon) @no
toolkit definition: En korporasjon som er involvert i framstillingen av en manifestasjon ved å lage en overflate for relieff-, intaglio- eller plantrykk. @no
label: a pour collectivité graveuse d’estampe @fr
definition: Met une manifestation en relation avec une collectivité qui est responsable de la création d’une manifestation en préparant un élément d’impression en relief, en creux ou planographique. @fr
toolkit label: collectivité graveuse d’estampe @fr
toolkit definition: Collectivité qui est responsable de la création d’une manifestation en préparant un élément d’impression en relief, en creux ou planographique. @fr
label: heeft prentmaker-corporatie @nl
definition: Relateert een manifestatie aan een corporatie die verantwoordelijk is voor het creëren van een manifestatie middels het vervaardigen van een hoogdruk, diepdruk of vlakdruk oppervlak. @nl
toolkit label: prentmaker-corporatie @nl
toolkit definition: Een corporatie die verantwoordelijk is voor het creëren van een manifestatie middels het vervaardigen van een hoogdruk, diepdruk of vlakdruk oppervlak. @nl
label: لها هيئة طباع @ar
definition: يربط بين تجسيدة وهيئة مسئولة عن تصنيع تجسيدة بإعداد الأسطح المستخدمة في الطباعة من خلال سطح طباعة بارز، أو غائر، أو مستوي @ar
toolkit label: هيئة طباع @ar
toolkit definition: هيئة مسئولة عن تصنيع تجسيدة بإعداد الأسطح المستخدمة في الطباعة من خلال سطح طباعة بارز، أو غائر، أو مستوي @ar
label: té com a entitat corporativa gravadora d’estampes @ca
definition: Relaciona una manifestació amb una entitat corporativa que és responsable de la creaació d’una manifestació fent una superfície d’impressió en relleu, gravada en profunditat o planogràfica. @ca
toolkit label: entitat corporativa gravadora d’estampes @ca
toolkit definition: Entitat corporativa que és responsable de la creació d’una manifestació fent una superfície d’impressió en relleu, gravada en profunditat o planogràfica. @ca
label: har korporation, som er grafiker @da
definition: Relaterer en manifestation til en korporation, som er involveret i fremstillingen af en manifestation ved at lave en relief-, dybtryks- eller fladtryksoverflade. @da
toolkit label: korporation, som er grafiker @da
toolkit definition: Korporation, som er involveret i fremstillingen af en manifestation ved at lave en relief-, dybtryks- eller fladtryksoverflade. @da
label: graafika trükkija (asutus) @et
definition: Seostab kehastuse asutusega, kes osaleb kehastuse valmistamises, tehes kõrgtrüki, sügavtrüki või lametrüki teel tõmmiseid. @et
toolkit label: graafika trükkija (asutus) @et
toolkit definition: Asutus, kes osaleb kehastuse valmistamises, tehes kõrgtrüki, sügavtrüki või lametrüki teel tõmmiseid. @et
label: hat Druckgrafikerin/Druckgrafiker (Körperschaft) @de
definition: Setzt eine Manifestation in Beziehung zu einer Körperschaft, die für die Herstellung einer Manifestation verantwortlich ist, indem sie eine Hochdruck-, Tiefdruck- oder Flachdruckoberfläche erstellt. @de
toolkit label: Druckgrafikerin/Druckgrafiker (Körperschaft) @de
toolkit definition: Eine Körperschaft, die für die Herstellung einer Manifestation verantwortlich ist, indem sie eine Hochdruck-, Tiefdruck- oder Flachdruckoberfläche erstellt. @de
label: nyomtatványkészítő testülete a következő: @hu
definition: Hozzákapcsol egy megjelenési formát egy testülethez, amely felelős egy megjelenési forma gyártásáért oly módon, hogy egy domború, mélynyomásos (intaglio) vagy síknyomásos felületet készít. @hu
toolkit label: nyomtatványkészítő testület: @hu
toolkit definition: Egy testület, amely felelős egy megjelenési forma gyártásáért oly módon, hogy egy domború, mélynyomásos (intaglio) vagy síknyomásos felületet készít. @hu
label: ha come incisore di stampe ente @it
definition: Correla una manifestazione all'ente coinvolto nella manifattura di una manifestazione, tramite la preparazione di una superficie di stampa in rilievo, a intaglio o planografica. @it
toolkit label: incisore di stampe ente @it
toolkit definition: Ente coinvolto nella manifattura di una manifestazione tramite la preparazione di una superficie di stampa in rilievo, a intaglio o planografica. @it
label: gravīru meistars (institūcija) @lv
definition: Sasaista manifestāciju ar institūciju, kas iesaistīta manifestācijas ražošanā, veidojot reljefa, dobspiedes vai gludspieduma drukāšanas virsmu. @lv
toolkit label: gravīru meistars (institūcija) @lv
toolkit definition: Institūcija, kas iesaistīta manifestācijas ražošanā, veidojot reljefa, dobspiedes vai gludspieduma drukāšanas virsmu. @lv
sub property of: has printmaker collective agent
sub property of: has creator corporate body of manifestation
lexical alias: printmakerCorporateBody.en
label: 有印版制作者团体 @zh-hans
definition: 将一种载体表现与通过制作浮雕、凹版或平版印刷表面对一种载体表现的创建负责的一个团体关联起来。 @zh-hans
toolkit label: 印版制作者团体 @zh-hans
toolkit definition: 通过制作浮雕、凹版或平版印刷表面对一种载体表现的创建负责的一个团体 @zh-hans
label: baskı sanatçısı tüzel kişisi ile ilişkilidir @tr
definition: Bir gösterimi, kabartma veya planografik baskı yüzeyi yaparak bir gösterim yaratmaktan sorumlu olan bir tüzel kişiyle ilişkilendirir. @tr
toolkit label: Grafiker tüzel kişi @tr
toolkit definition: Kabartma, oyma veya planografik baskı yüzeyi yaparak bir gösterim yaratmaktan sorumlu olan bir tüzel kişilik. @tr
label: tiene cuerpo corporativo impresor @es
definition: Relaciona una manifestación con un cuerpo corporativo que es responsable de crear una manifestación mediante la realización de una superficie de impresión en relieve, calcográfica o planográfica. @es
toolkit label: cuerpo corporativo impresor @es
toolkit definition: Un cuerpo corporativo que es responsable de crear una manifestación mediante la realización de una superficie de impresión en relieve, calcográfica o planográfica. @es
has subproperty: has engraver corporate body
has subproperty: has etcher corporate body
has subproperty: has lithographer corporate body
has subproperty: P30410

has printmaker family
status: Published
definition: Relates a manifestation to a family who is responsible for creating a manifestation by making a relief, intaglio, or planographic printing surface.
toolkit label: printmaker family
toolkit definition: A family who is responsible for creating a manifestation by making a relief, intaglio, or planographic printing surface.
type: Property
domain: C10007
has element type: 2
label: kuvalaatan valmistaja (suku) @fi
definition: Liittää manifestaation sukuun, joka on vastuussa manifestaation valmistamisesta valmistamalla kohokuvan, syväpainon tai laakapainon painopinnan. @fi
toolkit label: kuvalaatan valmistaja (suku) @fi
toolkit definition: Suku, joka on vastuussa manifestaation valmistamisesta valmistamalla kohokuvan, syväpainon tai laakapainon painopinnan. @fi
label: har grafiker (familie) @no
definition: Relaterer en manifestasjon til en familie som er involvert i framstillingen av en manifestasjon ved å lage en overflate for relieff-, intaglio- eller plantrykk. @no
toolkit label: grafiker (familie) @no
toolkit definition: En familie som er involvert i framstillingen av en manifestasjon ved å lage en overflate for relieff-, intaglio- eller plantrykk. @no
label: a pour famille graveuse d’estampe @fr
definition: Met une manifestation en relation avec une famille qui est responsable de la création d’une manifestation en préparant un élément d’impression en relief, en creux ou planographique. @fr
toolkit label: famille graveuse d’estampe @fr
toolkit definition: Famille qui est responsable de la création d’une manifestation en préparant un élément d’impression en relief, en creux ou planographique. @fr
label: heeft prentmaker-familie @nl
definition: Relateert een manifestatie aan een familie die verantwoordelijk is voor het creëren van een manifestatie middels het vervaardigen van een hoogdruk, diepdruk of vlakdruk oppervlak. @nl
toolkit label: prentmaker-familie @nl
toolkit definition: Een familie die verantwoordelijk is voor het creëren van een manifestatie middels het vervaardigen van een hoogdruk, diepdruk of vlakdruk oppervlak. @nl
label: له عائلة طباع @ar
definition: يربط بين تجسيدة وعائلة مسئول عن تصنيع تجسيدة بإعداد الأسطح المستخدمة في الطباعة من خلال سطح طباعة بارز، أو غائر، أو مستوي @ar
toolkit label: عائلة طباع @ar
toolkit definition: عائلة مسئولة عن تصنيع تجسيدة بإعداد الأسطح المستخدمة في الطباعة من خلال سطح طباعة بارز، أو غائر، أو مستوي @ar
label: té com a família gravadora d’estampes @ca
definition: Relaciona una manifestació amb una família que és responsable de la creació d’una manifestació fent una superfície d’impressió en relleu, gravada en profunditat o planogràfica. @ca
toolkit label: família gravadora d’estampes @ca
toolkit definition: Família que és responsable de la creació d’una manifestació fent una superfície d’impressió en relleu, gravada en profunditat o planogràfica. @ca
label: har familie, som er grafiker @da
definition: Relaterer en manifestation til en familie, som er involveret i fremstillingen af en manifestation ved at lave en relief-, dybtryks- eller fladtryksoverflade. @da
toolkit label: familie, som er grafiker @da
toolkit definition: Familie, som er involveret i fremstillingen af en manifestation ved at lave en relief-, dybtryks- eller fladtryksoverflade. @da
label: graafika trükkija (perekond) @et
definition: Seostab kehastuse perekonnaga, kes osaleb kehastuse valmistamises, tehes kõrgtrüki, sügavtrüki või lametrüki teel tõmmiseid. @et
toolkit label: graafika trükkija (perekond) @et
toolkit definition: Perekond, kes osaleb kehastuse valmistamises, tehes kõrgtrüki, sügavtrüki või lametrüki teel tõmmiseid. @et
label: hat Druckgrafikerin/Druckgrafiker (Familie) @de
definition: Setzt eine Manifestation in Beziehung zu einer Familie, die für die Herstellung einer Manifestation verantwortlich ist, indem sie eine Hochdruck-, Tiefdruck- oder Flachdruckoberfläche erstellt. @de
toolkit label: Druckgrafikerin/Druckgrafiker (Familie) @de
toolkit definition: Eine Familie, die für die Herstellung einer Manifestation verantwortlich ist, indem sie eine Hochdruck-, Tiefdruck- oder Flachdruckoberfläche erstellt. @de
label: nyomtatványkészítő családja a következő: @hu
definition: Hozzákapcsol egy megjelenési formát egy családhoz, amely felelős egy megjelenési forma gyártásáért oly módon, hogy egy domború, mélynyomásos (intaglio) vagy síknyomásos felületet készít. @hu
toolkit label: nyomtatványkészítő család: @hu
toolkit definition: Egy család, amely felelős egy megjelenési forma gyártásáért oly módon, hogy egy domború, mélynyomásos (intaglio) vagy síknyomásos felületet készít. @hu
label: ha come preparatore di stampe famiglia @it
definition: Correla una manifestazione alla famiglia coinvolta nella manifattura di una manifestazione, tramite la preparazione di una superficie di stampa in rilievo, a intaglio o planografica. @it
toolkit label: preparatore di stampe famiglia @it
toolkit definition: Famiglia coinvolta nella manifattura di una manifestazione, tramite la preparazione di una superficie di stampa in rilievo, a intaglio o planografica. @it
label: gravīru meistars (dzimta/ģimene) @lv
definition: Sasaista manifestāciju ar dzimtu/ģimeni, kas iesaistīta manifestācijas ražošanā, veidojot reljefa, dobspiedes vai gludspieduma drukāšanas virsmu. @lv
toolkit label: gravīru meistars (dzimta/ģimene) @lv
toolkit definition: Dzimta/ģimene, kas iesaistīta manifestācijas ražošanā, veidojot reljefa, dobspiedes vai gludspieduma drukāšanas virsmu. @lv
sub property of: has printmaker collective agent
sub property of: has creator family of manifestation
lexical alias: printmakerFamily.en
label: 有印版制作者家族 @zh-hans
definition: 将一种载体表现与通过制作浮雕、凹版或平版印刷表面对一种载体表现的创建负责的一个家族关联起来。 @zh-hans
toolkit label: 印版制作者家族 @zh-hans
toolkit definition: 通过制作浮雕、凹版或平版印刷表面对一种载体表现的创建负责的一个家族 @zh-hans
label: baskı sanatçısı ailesi ile ilişkilidir @tr
definition: Bir gösterimi; bir kabartma, oyma veya planografik baskı yüzeyi yaparak bir gösterim oluşturmakla sorumlu aileyle ilişkilendirir. @tr
toolkit label: grafiker aile @tr
toolkit definition: Bir kabartma, oyma veya planografik baskı yüzeyi yaparak bir gösterim oluşturmakla sorumlu aile. @tr
label: tiene familia impresora @es
definition: Relaciona una manifestación con una familia que es responsable de crear una manifestación al hacer una superficie de impresión en relieve, calcográfica o planográfica. @es
toolkit label: familia impresora @es
toolkit definition: Una familia que es responsable de crear una manifestación al hacer una superficie de impresión en relieve, calcográfica o planográfica. @es
has subproperty: has engraver family
has subproperty: has etcher family
has subproperty: has lithographer family
has subproperty: P30439

has printmaker person
status: Published
definition: Relates a manifestation to a person who is responsible for creating a manifestation by making a relief, intaglio, or planographic printing surface.
toolkit label: printmaker person
toolkit definition: A person who is responsible for creating a manifestation by making a relief, intaglio, or planographic printing surface.
type: Property
domain: C10007
has element type: 2
label: kuvalaatan valmistaja (henkilö) @fi
definition: Liittää manifestaation henkilöön, joka on vastuussa manifestaation valmistamisesta valmistamalla kohokuvan, syväpainon tai laakapainon painopinnan. @fi
toolkit label: kuvalaatan valmistaja (henkilö) @fi
toolkit definition: Henkilö, joka on vastuussa manifestaation valmistamisesta valmistamalla kohokuvan, syväpainon tai laakapainon painopinnan. @fi
label: har grafiker (person) @no
definition: Relaterer en manifestasjon til en person som er involvert i framstillingen av en manifestasjon ved å lage en overflate for relieff-, intaglio- eller plantrykk. @no
toolkit label: grafiker (person) @no
toolkit definition: En person som er involvert i framstillingen av en manifestasjon ved å lage en overflate for relieff-, intaglio- eller plantrykk. @no
label: a pour personne graveuse d’estampe @fr
definition: Met une manifestation en relation avec une personne qui est responsable de la création d’une manifestation en préparant un élément d’impression en relief, en creux ou planographique. @fr
toolkit label: personne graveuse d’estampe @fr
toolkit definition: Personne qui est responsable de la création d’une manifestation en préparant un élément d’impression en relief, en creux ou planographique. @fr
label: heeft prentmaker-persoon @nl
definition: Relateert een manifestatie aan een persoon die verantwoordelijk is voor het creëren van een manifestatie middels het vervaardigen van een hoogdruk, diepdruk of vlakdruk oppervlak. @nl
toolkit label: prentmaker-persoon @nl
toolkit definition: Een persoon die verantwoordelijk is voor het creëren van een manifestatie middels het vervaardigen van een hoogdruk, diepdruk of vlakdruk oppervlak. @nl
label: له شخص طباع @ar
definition: يربط بين تجسيدة وشخص مسئول عن تصنيع تجسيدة بإعداد الأسطح المستخدمة في الطباعة من خلال سطح طباعة بارز، أو غائر، أو مستوي. @ar
toolkit label: شخص طباع @ar
toolkit definition: شخص مسئول عن تصنيع تجسيدة بإعداد الأسطح المستخدمة في الطباعة من خلال سطح طباعة بارز، أو غائر، أو مستوي. @ar
label: té com a persona gravadora d’estampes @ca
definition: Relaciona una manifestació amb una persona que és responsable de la creació d’una manifestació fent una superfície d’impressió en relleu, gravada en profunditat o planogràfica. @ca
toolkit label: persona gravadora d’estampes @ca
toolkit definition: Persona que és responsable de la creació d’una manifestació fent una superfície d’impressió en relleu, gravada en profunditat o planogràfica. @ca
label: har person, som er grafiker @da
definition: Relaterer en manifestation til en person, som er involveret i fremstillingen af en manifestation ved at lave en relief-, dybtryks- eller fladtryksoverflade. @da
toolkit label: person, som er grafiker @da
toolkit definition: Person, som er involveret i fremstillingen af en manifestation ved at lave en relief-, dybtryks- eller fladtryksoverflade. @da
label: graafika trükkija (isik) @et
definition: Seostab kehastuse isikuga, kes osaleb kehastuse valmistamises, tehes kõrgtrüki, sügavtrüki või lametrüki teel tõmmiseid. @et
toolkit label: graafika trükkija (isik) @et
toolkit definition: Isik, kes osaleb kehastuse valmistamises, tehes kõrgtrüki, sügavtrüki või lametrüki teel tõmmiseid. @et
label: hat Druckgrafikerin/Druckgrafiker (Person) @de
definition: Setzt eine Manifestation in Beziehung zu einer Person, die für die Herstellung einer Manifestation verantwortlich ist, indem sie eine Hochdruck-, Tiefdruck- oder Flachdruckoberfläche erstellt. @de
toolkit label: Druckgrafikerin/Druckgrafiker (Person) @de
toolkit definition: Eine Person, die für die Herstellung einer Manifestation verantwortlich ist, indem sie eine Hochdruck-, Tiefdruck- oder Flachdruckoberfläche erstellt. @de
label: nyomtatványkészítő személye a következő: @hu
definition: Hozzákapcsol egy megjelenési formát egy személyhez, aki felelős egy megjelenési forma gyártásáért oly módon, hogy egy domború, mélynyomásos (intaglio) vagy síknyomásos felületet készít. @hu
toolkit label: nyomtatványkészítő személy: @hu
toolkit definition: Egy személy, aki felelős egy megjelenési forma gyártásáért oly módon, hogy egy domború, mélynyomásos (intaglio) vagy síknyomásos felületet készít. @hu
label: ha come preparatore di stampe persona @it
definition: Correla una manifestazione alla persona coinvolta nella manifattura di una manifestazione, tramite la preparazione di una superficie di stampa in rilievo, a intaglio o planografica. @it
toolkit label: preparatore di stampe persona @it
toolkit definition: Persona coinvolta nella manifattura di una manifestazione, tramite la preparazione di una superficie di stampa in rilievo, a intaglio o planografica. @it
label: gravīru meistars (persona) @lv
definition: Sasaista manifestāciju ar personu, kura iesaistīta manifestācijas ražošanā, veidojot reljefa, dobspiedes vai gludspieduma drukāšanas virsmu. @lv
toolkit label: gravīru meistars (persona) @lv
toolkit definition: Persona, kura iesaistīta manifestācijas ražošanā, veidojot reljefa, dobspiedes vai gludspieduma drukāšanas virsmu. @lv
sub property of: has printmaker agent
sub property of: has creator person of manifestation
lexical alias: printmakerPerson.en
label: 有印版制作者个人 @zh-hans
definition: 将一种载体表现与通过制作浮雕、凹版或平版印刷表面对一种载体表现的创建负责的一个个人关联起来。 @zh-hans
toolkit label: 印版制作者个人 @zh-hans
toolkit definition: 通过制作浮雕、凹版或平版印刷表面对一种载体表现的创建负责的一个个人 @zh-hans
label: baskı sanatçısı kişisi ile ilişkilidir @tr
definition: Bir gösterimi, oyma veya planografik baskı yüzeyi yaparak bir gösterim oluşturmaktan sorumlu olan kişiyle ilişkilendirir. @tr
toolkit label: Grafiker kişi @tr
toolkit definition: Rölyef, gravür veya planografik baskı yüzeyi yaparak bir gösterim oluşturmakla sorumlu olan kişi. @tr
label: tiene persona grabadora @es
definition: Relaciona una manifestación con una persona que se encarga de crear una manifestación mediante la realización de una superficie de impresión en relieve, calcografía o planográfica. @es
toolkit label: persona grabadora @es
toolkit definition: Una persona que se encarga de crear una manifestación mediante la realización de una superficie de impresión en relieve, calcografía o planográfica. @es
has subproperty: has engraver person
has subproperty: has etcher person
has subproperty: has lithographer person
has subproperty: P30352

has producer agent of unpublished manifestation
status: Published
definition: Relates a manifestation to an agent who is responsible for inscribing, fabricating, constructing, or other method of producing an unpublished manifestation.
type: Property
domain: C10007
lexical alias: producerAgentOfUnpublishedManifestation.en
instruction number: 21.2
toolkit label: producer agent of unpublished manifestation
toolkit definition: An agent who is responsible for inscribing, fabricating, constructing, or other method of producing, an unpublished manifestation.
label: a pour agent producteur d’une manifestation non publiée @fr
definition: Met une manifestation en relation avec un agent qui est responsable de la scription, de la fabrication, de la construction ou de toute autre méthode de production d’une manifestation non publiée. @fr
toolkit label: agent producteur d’une manifestation non publiée @fr
toolkit definition: Agent qui est responsable de la scription, de la fabrication, de la construction ou de toute autre méthode de production d’une manifestation non publiée. @fr
toolkit label: agente productor de manifestación inédita @es
toolkit definition: Un agente que es responsable de inscribir, fabricar, construir u otro método de producir una manifestación inédita. @es
label: har producent av opublicerad resurs @sv
toolkit label: producent av opublicerad resurs @sv
sub property of: has creator agent of manifestation
toolkit label: producent-actor van ongepubliceerde manifestatie @nl
toolkit definition: Een actor die verantwoordelijk is voor het afschrijven, fabriceren, construeren of andere methode van het produceren van een ongepubliceerde manifestatie. @nl
label: có nhà sản xuất biểu thị không xuất bản @vi
definition: Liên kết biểu thị với tác nhân có trách nhiệm khắc, kết cấu, cấu trúc, v.v..., biểu thị dưới hình thái không xuất bản. @vi
toolkit label: nhà sản xuất biểu thị không xuất bản @vi
toolkit definition: Tác nhân có trách nhiệm khắc, kết cấu, cấu trúc, v.v..., biểu thị dưới hình thái không xuất bản. @vi
label: har agent, som er producer af upubliceret manifestation @da
definition: Relaterer en manifestation til en agent, som er ansvarlig for indskrift, fremstilling, konstruktion etc. af en upubliceret manifestation. @da
toolkit label: agent, som er producer af upubliceret manifestation @da
toolkit definition: Agent, som er ansvarlig for indskrift, fremstilling, konstruktion etc. af en upubliceret manifestation. @da
label: hat Erzeugerin/Erzeuger einer unveröffentlichten Manifestation (Akteur) @de
definition: Setzt eine Manifestation in Beziehung zu einem Akteur, der für das Gravieren, Fabrizieren, Konstruieren oder eine andere Entstehungsmethode einer unveröffentlichten Manifestation verantwortlich ist. @de
toolkit label: Erzeugerin/Erzeuger einer unveröffentlichten Manifestation (Akteur) @de
toolkit definition: Ein Akteur, der für das Gravieren, Fabrizieren, Konstruieren oder eine andere Entstehungsmethode einer unveröffentlichten Manifestation verantwortlich ist. @de
label: té com a agent productor d’una manifestació no publicada @ca
definition: Relaciona una manifestació amb un agent que és responsable de la inscripció, la fabricació, la construcció o un altre mètode de producció d’una manifestació no publicada. @ca
toolkit label: agent productor d’una manifestació no publicada @ca
toolkit definition: Agent que és responsable de la inscripció, la fabricació, la construcció o un altre mètode de producció d’una manifestació no publicada. @ca
definition: Liittää manifestaation toimijaan, joka on vastuussa julkaisemattoman manifestaation kaiverruksesta, valmistuksesta, kokoonpanosta tai muusta tuotantotavasta. @fi
toolkit label: julkaisemattoman manifestaation tuottaja (toimija) @fi
toolkit definition: Toimija, joka on vastuussa julkaisemattoman manifestaation kaiverruksesta, valmistuksesta, kokoonpanosta tai muusta valmistustavasta. @fi
toolkit label: produsent av upublisert manifestasjon (agent) @no
toolkit definition: En agent som er ansvarlig for å inskribere, fabrikere, konstruere etc. en upublisert manifestasjon. @no
label: έχει παραγωγό της μη δημοσιευμένης εκδήλωσης @el
definition: Συνδέει μια εκδήλωση με έναν φορέα υπεύθυνο για την εγγραφή, την κατασκευή, τη δόμηση κ.λπ. μιας εκδήλωσης σε μια μη δημοσιευμένη μορφή. @el
toolkit label: παραγωγός της μη δημοσιευμένης εκδήλωσης @el
toolkit definition: Ένας φορέας υπεύθυνος για την εγγραφή, την κατασκευή, τη δόμηση κ.λπ. μιας εκδήλωσης σε μια μη δημοσιευμένη μορφή. @el
has element type: 2
label: kiadatlan megjelenési forma előállító ágense a következő: @hu
definition: Hozzákapcsol egy megjelenési formát egy ágenshez, amely felelős egy kiadatlan megjelenési forma írásáért, összeállításáért, készítéséért vagy egyéb módú előállításáért. @hu
toolkit label: kiadatlan megjelenési forma előállító ágense: @hu
toolkit definition: Egy ágens, amely felelős egy kiadatlan megjelenési forma írásáért, összeállításáért, készítéséért vagy egyéb módú előállításáért. @hu
alternative label: producer of unpublished manifestation
alternative label: julkaisemattoman manifestaation tuottaja @fi
label: julkaisemattoman manifestaation tuottaja (toimija) @fi
label: har produsent av upublisert manifestasjon (agent) @no
definition: Relaterer en manifestasjon til en agent som er ansvarlig for å inskribere, fabrikere, konstruere etc. en upublisert manifestasjon. @no
alternative label: produsent av upublisert manifestasjon @no
alternative label: producteur d’une manifestation non publiée @fr
label: heeft producent-actor van ongepubliceerde manifestatie @nl
definition: Relateert een manifestatie aan een actor die verantwoordelijk is voor het afschrijven, fabriceren, construeren of andere methode van het produceren van een ongepubliceerde manifestatie. @nl
label: له وكيل منتج لتجسيدة غير منشورة @ar
definition: يربط بين تجسيدة ووكيل مسئول عن تسجيل، أو تصنيع، أو إنشاء، إلخ. تجسيدة غير منشورة. @ar
alternative label: منتج لتجسيدة غير منشورة @ar
toolkit label: وكيل منتج لتجسيدة غير منشورة @ar
toolkit definition: وكيل مسئول عن تسجيل، أو تصنيع، أو إنشاء، إلخ. تجسيدة غير منشورة. @ar
alternative label: productor d’una manifestació no publicada @ca
alternative label: producer af upubliceret manifestation @da
label: avaldamata kehastuse tootja (tegija) @et
definition: Seostab kehastuse tegijaga, kes vastutab avaldamata kehastuse inskribeerimise, tootmise, ehitamise vms eest. @et
alternative label: avaldamata kehastuse tootja @et
toolkit label: avaldamata kehastuse tootja (tegija) @et
toolkit definition: Tegija, kes vastutab avaldamata kehastuse inskribeerimise, tootmise, ehitamise vms eest. @et
alternative label: kiadatlan megjelenési forma előállítója: @hu
label: ha come produttore di manifestazione non pubblicata agente @it
definition: Correla una manifestazione all'agente responsabile dell’iscrizione, fabbricazione, costruzione, etc., di una manifestazione non pubblicata. @it
alternative label: produttore di manifestazione non pubblicata @it
toolkit label: agente produttore di manifestazione non pubblicata @it
toolkit definition: Agente responsabile dell'iscrizione, fabbricazione, costruzione, etc. di una manifestazione non pubblicata. @it
label: nepublicētas manifestācijas izgatavotājs (aģents) @lv
definition: Sasaista manifestāciju ar aģentu, kas ir atbildīgs par nepublicētās manifestācijas pierakstīšanu, izgatavošanu, radīšanu u.tml. @lv
toolkit label: nepublicētas manifestācijas izgatavotājs (aģents) @lv
toolkit definition: Aģents, kas ir atbildīgs par nepublicētās manifestācijas pierakstīšanu, izgatavošanu, radīšanu u.tml. @lv

has producer collective agent of unpublished manifestation
status: Published
lexical alias: producerCollectiveAgentOfUnpublishedManifestation.en
definition: Relates a manifestation to a collective agent who is responsible for inscribing, fabricating, constructing, or other method of producing an unpublished manifestation.
toolkit label: producer collective agent of unpublished manifestation
toolkit definition: A collective agent who is responsible for inscribing, fabricating, constructing, or other method of producing an unpublished manifestation.
type: Property
domain: C10007
has element type: 2
sub property of: has creator collective agent of manifestation
sub property of: has producer agent of unpublished manifestation
label: julkaisemattoman manifestaation tuottaja (yhteistoimja) @fi
definition: Liittää manifestaation yhteistoimijaan, joka on vastuussa julkaisemattoman manifestaation kaiverruksesta, valmistuksesta, kokoonpanosta tai muusta tuotantotavasta. @fi
toolkit label: julkaisemattoman manifestaation tuottaja (yhteistoimja) @fi
toolkit definition: Yhteistoimija, joka on vastuussa julkaisemattoman manifestaation kaiverruksesta, valmistuksesta, kokoonpanosta tai muusta tuotantotavasta. @fi
label: har produsent av upublisert manifestasjon (kollekitv agent) @no
definition: Relaterer en manifestasjon til en kollektiv agent som er ansvarlig for å inskribere, fabrikere, konstruere etc. en upublisert manifestasjon. @no
toolkit label: produsent av upublisert manifestasjon (kollekitv agent) @no
toolkit definition: En kollektiv agent som er ansvarlig for å inskribere, fabrikere, konstruere etc. en upublisert manifestasjon. @no
label: a pour agent collectif producteur d’une manifestation non publiée @fr
definition: Met une manifestation en relation avec un agent collectif qui est responsable de la scription, de la fabrication, de la construction ou de toute autre méthode de production d’une manifestation non publiée. @fr
toolkit label: agent collectif producteur d’une manifestation non publiée @fr
toolkit definition: Agent collectif qui est responsable de la scription, de la fabrication, de la construction ou de toute autre méthode de production d’une manifestation non publiée. @fr
label: heeft producent-collectieve actor van ongepubliceerde manifestatie @nl
definition: Relateert een manifestatie aan een collectieve actor die verantwoordelijk is voor het afschrijven, fabriceren, construeren of andere methode van het produceren van een ongepubliceerde manifestatie. @nl
toolkit label: producent-collectieve actor van een ongepubliceerde manifestatie @nl
toolkit definition: Een collectieve actor die verantwoordelijk is voor het afschrijven, fabriceren, construeren of andere methode van het produceren van een ongepubliceerde manifestatie. @nl
label: له وكيل جماعي منتج لتجسيدة غير منشورة @ar
definition: يربط بين تجسيدة ووكيل جماعي مسئول عن تسجيل، أو تصنيع، أو إنشاء، إلخ. تجسيدة غير منشورة. @ar
toolkit label: وكيل جماعي منتج لتجسيدة غير منشورة @ar
toolkit definition: وكيل جماعي مسئول عن تسجيل، أو تصنيع، أو إنشاء، إلخ. تجسيدة غير منشورة. @ar
label: té com a agent col·lectiu productor d’una manifestació no publicada @ca
definition: Relaciona una manifestació amb un agent col·lectiu que és responsable de la inscripció, la fabricació, la construcció o un altre mètode de producció d’una manifestació no publicada. @ca
toolkit label: agent col·lectiu productor d’una manifestació no publicada @ca
toolkit definition: Agent col·lectiu que és responsable de la inscripció, la fabricació, la construcció o un altre mètode de producció d’una manifestació no publicada. @ca
label: har kollektiv agent, som er producer af upubliceret manifestation @da
definition: Relaterer en manifestation til en kollektiv agent, som er ansvarlig for indskrift, fremstilling, konstruktion etc. af en upubliceret manifestation. @da
toolkit label: kollektiv agent, som er producer af upubliceret manifestation @da
toolkit definition: Kollektiv agent, som er ansvarlig for indskrift, fremstilling, konstruktion etc. af en upubliceret manifestation. @da
label: avaldamata kehastuse tootja (kollektiiv) @et
definition: Seostab kehastuse kollektiiviga, kes vastutab avaldamata kehastuse inskribeerimise, tootmise, ehitamise vms eest. @et
toolkit label: avaldamata kehastuse tootja (kollektiiv) @et
toolkit definition: Kollektiiv, kes vastutab avaldamata kehastuse inskribeerimise, tootmise, ehitamise vms eest. @et
label: hat Erzeugerin/Erzeuger einer unveröffentlichten Manifestation (Gemeinschaftlicher Akteur) @de
definition: Setzt eine Manifestation in Beziehung zu einem gemeinschaftlichen Akteur, der für das Gravieren, Fabrizieren, Konstruieren oder eine andere Entstehungsmethode einer unveröffentlichten Manifestation verantwortlich ist. @de
toolkit label: Erzeugerin/Erzeuger einer unveröffentlichten Manifestation (Gemeinschaftlicher Akteur) @de
toolkit definition: Ein gemeinschaftlicher Akteur, der für das Gravieren, Fabrizieren, Konstruieren oder eine andere Entstehungsmethode einer unveröffentlichten Manifestation verantwortlich ist. @de
label: kiadatlan megjelenési forma előállító kollektív ágense a következő: @hu
definition: Hozzákapcsol egy megjelenési formát egy kollektív ágenshez, amely felelős egy kiadatlan megjelenési forma írásáért, összeállításáért, készítéséért vagy egyéb módú előállításáért. @hu
toolkit label: kiadatlan megjelenési forma előállító kollektív ágense: @hu
toolkit definition: Egy kollektív ágens, amely felelős egy kiadatlan megjelenési forma írásáért, összeállításáért, készítéséért vagy egyéb módú előállításáért. @hu
label: ha come produttore di manifestazione non pubblicata agente collettivo @it
definition: Correla una manifestazione all'agente collettivo responsabile della iscrizione, fabbricazione, costruzione, etc. di una manifestazione non pubblicata. @it
toolkit label: produttore di manifestazione non pubblicata agente collettivo @it
toolkit definition: Agente collettivo responsabile della iscrizione, fabbricazione, costruzione, etc. di una manifestazione non pubblicata. @it
label: nepublicētas manifestācijas izgatavotājs (grupa) @lv
definition: Sasaista manifestāciju ar grupu, kas ir atbildīga par nepublicētās manifestācijas pierakstīšanu, izgatavošanu, radīšanu u.tml. @lv
toolkit label: nepublicētas manifestācijas izgatavotājs (grupa) @lv
toolkit definition: Grupa, kas ir atbildīga par nepublicētās manifestācijas pierakstīšanu, izgatavošanu, radīšanu u.tml. @lv
label: 有非出版载体表现的制作者集体行为者 @zh-hans
definition: 将一种载体表现与负责镌刻、制造、构建或其他方法制作一种非出版载体表现的一个集体行为者关联起来。 @zh-hans
toolkit label: 非出版载体表现的制作者集体行为者 @zh-hans
toolkit definition: 负责镌刻、制造、构建或其他方法制作一种非出版载体表现的一个集体行为者 @zh-hans
label: yayınlanmamış gösterimin yapımcı kolektif temsilcisi ile ilişkilidir @tr
definition: Bir gösterimi, yayınlanmamış bir gösterimin kaydedilmesinden, üretilmesinden, inşa edilmesinden veya başka bir şekilde üretilmesinden sorumlu olan kolektif bir temsilciyle ilişkilendirir. @tr
toolkit label: yayınlanmamış gösterimin yapımcı kolektif temsilcisi @tr
toolkit definition: Yayınlanmamış bir gösterimi yazmaktan, imal etmekten, inşa etmekten veya başka bir yöntemle üretmekten sorumlu olan kolektif bir temsilci. @tr
label: tiene agente colectivo productor de manifestación inédita @es
definition: Relaciona una manifestación con un agente colectivo que es responsable de inscribir, fabricar, construir u otro método de producir una manifestación inédita. @es
toolkit label: agente colectivo productor de manifestación inédita @es
toolkit definition: Un agente colectivo que es responsable de inscribir, fabricar, construir u otro método de producir una manifestación inédita. @es
has subproperty: has producer corporate body of unpublished manifestation
has subproperty: has producer family of unpublished manifestation
has subproperty: P30389

has producer corporate body of unpublished manifestation
status: Published
lexical alias: producerCorporateBodyOfUnpublishedManifestation.en
definition: Relates a manifestation to a corporate body who is responsible for inscribing, fabricating, constructing, or other method of producing an unpublished manifestation.
toolkit label: producer corporate body of unpublished manifestation
toolkit definition: A corporate body who is responsible for inscribing, fabricating, constructing, or other method of producing an unpublished manifestation.
type: Property
domain: C10007
has element type: 2
sub property of: has creator corporate body of manifestation
sub property of: has producer collective agent of unpublished manifestation
label: julkaisemattoman manifestaation tuottaja (yhteisö) @fi
definition: Liittää manifestaation yhteisöön, joka on vastuussa julkaisemattoman manifestaation kaiverruksesta, valmistuksesta, kokoonpanosta tai muuta tuotantotavasta. @fi
toolkit label: julkaisemattoman manifestaation tuottaja (yhteisö) @fi
toolkit definition: Yhteisö, joka on vastuussa julkaisemattoman manifestaation kaiverruksesta, valmistuksesta, kokoonpanosta tai muusta tuotantotavasta. @fi
label: har produsent av upublisert manifestasjon (korporasjon) @no
definition: Relaterer en manifestasjon til en korporasjon som er ansvarlig for å inskribere, fabrikere, konstruere etc. en upublisert manifestasjon. @no
toolkit label: produsent av upublisert manifestasjon (korporasjon) @no
toolkit definition: En korporasjon som er ansvarlig for å inskribere, fabrikere, konstruere etc. en upublisert manifestasjon. @no
label: a pour collectivité productrice d’une manifestation non publiée @fr
definition: Met une manifestation en relation avec une collectivité qui est responsable de la scription, de la fabrication, de la construction ou de toute autre méthode de production d’une manifestation non publiée. @fr
toolkit label: collectivité productrice d’une manifestation non publiée @fr
toolkit definition: Collectivité qui est responsable de la scription, de la fabrication, de la construction ou de toute autre méthode de production d’une manifestation non publiée. @fr
label: heeft producent-corporatie van ongepubliceerde manifestatie @nl
definition: Relateert een manifestatie aan een corporatie die verantwoordelijk is voor het afschrijven, fabriceren, construeren of andere methode van het produceren van een ongepubliceerde manifestatie. @nl
toolkit label: producent-corporatie van ongepubliceerde manifestatie @nl
toolkit definition: Een corporatie die verantwoordelijk is voor het afschrijven, fabriceren, construeren of andere methode van het produceren van een ongepubliceerde manifestatie. @nl
label: له هيئة منتجة لتجسيدة غير منشورة @ar
definition: يربط بين تجسيدة وهيئة مسئول عن تسجيل، أو تصنيع، أو إنشاء، إلخ. تجسيدة غير منشورة. @ar
toolkit label: هيئة منتجة لتجسيدة غير منشورة @ar
toolkit definition: هيئة مسئول عن تسجيل، أو تصنيع، أو إنشاء، إلخ. تجسيدة غير منشورة. @ar
label: té com a entitat corporativa productora d’una manifestació no publicada @ca
definition: Relaciona una manifestació amb una entitat corporativa que és responsable de la inscripció, la fabricació, la construcció o un altre mètode d’una manifestació no publicada. @ca
toolkit label: entitat corporativa productora d’una manifestació no publicada @ca
toolkit definition: Entitat corporativa que és responsable de la inscripció, la fabricació, la construcció o un altre mètode d’una manifestació no publicada. @ca
label: har korporation, som er producer af upubliceret manifestation @da
definition: Relaterer en manifestation til en korporation, som er ansvarlig for indskrift, fremstilling, konstruktion etc. af en upubliceret manifestation. @da
toolkit label: korporation, som er producer af upubliceret manifestation @da
toolkit definition: Korporation, som er ansvarlig for indskrift, fremstilling, konstruktion etc. af en upubliceret manifestation. @da
label: avaldamata kehastuse tootja (asutus) @et
definition: Seostab kehastuse asutusega, kes vastutab avaldamata kehastuse inskribeerimise, tootmise, ehitamise vms eest. @et
toolkit label: avaldamata kehastuse tootja (asutus) @et
toolkit definition: Asutus, kes vastutab avaldamata kehastuse inskribeerimise, tootmise, ehitamise vms eest. @et
label: hat Erzeugerin/Erzeuger einer unveröffentlichten Manifestation (Körperschaft) @de
definition: Setzt eine Manifestation in Beziehung zu einer Körperschaft, die für das Gravieren, Fabrizieren, Konstruieren oder eine andere Entstehungsmethode einer unveröffentlichten Manifestation verantwortlich ist. @de
toolkit label: Erzeugerin/Erzeuger einer unveröffentlichten Manifestation (Körperschaft) @de
toolkit definition: Eine Körperschaft, die für das Gravieren, Fabrizieren, Konstruieren oder eine andere Entstehungsmethode einer unveröffentlichten Manifestation verantwortlich ist. @de
label: kiadatlan megjelenési forma előállító testülete a következő: @hu
definition: Hozzákapcsol egy megjelenési formát egy testülethez, amely felelős egy kiadatlan megjelenési forma írásáért, összeállításáért, készítéséért vagy egyéb módú előállításáért. @hu
toolkit label: kiadatlan megjelenési forma előállító testülete: @hu
toolkit definition: Egy testület, amely felelős egy kiadatlan megjelenési forma írásáért, összeállításáért, készítéséért vagy egyéb módú előállításáért. @hu
label: ha come produttore di manifestazione non pubblicata ente @it
definition: Correla una manifestazione all'ente responsabile della iscrizione, fabbricazione, costruzione, etc. di una manifestazione non pubblicata. @it
toolkit label: produttore di manifestazione non pubblicata ente @it
toolkit definition: Ente responsabile della iscrizione, fabbricazione, costruzione, etc. di una manifestazione non pubblicata. @it
label: nepublicētas manifestācijas izgatavotājs (institūcija) @lv
definition: Sasaista manifestāciju ar institūciju, kas ir atbildīga par nepublicētās manifestācijas pierakstīšanu, izgatavošanu, radīšanu u.tml. @lv
toolkit label: nepublicētas manifestācijas izgatavotājs (institūcija) @lv
toolkit definition: Institūcija, kas ir atbildīga par nepublicētās manifestācijas pierakstīšanu, izgatavošanu, radīšanu u.tml. @lv
label: 有非出版载体表现的制作者团体 @zh-hans
definition: 将一种载体表现与负责镌刻、制造、构建或其他方法制作一种非出版载体表现的一个团体关联起来。 @zh-hans
toolkit label: 非出版载体表现的制作者团体 @zh-hans
toolkit definition: 负责镌刻、制造、构建或其他方法制作一种非出版载体表现的一个团体 @zh-hans
label: yayınlanmamış gösterimin yapımcı tüzel kişisi ile ilişkilidir @tr
definition: Bir gösterimi, yayınlanmamış gösterimin yazımı, üretimi, yapımı veya üretimi için başka bir yönteminden sorumlu tüzel kişiyle ilişkilendirir. @tr
toolkit label: yayınlanmamış gösterimin yapımcı tüzel kişisi @tr
toolkit definition: Yayınlanmamış gösterimin yazımı, üretimi, yapımı veya üretimi için başka bir yönteminden sorumlu olan tüzel kişi. @tr
label: tiene cuerpo corporativo productor de manifestación inédita @es
definition: Relaciona una manifestación con un cuerpo corporativo que es responsable de inscribir, fabricar, construir u otro método de producir una manifestación inédita. @es
toolkit label: cuerpo corporativo productor de manifestación inédita @es
toolkit definition: Un cuerpo corporativo que es responsable de inscribir, fabricar, construir u otro método de producir una manifestación inédita. @es
has subproperty: P30418

has producer family of unpublished manifestation
status: Published
lexical alias: producerFamilyOfUnpublishedManifestation.en
definition: Relates a manifestation to a family who is responsible for inscribing, fabricating, constructing, or other method of producing an unpublished manifestation.
toolkit label: producer family of unpublished manifestation
toolkit definition: A family who is responsible for inscribing, fabricating, constructing, or other method of producing an unpublished manifestation.
type: Property
domain: C10007
has element type: 2
sub property of: has creator family of manifestation
sub property of: has producer collective agent of unpublished manifestation
label: julkaisemattoman manifestaation tuottaja (suku) @fi
definition: Liittää manifestaation sukuun, joka on vastuussa julkaisemattoman manifestaation kaiverruksesta, valmistuksesta, kokoonpanosta tai muusta tuotantotavasta. @fi
toolkit label: julkaisemattoman manifestaation tuottaja (suku) @fi
toolkit definition: Suku, joka on vastuussa julkaisemattoman manifestaation kaiverruksesta, valmistuksesta, kokoonpanosta tai muusta tuotantotavasta. @fi
label: har produsent av upublisert manifestasjon (familie) @no
definition: Relaterer en manifestasjon til en familie som er ansvarlig for å inskribere, fabrikere, konstruere etc. en upublisert manifestasjon. @no
toolkit label: produsent av upublisert manifestasjon (familie) @no
toolkit definition: En familie som er ansvarlig for å inskribere, fabrikere, konstruere etc. en upublisert manifestasjon. @no
label: a pour famille productrice d’une manifestation non publiée @fr
definition: Met une manifestation en relation avec une famille qui est responsable de la scription, de la fabrication, de la construction ou de toute autre méthode de production d’une manifestation non publiée. @fr
toolkit label: famille productrice d’une manifestation non publiée @fr
toolkit definition: Famille qui est responsable de la scription, de la fabrication, de la construction ou de toute autre méthode de production d’une manifestation non publiée. @fr
label: heeft producent-familie van ongepubliceerde manifestatie @nl
definition: Relateert een manifestatie aan een familie die verantwoordelijk is voor het afschrijven, fabriceren, construeren of andere methode van het produceren van een ongepubliceerde manifestatie. @nl
toolkit label: producent-familie van ongepubliceerde manifestatie @nl
toolkit definition: Een familie die verantwoordelijk is voor het afschrijven, fabriceren, construeren of andere methode van het produceren van een ongepubliceerde manifestatie. @nl
label: له عائلة منتجة لتجسيدة غير منشورة @ar
definition: يربط بين تجسيدة وعائلة مسئولة عن تسجيل، أو تصنيع، أو إنشاء، إلخ. تجسيدة غير منشورة. @ar
toolkit label: عائلة منتجة لتجسيدة غير منشورة @ar
toolkit definition: عائلة مسئولة عن تسجيل، أو تصنيع، أو إنشاء، إلخ. تجسيدة غير منشورة. @ar
label: té com a família productora d’una manifestació no publicada @ca
definition: Relaciona una manifestació amb una família que és responsable de la inscripció, la fabricació, la construcció o un altre mètode de producció d’una manifestació no publicada. @ca
toolkit label: família productora d’una manifestació no publicada @ca
toolkit definition: Família que és responsable de la inscripció, la fabricació, la construcció o un altre mètode de producció d’una manifestació no publicada. @ca
label: har familie, som er producer af upubliceret manifestation @da
definition: Relaterer en manifestation til en familie, som er ansvarlig for indskrift, fremstilling, konstruktion etc. af en upubliceret manifestation. @da
toolkit label: familie, som er producer af upubliceret manifestation @da
toolkit definition: Familie, som er ansvarlig for indskrift, fremstilling, konstruktion etc. af en upubliceret manifestation. @da
label: avaldamata kehastuse tootja (perekond) @et
definition: Seostab kehastuse perekonnaga, kes vastutab avaldamata kehastuse inskribeerimise, tootmise, ehitamise vms eest. @et
toolkit label: avaldamata kehastuse tootja (perekond) @et
toolkit definition: Perekond, kes vastutab avaldamata kehastuse inskribeerimise, tootmise, ehitamise vms eest. @et
label: hat Erzeugerin/Erzeuger einer unveröffentlichten Manifestation (Familie) @de
definition: Setzt eine Manifestation in Beziehung zu einer Familie, die für das Gravieren, Fabrizieren, Konstruieren oder eine andere Entstehungsmethode einer unveröffentlichten Manifestation verantwortlich ist. @de
toolkit label: Erzeugerin/Erzeuger einer unveröffentlichten Manifestation (Familie) @de
toolkit definition: Eine Familie, die für das Gravieren, Fabrizieren, Konstruieren oder eine andere Entstehungsmethode einer unveröffentlichten Manifestation verantwortlich ist. @de
label: kiadatlan megjelenési forma előállító családja a következő: @hu
definition: Hozzákapcsol egy megjelenési formát egy családhoz, amely felelős egy kiadatlan megjelenési forma írásáért, összeállításáért, készítéséért vagy egyéb módú előállításáért. @hu
toolkit label: kiadatlan megjelenési forma előállító családja: @hu
toolkit definition: Egy család, amely felelős egy kiadatlan megjelenési forma írásáért, összeállításáért, készítéséért vagy egyéb módú előállításáért. @hu
label: ha come produttore di manifestazione non pubblicata famiglia @it
definition: Correla una manifestazione alla famiglia responsabile della iscrizione, fabbricazione, costruzione, etc. di una manifestazione non pubblicata. @it
toolkit label: produttore di manifestazione non pubblicata famiglia @it
toolkit definition: Famiglia responsabile della iscrizione, fabbricazione, costruzione, etc. di una manifestazione non pubblicata. @it
label: nepublicētas manifestācijas izgatavotājs (dzimta/ģimene) @lv
definition: Sasaista manifestāciju ar dzimtu/ģimeni, kas ir atbildīga par nepublicētās manifestācijas pierakstīšanu, izgatavošanu, radīšanu u.tml. @lv
toolkit label: nepublicētas manifestācijas izgatavotājs (dzimta/ģimene) @lv
toolkit definition: Dzimta/ģimene, kas ir atbildīga par nepublicētās manifestācijas pierakstīšanu, izgatavošanu, radīšanu u.tml. @lv
label: 有非出版载体表现的制作者家族 @zh-hans
definition: 将一种载体表现与负责镌刻、制造、构建或其他方法制作一种非出版载体表现的一个家族关联起来。 @zh-hans
toolkit label: 非出版载体表现的制作者家族 @zh-hans
toolkit definition: 负责镌刻、制造、构建或其他方法制作一种非出版载体表现的一个家族 @zh-hans
label: yayınlanmamış gösterimin yapımcı ailesi ile ilişkilidir @tr
definition: Bir gösterimi; yazım, üretim, yapım veya yayımlanmamış gösterimi üretmek için başka yöntemlerden sorumlu aileyle ilişkilendirir. @tr
toolkit label: yayımlanmamış gösterimin yapımcı ailesi @tr
toolkit definition: Yazım, üretim, yapım veya yayımlanmamış gösterimi üretmek için başka yöntemlerden sorumlu aile. @tr
label: tiene familia productora de manifestación inédita @es
definition: Relaciona una manifestación con una familia que es responsable de inscribir, fabricar, construir o producir mediante otro método una manifestación inédita. @es
toolkit label: familia productora de manifestación inédita @es
toolkit definition: Una familia que es responsable de inscribir, fabricar, construir o producir mediante otro método una manifestación inédita. @es
has subproperty: P30447

has producer person of unpublished manifestation
status: Published
lexical alias: producerPersonOfUnpublishedManifestation.en
definition: Relates a manifestation to a person who is responsible for inscribing, fabricating, constructing, or other method of producing an unpublished manifestation.
toolkit label: producer person of unpublished manifestation
toolkit definition: A person who is responsible for inscribing, fabricating, constructing, or other method of producing an unpublished manifestation.
type: Property
domain: C10007
has element type: 2
sub property of: has creator person of manifestation
sub property of: has producer agent of unpublished manifestation
label: julkaisemattoman manifestaation tuottaja (henkilö) @fi
definition: Liittää manifestaation henkilöön, joka on vastuussa julkaisemattoman manifestaation kaiverruksesta, valmistuksesta, kokoonpanosta tms. @fi
toolkit label: julkaisemattoman manifestaation tuottaja (henkilö) @fi
toolkit definition: Henkilö, joka on vastuussa julkaisemattoman manifestaation kaiverruksesta, valmistuksesta, kokoonpanosta tms. @fi
label: har produsent av upublisert manifestasjon (person) @no
definition: Relaterer en manifestasjon til en person som er ansvarlig for å inskribere, fabrikere, konstruere etc. en upublisert manifestasjon. @no
toolkit label: produsent av upublisert manifestasjon (person) @no
toolkit definition: En person som er ansvarlig for å inskribere, fabrikere, konstruere etc. en upublisert manifestasjon. @no
label: a pour personne productrice d’une manifestation non publiée @fr
definition: Met une manifestation en relation avec une personne qui est responsable de la scription, de la fabrication, de la construction ou de toute autre méthode de production d’une manifestation non publiée. @fr
toolkit label: personne productrice d’une manifestation non publiée @fr
toolkit definition: Personne qui est responsable de la scription, de la fabrication, de la construction ou de toute autre méthode de production d’une manifestation non publiée. @fr
label: heeft producent-persoon van ongepubliceerde manifestatie @nl
definition: Relateert een manifestatie aan een persoon die verantwoordelijk is voor het afschrijven, fabriceren, construeren of andere methode van het produceren van een ongepubliceerde manifestatie. @nl
toolkit label: producent-persoon van ongepubliceerde manifestatie @nl
toolkit definition: Een persoon die verantwoordelijk is voor het afschrijven, fabriceren, construeren of andere methode van het produceren van een ongepubliceerde manifestatie. @nl
label: له شخص منتج لتجسيدة غير منشورة @ar
definition: يربط بين تجسيدة وشخص مسئول عن تسجيل، أو تصنيع، أو إنشاء، إلخ. تجسيدة غير منشورة. @ar
toolkit label: شخص منتج لتجسيدة غير منشورة @ar
toolkit definition: شخص مسئول عن تسجيل، أو تصنيع، أو إنشاء، إلخ. تجسيدة غير منشورة. @ar
label: té com a persona productora d’una manifestació no publicada @ca
definition: Relaciona una manifestació amb una persona que és responsable de la inscripció, la fabricació, la construcció o un altre mètode de producció d’una manifestació no publicada. @ca
toolkit label: persona productora d’una manifestació no publicada @ca
toolkit definition: Persona que és responsable de la inscripció, la fabricació, la construcció o un altre mètode de producció d’una manifestació no publicada. @ca
label: har person, som er producer af upubliceret manifestation @da
definition: Relaterer en manifestation til en person, som er ansvarlig for indskrift, fremstilling, konstruktion etc. af en upubliceret manifestation. @da
toolkit label: person, som er producer af upubliceret manifestation @da
toolkit definition: Person, som er ansvarlig for indskrift, fremstilling, konstruktion etc. af en upubliceret manifestation. @da
label: avaldamata kehastuse tootja (isik) @et
definition: Seostab kehastuse isikuga, kes vastutab avaldamata kehastuse inskribeerimise, tootmise, ehitamise vms eest. @et
toolkit label: avaldamata kehastuse tootja (isik) @et
toolkit definition: Isik, kes vastutab avaldamata kehastuse inskribeerimise, tootmise, ehitamise vms eest. @et
label: hat Erzeugerin/Erzeuger einer unveröffentlichten Manifestation (Person) @de
definition: Setzt eine Manifestation in Beziehung zu einer Person, die für das Gravieren, Fabrizieren, Konstruieren oder eine andere Entstehungsmethode einer unveröffentlichten Manifestation verantwortlich ist. @de
toolkit label: Erzeugerin/Erzeuger einer unveröffentlichten Manifestation (Person) @de
toolkit definition: Eine Person, die für das Gravieren, Fabrizieren, Konstruieren oder eine andere Entstehungsmethode einer unveröffentlichten Manifestation verantwortlich ist. @de
label: kiadatlan megjelenési forma előállító személye: @hu
definition: Hozzákapcsol egy megjelenési formát egy személyhez, aki felelős egy kiadatlan megjelenési forma írásáért, összeállításáért, készítéséért vagy egyéb módú előállításáért. @hu
toolkit label: közzé nem tett megjelenésiforma-producer @hu
toolkit definition: Egy személy, aki felelős egy kiadatlan megjelenési forma írásáért, összeállításáért, készítéséért vagy egyéb módú előállításáért. @hu
label: ha come produttore di manifestazione non pubblicata persona @it
definition: Correla una manifestazione alla persona responsabile della iscrizione, fabbricazione, costruzione, etc. di una manifestazione non pubblicata. @it
toolkit label: produttore di manifestazione non pubblicata persona @it
toolkit definition: Persona responsabile della iscrizione, fabbricazione, costruzione, etc. di una manifestazione non pubblicata. @it
label: nepublicētas manifestācijas izgatavotājs (persona) @lv
definition: Sasaista manifestāciju ar personu, kura ir atbildīga par nepublicētās manifestācijas pierakstīšanu, izgatavošanu, radīšanu u.tml. @lv
toolkit label: nepublicētas manifestācijas izgatavotājs (persona) @lv
toolkit definition: Persona, kura ir atbildīga par nepublicētās manifestācijas pierakstīšanu, izgatavošanu, radīšanu u.tml. @lv
label: 有非出版载体表现的制作者个人 @zh-hans
definition: 将一种载体表现与负责镌刻、制造、构建或其他方法制作一种非出版载体表现的一个个人关联起来。 @zh-hans
toolkit label: 非出版载体表现的制作者个人 @zh-hans
toolkit definition: 负责镌刻、制造、构建或其他方法制作一种非出版载体表现的一个个人 @zh-hans
label: yayınlanmamış gösterimin yapımcı kişisi ile ilişkilidir @tr
definition: Bir gösterimi yazmaktan, oluşturmaktan, inşa etmekten veya yayınlanmamış bir gösterimi üretmenin başka bir yönteminden sorumlu olan bir kişiyle ilişkilendirir. @tr
toolkit label: yayınlanmamış gösterimin yapımcı kişisi @tr
toolkit definition: Yayınlanmamış bir gösterimi yazma, fabrikasyon, yapım veya diğer yöntemlerle üretmekten sorumlu kişi. @tr
label: tiene persona productora de manifestación inédita @es
definition: Relaciona una manifestación con una persona que es responsable de inscribir, fabricar, construir u otro método de producir una manifestación inédita. @es
toolkit label: persona productora de manifestación inédita @es
toolkit definition: Una persona que es responsable de inscribir, fabricar, construir u otro método de producir una manifestación inédita. @es
has subproperty: P30360

a pour méthode de production d’un manuscrit
status: Deprecated
definition: Relates a manifestation to the process used to produce an original manuscript or a copy.
type: Property
domain: C10007
sub property of: has production method
lexical alias: productionMethodForManuscript.en
toolkit label: production method for manuscript (Deprecated)
toolkit definition: The process used to produce an original manuscript or a copy. (Deprecated)
definition: Met une manifestation en relation avec le procédé utilisé pour produire un manuscrit original ou une copie. @fr
toolkit label: méthode de production d’un manuscrit @fr
toolkit definition: Le procédé utilisé pour produire un manuscrit original ou une copie. @fr
toolkit label: método de producción para un manuscrito @es
toolkit definition: El proceso utilizado para producir un manuscrito original o una copia. @es
instruction number: 3/9/2002

a pour méthode de production d’une ressource tactile
status: Deprecated
type: Property
domain: C10007
sub property of: has production method
lexical alias: productionMethodForTactileResource.en
toolkit label: production method for tactile resource (Deprecated)
definition: Met une manifestation en relation avec le procédé utilisé pour produire une ressource tactile (par exemple, embossage, thermoformage). @fr
toolkit label: méthode de production d’une ressource tactile @fr
toolkit definition: Le procédé utilisé pour produire une ressource tactile (par exemple, embossage, thermoformage). @fr
toolkit label: método de producción de un recurso táctil @es
toolkit definition: El proceso utilizado para producir un recurso táctil (por ej., repujado, termoformado). @es
instruction number: 3/9/2003

has publisher agent
status: Published
definition: Relates a manifestation to an agent who is responsible for publishing, releasing, or issuing a published manifestation.
type: Property
domain: C10007
lexical alias: publisherAgent.en
instruction number: 21.3
toolkit label: publisher agent
toolkit definition: An agent who is responsible for publishing, releasing, or issuing a published manifestation.
label: a pour agent éditeur @fr
definition: Met une manifestation en relation avec un agent qui est responsable de la publication, de la mise à disposition ou de l’édition d’une manifestation publiée. @fr
toolkit label: agent éditeur @fr
toolkit definition: Agent qui est responsable de la publication, de la mise à disposition ou de l’édition d’une manifestation publiée. @fr
toolkit label: agente publicador @es
toolkit definition: Un agente que es responsable de publicar, divulgar o emitir una manifestación publicada. @es
label: har utgivare @sv
toolkit label: utgivare @sv
sub property of: has creator agent of manifestation
toolkit label: uitgever-actor @nl
toolkit definition: Een actor die verantwoordelijk is voor het uitgeven, uitbrengen of uitvaardigen van een gepubliceerde manifestatie. @nl
label: có nhà xuất bản @vi
definition: Liên kết biểu thị với tác nhân có trách nhiệm xuất bản, đăng tải, hoặc công bố biểu thị. @vi
toolkit label: nhà xuất bản @vi
toolkit definition: Tác nhân có trách nhiệm xuất bản, đăng tải, hoặc công bố biểu thị. @vi
label: har agent, som er udgiver @da
definition: Relaterer en manifestation til en agent, som er ansvarlig for at publicere, frigive eller udgive en manifestation. @da
toolkit label: agent, som er udgiver @da
toolkit definition: Agent, som er ansvarlig for at publicere, frigive eller udgive en manifestation. @da
label: hat Verlag (Akteur) @de
definition: Setzt eine Manifestation in Beziehung zu einem Akteur, der für das Veröffentlichen, die Freigabe oder die Herausgabe einer veröffentlichten Manifestation verantwortlich ist. @de
toolkit label: Verlag (Akteur) @de
toolkit definition: Ein Akteur, der für das Veröffentlichen, die Freigabe oder die Herausgabe einer veröffentlichten Manifestation verantwortlich ist. @de
label: té com a agent editor @ca
definition: Relaciona una manifestació amb un agent que és responsable de la publicació, la posada en circulació o l’emissió d’una manifestació. @ca
toolkit label: agent editor @ca
toolkit definition: Agent que és responsable de la publicació, la posada en circulació o l’emissió d’una manifestació. @ca
definition: Liittää manifestaation toimijaan, joka on vastuussa julkaistun manifestaation kustantamisesta, julkaisemisesta tai ilmestymisestä. @fi
toolkit label: kustantaja (toimija) @fi
toolkit definition: Toimija, joka on vastuussa julkaistun manifestaation kustantamisesta, julkaisemisesta tai ilmestymisestä. @fi
toolkit label: utgiver (agent) @no
toolkit definition: En agent som er ansvarlig for å publisere, tilgjengeliggjøre eller utgi en manifestasjon. @no
label: έχει εκδότη @el
definition: Συνδέει μια εκδήλωση με έναν φορέα υπεύθυνο για τη δημοσίευση, την κυκλοφορία ή την έκδοση μιας εκδήλωσης. @el
toolkit label: εκδότης @el
toolkit definition: Ένας φορέας υπεύθυνος για τη δημοσίευση, την κυκλοφορία ή την έκδοση μιας εκδήλωσης. @el
has element type: 2
label: kiadó ágense a következő: @hu
definition: Hozzákapcsol egy megjelenési formát egy ágenshez, amely felelős egy kiadott megjelenési forma kiadásáért, kibocsájtásáért vagy megjelentetéséért. @hu
toolkit label: kiadó ágens: @hu
toolkit definition: Egy ágens, amely felelős egy kiadott megjelenési forma kiadásáért, kibocsájtásáért vagy megjelentetéséért. @hu
alternative label: publisher
alternative label: kustantaja @fi
label: kustantaja (toimija) @fi
label: har utgiver (agent) @no
definition: Relaterer en manifestasjon til en agent som er ansvarlig for å publisere, tilgjengeliggjøre eller utgi en manifestasjon. @no
alternative label: utgiver @no
alternative label: éditeur @fr
label: heeft uitgever-actor @nl
definition: Relateert een manifestatie aan een actor die verantwoordelijk is voor het uitgeven, uitbrengen of uitvaardigen van een gepubliceerde manifestatie. @nl
label: له وكيل ناشر @ar
definition: يربط بين تجسيدة ووكيل مسئول عن نشر، أو إصدار تجسيدة. @ar
alternative label: ناشر @ar
toolkit label: وكيل ناشر @ar
toolkit definition: وكيل مسئول عن نشر، أو إصدار تجسيدة. @ar
alternative label: editor @ca
alternative label: udgiver @da
label: kirjastaja (tegija) @et
definition: Seostab kehastuse tegijaga, kes vastutab kehastuse avaldamise, väljalaskmise või väljaandmise eest. @et
alternative label: kirjastaja @et
toolkit label: kirjastaja (tegija) @et
toolkit definition: Tegija, kes vastutab kehastuse avaldamise, väljalaskmise või väljaandmise eest. @et
alternative label: kiadó: @hu
label: ha come editore agente @it
definition: Correla una manifestazione all'agente responsabile della pubblicazione, diffusione o emissione di una manifestazione. @it
alternative label: editore @it
toolkit label: editore agente @it
toolkit definition: Agente responsabile della pubblicazione, diffusione o emissione di una manifestazione. @it
label: izdevējs (aģents) @lv
definition: Sasaista manifestāciju ar aģentu, kas ir atbildīgs par resursa izdošanu, publicēšanu vai izlaišanu. @lv
toolkit label: izdevējs (aģents) @lv
toolkit definition: Aģents, kas ir atbildīgs par resursa izdošanu, publicēšanu vai izlaišanu. @lv

has publisher collective agent
status: Published
lexical alias: publisherCollectiveAgent.en
definition: Relates a manifestation to a collective agent who is responsible for publishing, releasing, or issuing a published manifestation.
toolkit label: publisher collective agent
toolkit definition: A collective agent who is responsible for publishing, releasing, or issuing a published manifestation.
type: Property
domain: C10007
has element type: 2
sub property of: has creator collective agent of manifestation
sub property of: has publisher agent
label: kustantaja (yhteistoimija) @fi
definition: Liittää manifestaation yhteistoimijaan, joka on vastuussa julkaistun manifestaation kustantamisesta, julkaisemisesta tai ilmestymisestä. @fi
toolkit label: kustantaja (yhteistoimija) @fi
toolkit definition: Yhteistoimija, joka on vastuussa julkaistun manifestaation kustantamisesta, julkaisemisesta tai ilmestymisestä. @fi
label: har utgiver (kollektiv agent) @no
definition: Relaterer en manifestasjon til en kollektiv agent som er ansvarlig for å publisere, tilgjengeliggjøre eller utgi en manifestasjon. @no
toolkit label: utgiver (kollektiv agent) @no
toolkit definition: En kollektiv agent som er ansvarlig for å publisere, tilgjengeliggjøre eller utgi en manifestasjon. @no
label: a pour agent collectif éditeur @fr
definition: Met une manifestation en relation avec un agent collectif qui est responsable de la publication, de la mise à disposition ou de l’édition d’une manifestation publiée. @fr
toolkit label: agent collectif éditeur @fr
toolkit definition: Agent collectif qui est responsable de la publication, de la mise à disposition ou de l’édition d’une manifestation publiée. @fr
label: heeft uitgever-collectieve actor @nl
definition: Relateert een manifestatie aan een collectieve actor die verantwoordelijk is voor het uitgeven, uitbrengen of uitvaardigen van een gepubliceerde manifestatie. @nl
toolkit label: uitgever-collectieve actor @nl
toolkit definition: Een collectieve actor die verantwoordelijk is voor het uitgeven, uitbrengen of uitvaardigen van een gepubliceerde manifestatie. @nl
label: له وكيل جماعي ناشر @ar
definition: يربط بين تجسيدة ووكيل جماعي مسئول عن نشر، أو إصدار تجسيدة. @ar
toolkit label: وكيل جماعي ناشر @ar
toolkit definition: وكيل جماعي مسئول عن نشر، أو إصدار تجسيدة. @ar
label: té com a agent col·lectiu editor @ca
definition: Relaciona una manifestació amb un agent col·lectiu que és responsable de la publicació, la posada en circulació o l’emissió d’una manifestació publicada. @ca
toolkit label: agent col·lectiu editor @ca
toolkit definition: Agent col·lectiu que és responsable de la publicació, la posada en circulació o l’emissió d’una manifestació publicada. @ca
label: har kollektiv agent, som er udgiver @da
definition: Relaterer en manifestation til en kollektiv agent, som er ansvarlig for at publicere, frigive eller udgive en manifestation. @da
toolkit label: kollektiv agent, som er udgiver @da
toolkit definition: Kollektiv agent, som er ansvarlig for at publicere, frigive eller udgive en manifestation. @da
label: kirjastaja (kollektiiv) @et
definition: Seostab kehastuse kollektiiviga, kes vastutab kehastuse avaldamise, väljalaskmise või väljaandmise eest. @et
toolkit label: kirjastaja (kollektiiv) @et
toolkit definition: Kollektiiv, kes vastutab kehastuse avaldamise, väljalaskmise või väljaandmise eest. @et
label: hat Verlag (Gemeinschaftlicher Akteur) @de
definition: Setzt eine Manifestation in Beziehung zu einem gemeinschaftlichen Akteur, der für das Veröffentlichen, die Freigabe oder die Herausgabe einer veröffentlichten Manifestation verantwortlich ist. @de
toolkit label: Verlag (Gemeinschaftlicher Akteur) @de
toolkit definition: Ein gemeinschaftlicher Akteur, der für das Veröffentlichen, die Freigabe oder die Herausgabe einer veröffentlichten Manifestation verantwortlich ist. @de
label: kiadó kollektív ágense a következő: @hu
definition: Hozzákapcsol egy megjelenési formát egy kollektív ágenshez, amely felelős egy kiadott megjelenési forma kiadásáért, kibocsájtásáért vagy megjelentetéséért. @hu
toolkit label: kiadó kollektív ágens: @hu
toolkit definition: Egy kollektív ágens, amely felelős egy kiadott megjelenési forma kiadásáért, kibocsájtásáért vagy megjelentetéséért. @hu
label: ha come editore agente collettivo @it
definition: Correla una manifestazione all'agente collettivo responsabile della pubblicazione, diffusione o emissione di una manifestazione. @it
toolkit label: editore agente collettivo @it
toolkit definition: Agente collettivo responsabile della pubblicazione, diffusione o emissione di una manifestazione. @it
label: izdevējs (grupa) @lv
definition: Sasaista manifestāciju ar grupu, kas ir atbildīga par resursa izdošanu, publicēšanu vai izlaišanu. @lv
toolkit label: izdevējs (grupa) @lv
toolkit definition: Grupa, kas ir atbildīga par resursa izdošanu, publicēšanu vai izlaišanu. @lv
label: 有出版者集体行为者 @zh-hans
definition: 将一种载体表现与负责出版、发布或发行一种出版载体表现的一个集体行为者关联起来。 @zh-hans
toolkit label: 出版者集体行为者 @zh-hans
toolkit definition: 负责出版、发布或发行一种出版载体表现的一个集体行为者 @zh-hans
label: yayıncı kolektif temsilcisi ile ilişkilidir @tr
definition: Bir gösterimi, yayınlanan bir gösterimi yayınlamaktan, piyasaya sürmekten veya yayımlamaktan sorumlu olan kolektif bir temsilci ile ilişkilendirir. @tr
toolkit label: yayımcı kolektif temsilci @tr
toolkit definition: Yayımlanmış bir gösterimi yayımlamak, piyasaya sürmek veya dağıtmaktan sorumlu olan bir kolektif temsilci. @tr
label: tiene agente colectivo editor @es
definition: Relaciona una manifestación con un agente colectivo que es responsable de publicar, difundir o emitir una manifestación publicada. @es
toolkit label: agente colectivo editor @es
toolkit definition: Un agente colectivo que es responsable de publicar, difundir o emitir una manifestación publicada. @es
has subproperty: has broadcaster collective agent
has subproperty: has publisher corporate body
has subproperty: has publisher family
has subproperty: P30391

has publisher corporate body
status: Published
lexical alias: publisherCorporateBody.en
definition: Relates a manifestation to a corporate body who is responsible for publishing, releasing, or issuing a published manifestation.
toolkit label: publisher corporate body
toolkit definition: A corporate body who is responsible for publishing, releasing, or issuing a published manifestation.
type: Property
domain: C10007
has element type: 2
sub property of: has creator corporate body of manifestation
sub property of: has publisher collective agent
label: kustantaja (yhteisö) @fi
definition: Liittää manifestaation yhteisöön, joka on vastuussa julkaistun manifestaation kustantamisesta, julkaisemisesta tai ilmestymisestä. @fi
toolkit label: kustantaja (yhteisö) @fi
toolkit definition: Yhteisö, joka on vastuussa julkaistun manifestaation kustantamisesta, julkaisemisesta tai ilmestymisestä. @fi
label: har utgiver (korporasjon) @no
definition: Relaterer en manifestasjon til en korporasjon som er ansvarlig for å publisere, tilgjengeliggjøre eller utgi en manifestasjon. @no
toolkit label: utgiver (korporasjon) @no
toolkit definition: En korporasjon som er ansvarlig for å publisere, tilgjengeliggjøre eller utgi en manifestasjon. @no
label: a pour collectivité éditrice @fr
definition: Met une manifestation en relation avec une collectivité qui est responsable de la publication, de la mise à disposition ou de l’édition d’une manifestation publiée. @fr
toolkit label: collectivité éditrice @fr
toolkit definition: Collectivité qui est responsable de la publication, de la mise à disposition ou de l’édition d’une manifestation publiée. @fr
label: heeft uitgever-corporatie @nl
definition: Relateert een manifestatie aan een corporatie die verantwoordelijk is voor het uitgeven, uitbrengen of uitvaardigen van een gepubliceerde manifestatie. @nl
toolkit label: uitgever-corporatie @nl
toolkit definition: Een corporatie die verantwoordelijk is voor het uitgeven, uitbrengen of uitvaardigen van een gepubliceerde manifestatie. @nl
label: له هيئة ناشر @ar
definition: يربط بين تجسيدة وهيئة مسئولة عن نشر، أو إصدار تجسيدة. @ar
toolkit label: هيئة ناشر @ar
toolkit definition: هيئة مسئولة عن نشر، أو إصدار تجسيدة. @ar
label: té com a entitat corporativa editora @ca
definition: Relaciona una manifestació amb una entitat corporativa que és responsable de la publicació, la posada en circulació o l’emissió d’una manifestació publicada. @ca
toolkit label: entitat corporativa editora @ca
toolkit definition: Entitat corporativa que és responsable de la publicació, la posada en circulació o l’emissió d’una manifestació publicada. @ca
label: har korporation, som er udgiver @da
definition: Relaterer en manifestation til en korporation, som er ansvarlig for at publicere, frigive eller udgive en manifestation. @da
toolkit label: korporation, som er udgiver @da
toolkit definition: Korporation, som er ansvarlig for at publicere, frigive eller udgive en manifestation. @da
label: kirjastaja (asutus) @et
definition: Seostab kehastuse asutusega, kes vastutab kehastuse avaldamise, väljalaskmise või väljaandmise eest. @et
toolkit label: kirjastaja (asutus) @et
toolkit definition: Asutus, kes vastutab kehastuse avaldamise, väljalaskmise või väljaandmise eest. @et
label: hat Verlag (Körperschaft) @de
definition: Setzt eine Manifestation in Beziehung zu einer Körperschaft, die für das Veröffentlichen, die Freigabe oder die Herausgabe einer veröffentlichten Manifestation verantwortlich ist. @de
toolkit label: Verlag (Körperschaft) @de
toolkit definition: Eine Körperschaft, die für das Veröffentlichen, die Freigabe oder die Herausgabe einer veröffentlichten Manifestation verantwortlich ist. @de
label: kiadó testülete a következő: @hu
definition: Hozzákapcsol egy megjelenési formát egy testülethez, amely felelős egy kiadott megjelenési forma kiadásáért, kibocsájtásáért vagy megjelentetéséért. @hu
toolkit label: kiadó testület: @hu
toolkit definition: Egy testület, amely felelős egy kiadott megjelenési forma kiadásáért, kibocsájtásáért vagy megjelentetéséért. @hu
label: ha come editore ente @it
definition: Correla una manifestazione all'ente responsabile della pubblicazione, diffusione o emissione di una manifestazione. @it
toolkit label: editore ente @it
toolkit definition: Ente responsabile della pubblicazione, diffusione o emissione di una manifestazione. @it
label: izdevējs (institūcija) @lv
definition: Sasaista manifestāciju ar institūciju, kas ir atbildīga par resursa izdošanu, publicēšanu vai izlaišanu. @lv
toolkit label: izdevējs (institūcija) @lv
toolkit definition: Institūcija, kas ir atbildīga par resursa izdošanu, publicēšanu vai izlaišanu. @lv
label: 有出版者团体 @zh-hans
definition: 将一种载体表现与负责出版、发布或发行一种出版载体表现的一个团体关联起来。 @zh-hans
toolkit label: 出版者团体 @zh-hans
toolkit definition: 负责出版、发布或发行一种出版载体表现的一个团体 @zh-hans
label: yayıncı tüzel kişisi ile ilişkilidir @tr
definition: Bir gösterimi, yayımlanmış gösterimin basımı, satımı veya ihraç edilmesinden sorumlu tüzel kişiyle ilişkilendirir.. @tr
toolkit label: yayımcı tüzel kişi @tr
toolkit definition: Yayımlanmış gösterimin basımı, satımı veya ihraç edilmesinden sorumlu olan tüzel kişi. @tr
label: tiene cuerpo corporativo editor @es
definition: Relaciona una manifestación con un cuerpo corporativo que es responsable de publicar, divulgar o emitir una manifestación publicada. @es
toolkit label: cuerpo corporativo editor @es
toolkit definition: Un cuerpo corporativo que es responsable de publicar, divulgar o emitir una manifestación publicada. @es
has subproperty: has broadcaster corporate body
has subproperty: P30420

has publisher family
status: Published
lexical alias: publisherFamily.en
definition: Relates a manifestation to a family who is responsible for publishing, releasing, or issuing a published manifestation.
toolkit label: publisher family
toolkit definition: A family who is responsible for publishing, releasing, or issuing a published manifestation.
type: Property
domain: C10007
has element type: 2
sub property of: has creator family of manifestation
sub property of: has publisher collective agent
label: kustantaja (suku) @fi
definition: Liittää manifestaation sukuun, joka on vastuussa julkaistun manifestaation kustantamisesta, julkaisemisesta tai ilmestymisestä. @fi
toolkit label: kustantaja (suku) @fi
toolkit definition: Suku, joka on vastuussa julkaistun manifestaation kustantamisesta, julkaisemisesta tai ilmestymisestä. @fi
label: har utgiver (familie) @no
definition: Relaterer en manifestasjon til en familie som er ansvarlig for å publisere, tilgjengeliggjøre eller utgi en manifestasjon. @no
toolkit label: utgiver (familie) @no
toolkit definition: En familie som er ansvarlig for å publisere, tilgjengeliggjøre eller utgi en manifestasjon. @no
label: a pour famille éditrice @fr
definition: Met une manifestation en relation avec une famille qui est responsable de la publication, de la mise à disposition ou de l’édition d’une manifestation publiée. @fr
toolkit label: famille éditrice @fr
toolkit definition: Famille qui est responsable de la publication, de la mise à disposition ou de l’édition d’une manifestation publiée. @fr
label: heeft uitgever-familie @nl
definition: Relateert een manifestatie aan een familie die verantwoordelijk is voor het uitgeven, uitbrengen of uitvaardigen van een gepubliceerde manifestatie. @nl
toolkit label: uitgever-familie @nl
toolkit definition: Een familie die verantwoordelijk is voor het uitgeven, uitbrengen of uitvaardigen van een gepubliceerde manifestatie. @nl
label: له عائلة ناشر @ar
definition: يربط بين تجسيدة وعائلة مسئولة عن نشر، أو إصدار تجسيدة. @ar
toolkit label: عائلة ناشر @ar
toolkit definition: عائلة مسئولة عن نشر، أو إصدار تجسيدة. @ar
label: té com a família editora @ca
definition: Relaciona una manifestació amb una família que és responsable de la publicació, la posada en circulació o l’emissió d’una manifestació publicada. @ca
toolkit label: família editora @ca
toolkit definition: Família que és responsable de la publicació, la posada en circulació o l’emissió d’una manifestació publicada. @ca
label: har familie, som er udgiver @da
definition: Relaterer en manifestation til en familie, som er ansvarlig for at publicere, frigive eller udgive en manifestation. @da
toolkit label: familie, som er udgiver @da
toolkit definition: Familie, som er ansvarlig for at publicere, frigive eller udgive en manifestation. @da
label: kirjastaja (perekond) @et
definition: Seostab kehastuse perekonnaga, kes vastutab kehastuse avaldamise, väljalaskmise või väljaandmise eest. @et
toolkit label: kirjastaja (perekond) @et
toolkit definition: Perekond, kes vastutab kehastuse avaldamise, väljalaskmise või väljaandmise eest. @et
label: hat Verlag (Familie) @de
definition: Setzt eine Manifestation in Beziehung zu einer Familie, die für das Veröffentlichen, die Freigabe oder die Herausgabe einer veröffentlichten Manifestation verantwortlich ist. @de
toolkit label: Verlag (Familie) @de
toolkit definition: Eine Familie, die für das Veröffentlichen, die Freigabe oder die Herausgabe einer veröffentlichten Manifestation verantwortlich ist. @de
label: kiadó családja a következő: @hu
definition: Hozzákapcsol egy megjelenési formát egy családhoz, amely felelős egy kiadott megjelenési forma kiadásáért, kibocsájtásáért vagy megjelentetéséért. @hu
toolkit label: kiadó család: @hu
toolkit definition: Egy család, amely felelős egy kiadott megjelenési forma kiadásáért, kibocsájtásáért vagy megjelentetéséért. @hu
label: ha come editore famiglia @it
definition: Correla una manifestazione alla famiglia responsabile della pubblicazione, diffusione o emissione di una manifestazione. @it
toolkit label: editore famiglia @it
toolkit definition: Famiglia responsabile della pubblicazione, diffusione o emissione di una manifestazione. @it
label: izdevējs (dzimta/ģimene) @lv
definition: Sasaista manifestāciju ar dzimtu/ģimeni, kas ir atbildīga par resursa izdošanu, publicēšanu vai izlaišanu. @lv
toolkit label: izdevējs (dzimta/ģimene) @lv
toolkit definition: Dzimta/ģimene, kas ir atbildīga par resursa izdošanu, publicēšanu vai izlaišanu. @lv
label: 有出版者家族 @zh-hans
definition: 将一种载体表现与负责出版、发布或发行一种出版载体表现的一个家族关联起来。 @zh-hans
toolkit label: 出版者家族 @zh-hans
toolkit definition: 负责出版、发布或发行一种出版载体表现的一个家族 @zh-hans
label: yayıncı ailesi ile ilişkilidir @tr
definition: Bir gösterimi, yayımlama, satma veya yayımlanmış gösterimin ihracından sorumlu aileyle ilişkilendirir. @tr
toolkit label: yayımcı aile @tr
toolkit definition: Yayımlama, piyasaya sürme veya yayımlanmış gösterimin piyasaya çıkarılmasından sorumlu bir aile. @tr
label: es familia editorial @es
definition: Relaciona una manifestación con una familia que es responsable de editar, lanzar o emitir una manifestación publicada. @es
toolkit label: familia editorial @es
toolkit definition: Una familia que es responsable de editar, lanzar o emitir una manifestación publicada. @es
has subproperty: has broadcaster family
has subproperty: P30449

has publisher person
status: Published
lexical alias: publisherPerson.en
definition: Relates a manifestation to a person who is responsible for publishing, releasing, or issuing a published manifestation.
toolkit label: publisher person
toolkit definition: A person who is responsible for publishing, releasing, or issuing a published manifestation.
type: Property
domain: C10007
has element type: 2
sub property of: has creator person of manifestation
sub property of: has publisher agent
label: kustantaja (henkilö) @fi
definition: Liittää manifestaation henkilöön, joka on vastuussa julkaistun manifestaation kustantamisesta, julkaisemisesta tai ilmestymisestä. @fi
toolkit label: kustantaja (henkilö) @fi
toolkit definition: Henkilö, joka on vastuussa julkaistun manifestaation kustantamisesta, julkaisemisesta tai ilmestymisestä. @fi
label: har utgiver (person) @no
definition: Relaterer en manifestasjon til en person som er ansvarlig for å publisere, tilgjengeliggjøre eller utgi en manifestasjon. @no
toolkit label: utgiver (person) @no
toolkit definition: En person som er ansvarlig for å publisere, tilgjengeliggjøre eller utgi en manifestasjon. @no
label: a pour personne éditrice @fr
definition: Met une manifestation en relation avec une personne qui est responsable de la publication, de la mise à disposition ou de l’édition d’une manifestation publiée. @fr
toolkit label: personne éditrice @fr
toolkit definition: Personne qui est responsable de la publication, de la mise à disposition ou de l’édition d’une manifestation publiée. @fr
label: heeft uitgever-persoon @nl
definition: Relateert een manifestatie aan een persoon die verantwoordelijk is voor het uitgeven, uitbrengen of uitvaardigen van een gepubliceerde manifestatie. @nl
toolkit label: uitgever-persoon @nl
toolkit definition: Een persoon die verantwoordelijk is voor het uitgeven, uitbrengen of uitvaardigen van een gepubliceerde manifestatie. @nl
label: له شخص ناشر @ar
definition: يربط بين تجسيدة وشخص مسئول عن نشر، أو إصدار تجسيدة. @ar
toolkit label: شخص ناشر @ar
toolkit definition: شخص مسئول عن نشر، أو إصدار تجسيدة. @ar
label: té com a persona editora @ca
definition: Relaciona una manifestació amb una persona que és responsable de la publicació, la posada en circulació o l’emissió d’una manifestació publicada. @ca
toolkit label: persona editora @ca
toolkit definition: Persona que és responsable de la publicació, la posada en circulació o l’emissió d’una manifestació publicada. @ca
label: har person, som er udgiver @da
definition: Relaterer en manifestation til en person, som er ansvarlig for at publicere, frigive eller udgive en manifestation. @da
toolkit label: person, som er udgiver @da
toolkit definition: Person, som er ansvarlig for at publicere, frigive eller udgive en manifestation. @da
label: kirjastaja (isik) @et
definition: Seostab kehastuse isikuga, kes vastutab kehastuse avaldamise, väljalaskmise või väljaandmise eest. @et
toolkit label: kirjastaja (isik) @et
toolkit definition: Isik, kes vastutab kehastuse avaldamise, väljalaskmise või väljaandmise eest. @et
label: hat Verlag (Person) @de
definition: Setzt eine Manifestation in Beziehung zu einer Person, die für das Veröffentlichen, die Freigabe oder die Herausgabe einer veröffentlichten Manifestation verantwortlich ist. @de
toolkit label: Verlag (Person) @de
toolkit definition: Eine Person, die für das Veröffentlichen, die Freigabe oder die Herausgabe einer veröffentlichten Manifestation verantwortlich ist. @de
label: kiadó személye a következő: @hu
definition: Hozzákapcsol egy megjelenési formát egy személyhez, aki felelős egy kiadott megjelenési forma kiadásáért, kibocsájtásáért vagy megjelentetéséért. @hu
toolkit label: kiadó személy: @hu
toolkit definition: Egy személy, aki felelős egy kiadott megjelenési forma kiadásáért, kibocsájtásáért vagy megjelentetéséért. @hu
label: ha come editore persona @it
definition: Correla una manifestazione alla persona responsabile della pubblicazione, diffusione o emissione di una manifestazione. @it
toolkit label: editore persona @it
toolkit definition: Persona responsabile della pubblicazione, diffusione o emissione di una manifestazione. @it
label: izdevējs (persona) @lv
definition: Sasaista manifestāciju ar personu, kura ir atbildīga par resursa izdošanu, publicēšanu vai izlaišanu. @lv
toolkit label: izdevējs (persona) @lv
toolkit definition: Persona, kura ir atbildīga par resursa izdošanu, publicēšanu vai izlaišanu. @lv
label: 有出版者个人 @zh-hans
definition: 将一种载体表现与负责出版、发布或发行一种出版载体表现的一个个人关联起来。 @zh-hans
toolkit label: 出版者个人 @zh-hans
toolkit definition: 负责出版、发布或发行一种出版载体表现的一个个人 @zh-hans
label: yayıncı kişisi ile ilişkilidir @tr
definition: Bir gösterimi, yayınlanan bir gösterimi yayınlamaktan, piyasaya sunmaktan veya yayımlamaktan sorumlu olan bir kişiyle ilişkilendirir. @tr
toolkit label: yayımcı kişi @tr
toolkit definition: Yayınlanmış bir gösterimi yayınlamaktan veya yayımlamaktan sorumlu kişi. @tr
label: tiene persona editora @es
definition: Relaciona una manifestación con una persona que es responsable de publicar, divulgar o emitir una manifestación publicada. @es
toolkit definition: Una persona que es responsable de publicar, divulgar o emitir una manifestación publicada. @es
has subproperty: has broadcaster person
has subproperty: P30362

has regional encoding
status: Published
definition: Relates a manifestation to a designation for one or more regions of the world for which a videodisc or video game carrier has been encoded, indicating that playback is restricted to a device configured to decode it.
type: Property
domain: C10007
sub property of: has digital file characteristic
lexical alias: regionalEncoding.en
instruction number: 3.19.6
toolkit label: regional encoding
toolkit definition: A designation for one or more regions of the world for which a videodisc or video game carrier has been encoded, indicating that playback is restricted to a device configured to decode it.
label: a pour code de région @fr
definition: Met une manifestation en relation avec une désignation d’une ou plusieurs régions du monde pour laquelle un vidéodisque ou un support matériel de jeu vidéo a été encodé, qui indique que sa lecture est limitée à un appareil configuré pour le décoder. @fr
toolkit label: code de région @fr
toolkit definition: Désignation d’une ou plusieurs régions du monde pour laquelle un vidéodisque ou un support matériel de jeu vidéo a été encodé, qui indique que sa lecture est limitée à un appareil configuré pour le décoder. @fr
toolkit label: codificación regional @es
toolkit definition: Una designación para una o mas regiones del mundo para las cuales un soporte de videodisco o videojuego ha sido codificado, indicando que la reproducción esta restringida a un dispositivo configurado para decodificarlo. @es
label: har regionkod @sv
toolkit label: regionkod @sv
toolkit label: regiocodering @nl
toolkit definition: Een aanduiding voor één of meer regio's van de wereld waarmee een videodisk of computerspeldrager gecodeerd is, om aan te geven dat afspelen is beperkt tot apparaten geconfigureerd om deze te decoderen. @nl
label: có lập mã vùng @vi
definition: Liên kết biểu thị với định danh cho một hoặc nhiều hơn vùng trên thế giới mà vật mang tin đĩa video hoặc trò chơi video được lập mã, chỉ ra rằng phát lại bị cấm đối với thiết bị được cấu hình để giải mã. @vi
toolkit label: lập mã vùng @vi
toolkit definition: Định danh cho một hoặc nhiều hơn vùng trên thế giới mà vật mang tin đĩa video hoặc trò chơi video được lập mã, chỉ ra rằng phát lại bị cấm đối với thiết bị được cấu hình để giải mã. @vi
label: har regional kodning @da
definition: Relaterer en manifestation til en betegnelse for en eller flere regioner i verden, som en videodisk eller spillekonsol er kodet til, hvormed afspilning er forbeholdt en enhed, som er konfigureret til at afkode regionskoden. @da
toolkit label: regional kodning @da
toolkit definition: Betegnelse for en eller flere regioner i verden, som en videodisk eller spillekonsol er kodet til, hvormed afspilning er forbeholdt en enhed, som er konfigureret til at afkode regionskoden. @da
label: hat Regionalcode @de
definition: Setzt eine Manifestation in Beziehung zu einer Bezeichnung, die die Region(en) der Welt angibt, für die eine Videodisk oder ein Videospiel-Datenträger kodiert ist, und die verhindert, dass die Disk von einem Wiedergabegerät, das in einer anderen Region verkauft wurde, abgespielt werden kann. @de
toolkit label: Regionalcode @de
toolkit definition: Eine Bezeichnung, die die Region(en) der Welt angibt, für die eine Videodisk oder ein Videospiel-Datenträger kodiert ist, und die verhindert, dass die Disk von einem Wiedergabegerät, das in einer anderen Region verkauft wurde, abgespielt werden kann. @de
label: té com a codificació regional @ca
definition: Relaciona una manifestació amb una designació d’una o més regions del món per a la qual s’ha codificat un suport físic de videodisc o videojoc, indicant que la reproducció és restringida a un dispositiu configurat per descodificar-lo. @ca
toolkit label: codificació regional @ca
toolkit definition: Designació d’una o més regions del món per a la qual s’ha codificat un suport físic de videodisc o videojoc, indicant que la reproducció és restringida a un dispositiu configurat per descodificar-lo. @ca
definition: Liittää manifestaation määritteeseen, jolla identifioidaan videolevyn tai videopelitallenteen käyttöalue ja estetään niiden käyttäminen toisella alueella myydyllä soittimella. @fi
toolkit label: aluekoodi @fi
toolkit definition: Määrite, jolla tunnistetaan videolevyn tai videopelitallenteen käyttöalue ja estetään niiden käyttäminen toisella alueella myydyllä soittimella. @fi
toolkit label: regionkode @no
toolkit definition: En betegnelse for én eller flere geografiske regioner som en videoplate eller videospillbærer er kodet for, og som angir at avspilling er begrenset til enheter som er konfigurert for å dekode plater eller bærere med denne kodingen. @no
label: έχει περιφερειακή κωδικοποίηση @el
definition: Συνδέει μια εκδήλωση με έναν προσδιορισμό για μία ή περισσότερες περιοχές του κόσμου για τις οποίες έχει κωδικοποιηθεί ένας φορέας αποθήκευσης βιντεοδίσκου ή βίντεο-παιχνιδιού, δηλώνοντας ότι η αναπαραγωγή περιορίζεται σε μια συσκευή διαμορφωμένη για την αποκωδικοποίησή της. @el
toolkit label: περιφερειακή κωδικοποίηση @el
toolkit definition: Ένας προσδιορισμός για μία ή περισσότερες περιοχές του κόσμου για τις οποίες έχει κωδικοποιηθεί ένας φορέας αποθήκευσης βιντεοδίσκου ή βίντεο-παιχνιδιού, δηλώνοντας ότι η αναπαραγωγή περιορίζεται σε μια συσκευή διαμορφωμένη για την αποκωδικοποίησή της. @el
has element type: 4
label: regionális kódolása a következő: @hu
definition: Hozzákapcsol egy megjelenési formát egy a világ egy vagy több régiójára vonatkozó jelöléshez, amelyre egy videólemezt vagy egy videójáték-hordozót kódoltak, jelezve hogy a visszajátszás annak dekódolására konfigurált készülékre korlátozódik. @hu
toolkit label: regionális kódolása: @hu
toolkit definition: Egy a világ egy vagy több régiójára vonatkozó jelölés, amelyre egy videólemezt vagy egy videójáték-hordozót kódoltak, jelezve hogy a visszajátszás annak dekódolására konfigurált készülékre korlátozódik. @hu
label: aluekoodi @fi
label: har regionkode @no
definition: Relaterer en manifestasjon til en betegnelse for én eller flere geografiske regioner som en videoplate eller videospillbærer er kodet for, og som angir at avspilling er begrenset til enheter som er konfigurert for å dekode plater eller bærere med denne kodingen. @no
label: heeft regiocodering @nl
definition: Relateert een manifestatie aan een aanduiding voor één of meer regio's van de wereld waarmee een videodisk of computerspeldrager gecodeerd is, om aan te geven dat afspelen is beperkt tot apparaten geconfigureerd om deze te decoderen. @nl
label: له كود منطقة @ar
definition: يربط بين تجسيدة وتسمية لواحدة أو أكثر من مناطق العالم التي تم تكويد حامل الفيديو أو ألعاب الفيديو، يشير إلى أن عملية التشغيل مقصورة على الأجهزة المكودة بكود المنطقة فقط. @ar
toolkit label: كود منطقة @ar
toolkit definition: تسمية لواحدة أو أكثر من مناطق العالم التي تم تكويد حامل الفيديو أو ألعاب الفيديو، يشير إلى أن عملية التشغيل مقصورة على الأجهزة المكودة بكود المنطقة فقط. @ar
label: regioonikood @et
definition: Seostab kehastuse tähistusega, mis märgib üht või mitut maailma regiooni, mille jaoks videoplaat või videomängu kandja on kodeeritud, nii et taasesitus on võimalik ainult selle dekodeerimiseks sobiva seadmega. @et
toolkit label: regioonikood @et
toolkit definition: Tähistus, mis märgib üht või mitut maailma regiooni, mille jaoks videoplaat või videomängu kandja on kodeeritud, nii et taasesitus on võimalik ainult selle dekodeerimiseks sobiva seadmega. @et
label: nomena avots @lv
definition: Sasaista manifestāciju ar avotu, kurā ir pierādījumi par nomena izmantošanu. @lv
toolkit label: nomena avots @lv
toolkit definition: Avots, kurā ir pierādījumi par nomena izmantošanu. @lv
label: 有地区编码 @zh-hans
definition: 将一种载体表现与视盘或视频游戏载体被编码后表示对设置解码回放的设备限制的世界上一个或多个地区的标识关联起来。 @zh-hans
toolkit label: 地区编码 @zh-hans
toolkit definition: 视盘或视频游戏载体被编码后表示对设置解码回放的设备限制的世界上一个或多个地区的标识 @zh-hans
label: bölgesel kodlama ile ilişkilidir @tr
definition: Bir gösterimi, bir video diskin veya video oyunu taşıyıcısının kodlandığı dünyanın bir veya daha fazla bölgesi için bir gösterimle ilişkilendirir ve oynatmanın, kodunu çözecek şekilde yapılandırılmış bir cihazla sınırlı olduğunu gösterir. @tr
toolkit label: bölgesel kodlama @tr
toolkit definition: Bir videodisk veya video oyunu taşıyıcısının kodlandığı dünyanın bir veya daha fazla bölgesi için, oynatmanın kodu çözmek için yapılandırılmış bir cihazla sınırlı olduğunu gösteren bir tanımlama. @tr
label: tiene codificación regional @es
definition: Relaciona una manifestación con una designación para una o mas regiones del mundo para las cuales un soporte de videodisco o videojuego ha sido codificado, indicando que la reproducción esta restringida a un dispositivo configurado para decodificarlo. @es
has subproperty: P30006

has details of regional encoding
status: Published
type: Property
lexical alias: detailsOfRegionalEncoding.en
definition: Relates a manifestation to details of a designation for one or more regions of the world for which a videodisc or video game carrier has been encoded, indicating that playback is restricted to a device configured to decode it.
domain: C10007
instruction number: 3.19.6.4
toolkit label: details of regional encoding
toolkit definition: Details of a designation for one or more regions of the world for which a videodisc or video game carrier has been encoded, indicating that playback is restricted to a device configured to decode it.
sub property of: has details of digital file characteristic
label: có chi tiết của lập mã vùng @vi
definition: Liên kết biểu thị với chi tiết của định danh của một hoặc nhiều hơn vùng của thế giới mà vật mang tin đĩa video hoặc trò chơi video được lập mã, chỉ ra rằng phát lại bị cấm đối với thiết bị được cấu hình để giải mã nó. @vi
toolkit label: chi tiết của lập mã vùng @vi
toolkit definition: Chi tiết của định danh của một hoặc nhiều hơn vùng của thế giới mà vật mang tin đĩa video hoặc trò chơi video được lập mã, chỉ ra rằng phát lại bị cấm đối với thiết bị được cấu hình để giải mã nó. @vi
label: har detaljer om regional kodning @da
definition: Relaterer en manifestation til detaljer om en betegnelse for en eller flere regioner i verden, som en videodisk eller spillekonsol er kodet til, hvormed afspilning er forbeholdt en enhed, som er konfigureret til at afkode regionskoden. @da
toolkit label: detaljer om regional kodning @da
toolkit definition: Detaljer om en betegnelse for en eller flere regioner i verden, som en videodisk eller spillekonsol er kodet til, hvormed afspilning er forbeholdt en enhed, som er konfigureret til at afkode regionskoden. @da
label: hat Details zum Regionalcode @de
toolkit label: Details zum Regionalcode @de
toolkit definition: Details einer Bezeichnung, die die Region(en) der Welt angibt, für die eine Videodisk oder ein Videospiel-Datenträger kodiert ist, und der verhindert, dass die Disk von einem Wiedergabegerät, das in einer anderen Region verkauft wurde, abgespielt werden kann. @de
definition: Setzt eine Manifestation in Beziehung zu Details einer Bezeichnung, die die Region(en) der Welt angibt, für die eine Videodisk oder ein Videospiel-Datenträger kodiert ist, und der verhindert, dass die Disk von einem Wiedergabegerät, das in einer anderen Region verkauft wurde, abgespielt werden kann. @de
label: té com a particularitats de codificació regional @ca
definition: Relaciona una manifestació amb les particularitats d’una designació d’una o més regions del món per a la qual s’ha codificat un suport físic de videodisc o videojoc, indicant que la reproducció és restringida a un dispositiu configurat per descodificar-lo. @ca
toolkit label: particularitats de codificació regional @ca
toolkit definition: Particularitats d’una designació d’una o més regions del món per a la qual s’ha codificat un suport físic de videodisc o videojoc, indicant que la reproducció és restringida a un dispositiu configurat per descodificar-lo. @ca
definition: Liittää manifestaation tarkempiin tietoihin määritteestä, jolla identifioidaan videolevyn tai videopelitallenteen käyttöalue ja estetään niiden käyttäminen toisella alueella myydyllä soittimella. @fi
toolkit label: aluekoodin tarkemmat tiedot @fi
toolkit definition: Tarkemmat tiedot määritteestä, jolla identifioidaan videolevyn tai videopelitallenteen käyttöalue ja estetään niiden käyttäminen toisella alueella myydyllä soittimella. @fi
toolkit label: detaljer vedrørende regionkoder @no
toolkit definition: Detaljer vedrørende en betegnelse for én eller flere geografiske regioner som en videoplate eller videospillbærer er kodet for, og som angir at avspilling er begrenset til enheter som er konfigurert for å dekode plater eller bærere med denne kodingen. @no
label: έχει λεπτομέρειες του κωδικού περιοχής @el
definition: Συνδέει μια εκδήλωση με τις λεπτομέρειες ενός προσδιορισμού για μία ή περισσότερες περιοχές του κόσμου για τις οποίες ένας φορέας αποθήκευσης βιντεοδίσκου ή βίντεο-παιχνιδιού έχει κωδικοποιηθεί, δηλώνοντας ότι η αναπαραγωγή περιορίζεται σε μια συσκευή διαμορφωμένη για την αποκωδικοποίησή της. @el
toolkit label: λεπτομέρειες του κωδικού της περιοχής @el
toolkit definition: Λεπτομέρειες ενός προσδιορισμού για μία ή περισσότερες περιοχές του κόσμου για τις οποίες ένας φορέας αποθήκευσης βιντεοδίσκου ή βίντεο-παιχνιδιού έχει κωδικοποιηθεί, δηλώνοντας ότι η αναπαραγωγή περιορίζεται σε μια συσκευή διαμορφωμένη για την αποκωδικοποίησή της. @el
label: a pour particularités d’un code de région @fr
definition: Met une manifestation en relation avec des particularités d’une désignation d’une ou plusieurs régions du monde pour laquelle un vidéodisque ou un support matériel de jeu vidéo a été encodé, qui indique que sa lecture est limitée à un appareil configuré pour le décoder. @fr
toolkit label: particularités d’un code de région @fr
toolkit definition: Particularités d’une désignation d’une ou plusieurs régions du monde pour laquelle un vidéodisque ou un support matériel de jeu vidéo a été encodé, qui indique que sa lecture est limitée à un appareil configuré pour le décoder. @fr
has element type: 6
label: regionális kódolás részletei a következők: @hu
definition: Hozzákapcsol egy megjelenési formát egy a világ egy vagy több régiójára vonatkozó jelölés részleteihez, amelyre egy videólemezt vagy egy videójáték-hordozót kódoltak, jelezve, hogy a visszajátszás az annak dekódolására konfigurált készülékre korlátozódik. @hu
toolkit label: regionális kódolás részletei: @hu
toolkit definition: Egy a világ egy vagy több régiójára vonatkozó jelölés részletei, amelyre egy videólemezt vagy egy videójáték-hordozót kódoltak, jelezve, hogy a visszajátszás az annak dekódolására konfigurált készülékre korlátozódik. @hu
label: aluekoodin tarkemmat tiedot @fi
label: har detaljer vedrørende regionkoder @no
definition: Relaterer en manifestasjon til detaljer vedrørende en betegnelse for én eller flere geografiske regioner som en videoplate eller videospillbærer er kodet for, og som angir at avspilling er begrenset til enheter som er konfigurert for å dekode plater eller bærere med denne kodingen. @no
label: heeft details van regiocodering @nl
definition: Relateert een manifestatie aan details van een aanduiding van één of meer regio's van de wereld waarvoor een videodisk of computerspeldrager gecodeerd is, om aan te geven dat het afspelen beperkt is tot een apparaat dat deze kan decoderen. @nl
toolkit label: details van regiocodering @nl
toolkit definition: Details van een aanduiding van één of meer regio's van de wereld waarvoor een videodisk of computerspeldrager gecodeerd is, om aan te geven dat het afspelen beperkt is tot een apparaat dat deze kan decoderen. @nl
label: له تفاصيل تكويد مناطق @ar
definition: يربط بين تجسيدة وتفاصيل تسمية لمنطقة أو أكثر من العالم التي بناء عليها تم تكويد حامل قرص الفيديو أو ألعاب الفيديو لتحديد أن التشغيل مقيد بجهاز معد لفك الكود. @ar
toolkit label: تفاصيل تكويد مناطق @ar
toolkit definition: تفاصيل تسمية لمنطقة أو أكثر من العالم التي بناء عليها تم تكويد حامل قرص الفيديو أو ألعاب الفيديو لتحديد أن التشغيل مقيد بجهاز معد لفك الكود. @ar
label: regioonikoodi täpsustus @et
definition: Seostab kehastuse täpsemate andmetega tähistuse kohta, mis märgib üht või mitut maailma regiooni, mille jaoks videoplaat või videomängu kandja on kodeeritud, nii et taasesitus on võimalik ainult selle dekodeerimiseks sobiva seadmega. @et
toolkit label: regioonikoodi täpsustus @et
toolkit definition: Täpsemad andmed tähistuse kohta, mis märgib üht või mitut maailma regiooni, mille jaoks videoplaat või videomängu kandja on kodeeritud, nii et taasesitus on võimalik ainult selle dekodeerimiseks sobiva seadmega. @et
label: ha come particolari relativi alla codifica regionale @it
definition: Correla una manifestazione ai particolari relativi a una designazione per una o più regioni del mondo per le quali un supporto di video disco o videogioco è stato codificato e che indica che la lettura è limitata a un dispositivo configurato per la decodifica. @it
toolkit label: particolari relativi alla codifica regionale @it
toolkit definition: Particolari relativi a una designazione per una o più regioni del mondo per le quali un supporto di video disco o videogioco è stato codificato e che indica che la lettura è limitata a un dispositivo configurato per la decodifica. @it
label: detalizēti par reģionālo kodēšanu @lv
definition: Sasaista manifestāciju ar sīkāku informāciju par viena vai vairāku pasaules reģionu apzīmējumiem, kuriem ir paredzēts kodētais videodiska vai videospēļu nesējs, norādot, ka atskaņošana ir ierobežota un ierakstam nepieciešama atkodēšana. @lv
toolkit label: detalizēti par reģionālo kodēšanu @lv
toolkit definition: Sīkāka informācija par viena vai vairāku pasaules reģionu apzīmējumiem, kuriem ir paredzēts kodētais videodiska vai videospēļu nesējs, norādot, ka atskaņošana ir ierobežota un ierakstam nepieciešama atkodēšana. @lv
label: 有地区编码的细节 @zh-hans
definition: 将一种载体表现与视盘或视频游戏载体被编码后表示对设置解码回放的设备限制的世界上一个或多个地区的标识的细节关联起来。 @zh-hans
toolkit label: 地区编码的细节 @zh-hans
toolkit definition: 视盘或视频游戏载体被编码后表示对设置解码回放的设备限制的世界上一个或多个地区的标识的细节 @zh-hans
label: bölgesel kodlama ayrıntıları ile ilişkilidir @tr
definition: Bir gösterimi, bir video diskin veya video oyunu taşıyıcısının kodlandığı dünyanın bir veya daha fazla bölgesi için bir atamanın ayrıntılarıyla ilişkilendirir ve oynatmanın, onu deşifre etmek için konfigüre edilmiş bir cihazla sınırlı olduğunu belirtir. @tr
toolkit label: bölgesel kodlamanın ayrıntıları @tr
toolkit definition: Bir video diskin veya video oyun taşıyıcısının kodlandığı dünyanın bir veya daha fazla bölgesi için, oynatmanın onu çözmek için yapılandırılmış bir cihazla sınırlı olduğunu gösteren bir tanımlamanın ayrıntıları. @tr
label: tiene detalles de codificación regional @es
definition: Relaciona una manifestación con detalles de una designación para una o más regiones del mundo para las cuales se ha codificado un soporte de videodisco o videojuego, indicando que la reproducción está restringida a un dispositivo configurado para decodificarlo. @es
toolkit label: detalles de codificación regional @es
toolkit definition: Detalles de una designación para una o más regiones del mundo para las cuales se ha codificado un soporte de videodisco o videojuego, indicando que la reproducción está restringida a un dispositivo configurado para decodificarlo. @es
has subproperty: P30275

has related entity of manifestation
status: Published
lexical alias: relatedEntityOfManifestation.en
definition: Relates a manifestation to an entity that is associated with a manifestation.
toolkit label: related entity of manifestation
toolkit definition: An entity that is associated with a manifestation.
type: Property
domain: C10007
has element type: 1
sub property of: P00028
label: manifestaatioon liittyvä entiteetti @fi
definition: Liittää manifestaation entiteettiin, joka liittyy manifestaatioon. @fi
toolkit label: manifestaatioon liittyvä entiteetti @fi
toolkit definition: Entiteetti, joka liittyy manifestaatioon. @fi
label: har relatert entitet til manifestasjon @no
definition: Relaterer en manifestasjon til en entitet som forbindes med en manifestasjon. @no
toolkit label: relatert entitet til manifestasjon @no
toolkit definition: En entitet som forbindes med en manifestasjon. @no
label: a pour entité en relation avec une manifestation @fr
definition: Met une manifestation en relation avec une entité qui est associée à une manifestation. @fr
toolkit label: entité en relation avec une manifestation @fr
toolkit definition: Entité qui est associée à une manifestation. @fr
label: heeft gerelateerde entiteit van manifestatie @nl
definition: Relateert een manifestatie aan een entiteit die geassocieerd is met een manifestatie. @nl
toolkit label: gerelateerde entiteit van manifestatie @nl
toolkit definition: Een entiteit die geassocieerd is met een manifestatie. @nl
label: له كيان مرتبط لتجسيدة @ar
definition: يربط بين تجسيدة وكيان مرتبط بتجسيدة. @ar
toolkit label: كيان مرتبط لتجسيدة @ar
toolkit definition: كيان مرتبط بتجسيدة. @ar
label: té com a entitat relacionada amb una manifestació @ca
definition: Relaciona una manifestació amb una entitat que s’associa amb una manifestació. @ca
toolkit label: entitat relacionada amb una manifestació @ca
toolkit definition: Entitat que s’associa amb una manifestació. @ca
label: har entitet relateret til manifestation @da
definition: Relaterer en manifestation til en entitet, som er knyttet til en manifestation. @da
toolkit label: entitet relateret til manifestation @da
toolkit definition: Entitet, som er knyttet til en manifestation. @da
label: kehastusega seotud olem @et
definition: Seostab kehastuse kehastusega seotud olemiga. @et
toolkit label: kehastusega seotud olem @et
toolkit definition: Kehastusega seotud olem. @et
label: hat mit Manifestation in Beziehung stehende Entität @de
definition: Setzt eine Manifestation in Beziehung zu einer Entität, die mit einer Manifestation in Verbindung steht. @de
toolkit label: mit Manifestation in Beziehung stehende Entität @de
toolkit definition: Eine Entität, die mit einer Manifestation in Verbindung steht. @de
label: megjelenési forma kapcsolódó entitása a következő: @hu
definition: Hozzákapcsol egy megjelenési formát egy entitáshoz, amelyet egy megjelenési formához társítanak. @hu
toolkit label: megjelenési forma kapcsolódó entitása @hu
toolkit definition: Egy entitás, amelyet egy megjelenési formához társítanak. @hu
label: ar manifestāciju saistītā entīte @lv
definition: Sasaista manifestāciju ar entīti, kas saistīta ar manifestāciju. @lv
toolkit label: ar manifestāciju saistītā entīte @lv
toolkit definition: Entīte, kas saistīta ar manifestāciju. @lv
label: 有载体表现的关联实体 @zh-hans
definition: 将一种载体表现与和一种载体表现有关的一个实体关联起来。 @zh-hans
toolkit label: 载体表现的关联实体 @zh-hans
toolkit definition: 和一种载体表现有关的一个实体 @zh-hans
label: gösterimin ilgili varlığı ile ilişkilidir @tr
definition: Bir gösterimi bir gösterimle ilişkili bir varlıkla ilişkilendirir. @tr
toolkit label: Anlatımın ilişkili olduğu varlık @tr
toolkit definition: Bir gösterimle bağlantılı olan bir varlık. @tr
label: tiene entidad de manifestación relacionada @es
definition: Relaciona una manifestación con una entidad que está asociada a una manifestación. @es
toolkit label: entidad de manifestación relacionada @es
toolkit definition: Una entidad que está asociada a una manifestación. @es
has subproperty: has related RDA entity of manifestation
has subproperty: P30330

has related RDA entity of manifestation
status: Published
sub property of: has related entity of manifestation
type: Property
lexical alias: relatedRDAEntityOfManifestation.en
definition: Relates a manifestation to an RDA entity that is associated with a manifestation.
domain: C10007
label: có biểu thị thực thể có liên quan @vi
definition: Liên kết biểu thị với thực thể liên quan tới biểu thị đang được mô tả. @vi
label: har RDA-entitet relateret til manifestation @da
definition: Relaterer en manifestation til en RDA-entitet, som er knyttet til en manifestation. @da
label: té com a entitat RDA relacionada amb una manifestació @ca
definition: Relaciona una manifestació amb una entitat RDA que s’associa amb una manifestació. @ca
definition: Liittää manifestaation RDA-entiteettiin, joka liittyy manifestaatioon. @fi
toolkit label: manifestaatioon liittyvä RDA-entiteetti @fi
toolkit definition: RDA-entiteetti, joka liittyy manifestaatioon. @fi
label: έχει σχετική οντότητα (εκδήλωση) @el
definition: Συνδέει μια εκδήλωση με μια οντότητα που συνδέεται με μια περιγραφόμενη εκδήλωση. @el
label: a pour entité RDA en relation avec une manifestation @fr
definition: Met une manifestation en relation avec une entité RDA qui est associée à une manifestation. @fr
toolkit label: related RDA entity of manifestation
toolkit definition: An RDA entity that is associated with a manifestation.
has element type: 1
label: megjelenési forma kapcsolódó RDA-entitása a következő: @hu
definition: Hozzákapcsol egy megjelenési formát egy RDA-entitáshoz, amelyet egy megjelenési formához társítanak. @hu
sub property of: P00001
label: manifestaatioon liittyvä RDA-entiteetti @fi
label: har RDA-entitet relatert til manifestasjon @no
definition: Relaterer en manifestasjon til en RDA-entitet som forbindes med en manifestasjon. @no
toolkit label: RDA-entitet relatert til manifestasjon @no
toolkit definition: En RDA-entitet som forbindes med en manifestasjon. @no
toolkit label: entité RDA en relation avec une manifestation @fr
toolkit definition: Entité RDA qui est associée à une manifestation. @fr
label: heeft gerelateerde RDA-entiteit van manifestatie @nl
definition: Relateert een manifestatie aan een RDA-entiteit die geassocieerd is met een manifestatie. @nl
toolkit label: gerelateerde RDA-entiteit van manifestatie @nl
toolkit definition: Een RDA-entiteit die geassocieerd is met een manifestatie. @nl
label: له كيان وام مرتبط بتجسيدة @ar
definition: يربط بين تجسيدة وكيان وام يرتبط بتجسيدة. @ar
toolkit label: كيان وام مرتبط بتجسيدة @ar
toolkit definition: كيان وام يرتبط بتجسيدة. @ar
toolkit label: entitat RDA relacionada amb una manifestació @ca
toolkit definition: Entitat RDA que s’associa amb una manifestació. @ca
toolkit label: RDA-entitet relateret til manifestation @da
toolkit definition: RDA-entitet, som er knyttet til en manifestation. @da
label: kehastusega seotud RDA olem @et
definition: Seostab kehastuse kehastusega seotud RDA olemiga. @et
toolkit label: kehastusega seotud RDA olem @et
toolkit definition: Kehastusega seotud RDA olem. @et
label: hat mit Manifestation in Beziehung stehende RDA-Entität @de
definition: Setzt eine Manifestation in Beziehung zu einer RDA-Entität, die mit einer Manifestation in Verbindung steht. @de
toolkit label: mit Manifestation in Beziehung stehende RDA-Entität @de
toolkit definition: Eine RDA-Entität, die mit einer Manifestation in Verbindung steht. @de
toolkit label: megjelenési formával kapcsolatban álló RDA-entitás @hu
toolkit definition: Egy RDA-entitás, amelyet egy megjelenési formához társítanak. @hu
label: ha come entità RDA di manifestazione correlata @it
definition: Correla una manifestazione a un'entità RDA associata a una manifestazione. @it
toolkit label: entità RDA di manifestazione correlata @it
toolkit definition: Entità RDA associata a una manifestazione. @it
label: ar manifestāciju saistītā RDA entīte @lv
definition: Sasaista manifestāciju ar RDA entīti, kas saistīta ar manifestāciju. @lv
toolkit label: ar manifestāciju saistītā RDA entīte @lv
toolkit definition: RDA entīte, kas saistīta ar manifestāciju. @lv
label: 有载体表现的关联RDA实体 @zh-hans
definition: 将一种载体表现与和一种载体表现有关的一个RDA实体关联起来。 @zh-hans
toolkit label: 载体表现的关联RDA实体 @zh-hans
toolkit definition: 和一种载体表现有关的一个RDA实体 @zh-hans
label: gösterimin ilgili RDA varlığı ile ilişkilidir @tr
definition: Bir gösterimi, bir gösterimle ilişkili bir RDA varlığıyla ilişkilendirir. @tr
toolkit label: göstermin RDA varlığuyla ilişkisi @tr
toolkit definition: Bir gösterimle bağlantılı olan bir RDA varlığı. @tr
label: tiene una entidad de manifestación RDA relacionada @es
definition: Relaciona una manifestación con una entidad RDA que está asociada con una manifestación. @es
toolkit label: entidad de manifestación RDA relacionada @es
toolkit definition: Una entidad RDA que está asociada con una manifestación. @es
has subproperty: has related agent of manifestation
has subproperty: has related place of manifestation
has subproperty: has related timespan of manifestation
has subproperty: has related expression of manifestation
has subproperty: has related work of manifestation

has term of availability
status: Published
definition: Relates a manifestation to a condition under which a distributor, manufacturer, producer, or publisher will normally supply a manifestation.
type: Property
domain: C10007
lexical alias: termOfAvailability.en
instruction number: 4.2
toolkit label: term of availability
toolkit definition: A condition under which a distributor, manufacturer, producer, or publisher will normally supply a manifestation.
label: a pour modalité d’acquisition @fr
definition: Met une manifestation en relation avec une condition à laquelle un diffuseur ou un distributeur, un fabricant, un producteur ou un éditeur fournit normalement une manifestation. @fr
toolkit label: modalité d’acquisition @fr
toolkit definition: Condition à laquelle un diffuseur ou un distributeur, un fabricant, un producteur ou un éditeur fournit normalement une manifestation. @fr
toolkit label: plazo de disponibilidad @es
toolkit definition: Una condición bajo la cual un distribuidor, fabricante, productor o editor normalmente proporcionará una manifestación. @es
label: har anskaffningsvillkor @sv
toolkit label: anskaffningsvillkor @sv
toolkit label: voorwaarde voor verkrijgbaarheid @nl
toolkit definition: Een voorwaarde waaronder de distributeur, vervaardiger, producent of uitgever. een manifestatie gewoonlijk levert. @nl
label: có điều kiện lưu hành @vi
definition: Liên kết biểu thị với điều kiện mà dưới đó nhà xuất bản, nhà phân phối, v.v..., sẽ cung cấp thông thường biểu thị hoặc giá cả của biểu thị. @vi
toolkit label: điều kiện lưu hành @vi
toolkit definition: Điều kiện mà dưới đó nhà xuất bản, nhà phân phối, v.v..., sẽ cung cấp thông thường biểu thị hoặc giá cả của biểu thị. @vi
label: har anskaffelsesvilkår @da
definition: Relaterer en manifestation til en betingelse, under hvilke udgiveren, distributøren etc. normalt vil levere en manifestation eller prisen på en manifestation. @da
toolkit label: anskaffelsesvilkår @da
toolkit definition: Betingelse, under hvilke udgiveren, distributøren etc. normalt vil levere en manifestation eller prisen på en manifestation. @da
label: hat Bezugsbedingung @de
definition: Setzte eine Manifestation in Beziehung zu einer Bedingung, unter der ein Vertrieb, ein Hersteller, eine Produzentin/ein Produzent oder ein Verlag normalerweise eine Manifestation liefert. @de
toolkit label: Bezugsbedingung @de
toolkit definition: Eine Bedingung, unter der ein Vertrieb, ein Hersteller, eine Produzentin/ein Produzent oder ein Verlag normalerweise eine Manifestation liefert. @de
label: té com a terme de disponibilitat @ca
definition: Relaciona una manifestació amb una condició segons la qual un distribuïdor, un fabricant, un productor o un editor proporcionarà normalment una manifestació. @ca
toolkit label: terme de disponibilitat @ca
toolkit definition: Condició segons la qual un distribuïdor, un fabricant, un productor o un editor proporcionarà normalment una manifestació. @ca
definition: Liittää manifestaation jakelijan, valmistajan, tuottajan tai kustantajan asettamiin ehtoihin manifestaation saatavuudelle tai manifestaation hintaan. @fi
toolkit label: hankintatieto @fi
toolkit definition: Jakelijan, valmistajan, tuottajan tai kustantajan asettamat ehdot manifestaation saatavuudelle, tai manifestaation hinta. @fi
toolkit label: leveringsbetingelser @no
toolkit definition: Betingelser for levering av en manifestasjon fra utgiver, distributør etc., eller prisen på manifestasjonen. @no
label: έχει όρους διάθεσης @el
definition: Συνδέει μια εκδήλωση με μια συνθήκη υπό την οποία ο εκδότης, ο διαθέτης κ.λπ. θα προμηθεύσει κατά κανόνα μια εκδήλωση ή με την τιμή μιας εκδήλωσης. @el
toolkit label: όροι διάθεσης @el
toolkit definition: Μια συνθήκη υπό την οποία ο εκδότης, ο διαθέτης κ.λπ. θα προμηθεύσει κατά κανόνα μια εκδήλωση ή η τιμή μιας εκδήλωσης. @el
has element type: 6
label: hozzáférési feltétele a következő: @hu
definition: Egy megjelenési formát hozzákapcsol egy feltételhez, amely alapján a kiadó, a terjesztő stb. szokásos módon szolgáltat egy megjelenési formát vagy egy megjelenési forma árát. @hu
toolkit label: rendelkezésre állás feltétele @hu
toolkit definition: Olyan feltétel, amely szerint a kiadó, terjesztő stb. szabályos módon fog szolgáltatni egy megjelenési formát. vagy egy megjelenési forma árát. @hu
label: hankintatieto @fi
label: har leveringsbetingelser @no
definition: Relaterer en manifestasjon til betingelser for levering av en manifestasjon fra utgiver, distributør etc., eller prisen på manifestasjonen. @no
scope note: Includes a price of a manifestation.
label: heeft voorwaarde voor verkrijgbaarheid @nl
definition: Relateert een manifestatie aan een voorwaarde waaronder de distributeur, vervaardiger, producent of uitgever. een manifestatie gewoonlijk levert. @nl
scope note: Sisältää manifestaation hinnan. @fi
label: له شرط إتاحة @ar
definition: يربط بين تجسيدة وحالة يقوم فيها الناشر، أو الموزع، إلخ. عادة بتوريد تجسيدة، أو السعر لتجسيدة. @ar
toolkit label: شرط إتاحة @ar
toolkit definition: حالة يقوم فيها الناشر، أو الموزع، إلخ. عادة بتوريد تجسيدة، أو السعر لتجسيدة. @ar
label: saadavusandmed @et
definition: Seostab kehastuse tingimustega, millega kirjastaja, levitaja vms tavaliselt kehastuse tarnib, või kehastuse hinnaga. @et
toolkit label: saadavusandmed @et
toolkit definition: Tingimused, millega kirjastaja, levitaja vms tavaliselt kehastuse tarnib, või kehastuse hind. @et
label: ha come condizioni di disponibilità @it
definition: Correla una manifestazione a condizioni alle quali l'editore, distributore, etc. forniscono normalmente una manifestazione o il prezzo di una manifestazione. @it
toolkit label: condizioni di disponibilità @it
toolkit definition: Condizioni alle quali l'editore, distributore, etc. forniscono normalmente una manifestazione o il prezzo di una manifestazione. @it
scope note: Omvat een prijs van een manifestatie. @nl
label: pieejamība @lv
definition: Sasaista manifestāciju ar nosacījumiem, saskaņā ar kuriem izdevējs, izplatītājs, u.tml., parasti piegādā manifestāciju vai nosaka manifestācijas cenu. @lv
toolkit label: pieejamība @lv
toolkit definition: Nosacījumi, saskaņā ar kuriem izdevējs, izplatītājs, u.tml., parasti piegādā manifestāciju vai nosaka manifestācijas cenu. @lv
scope note: Ietver manifestācijas cenu. @lv
scope note: Comprend le prix d’une manifestation. @fr
scope note: يشمل سعر تجسيدة. @ar
scope note: Omfatter et pris på en manifestation @da
scope note: Darunter fällt ein Preis für eine Manifestation. @de
scope note: Inclou un preu d’una manifestació. @ca
label: 有获得方式 @zh-hans

is reprint of item of
status: Published
type: Property
lexical alias: reprintOfItemOf.en
definition: Relates a manifestation to an item that exemplifies a printed manifestation that is used as the basis for a reissue of a manifestation.
domain: C10007
sub property of: is reproduction of item of
toolkit label: reprint of item of
toolkit definition: An item that exemplifies a printed manifestation that is used as the basis for a reissue of a manifestation.
has element type: 2
alternative label: reprint of (item)
label: uusintapainos kappaleesta @fi
definition: Liittää manifestaation painettua manifestaatiota edustavan kappaleeseen, jota käytetään manifestaation uusintajulkaisun pohjana. @fi
toolkit label: uusintapainos kappaleesta @fi
toolkit definition: Painettua manifestaatiota edustava kappale, jota käytetään manifestaation uusintajulkaisun pohjana. @fi
label: er opptrykk av eksemplar av @no
definition: Relaterer en manifestasjon til et eksemplar som eksemplifiserer en trykt manifestasjon som brukes som grunnlag for en gjenutgivelse av en manifestasjon. @no
toolkit label: opptrykk av eksemplar av @no
toolkit definition: Et eksemplar som eksemplifiserer en trykt manifestasjon som brukes som grunnlag for en gjenutgivelse av en manifestasjon. @no
label: est une réimpression d’un item de @fr
definition: Met une manifestation en relation avec un item qui exemplifie une manifestation imprimée servant de base à une réédition d’une manifestation. @fr
toolkit label: réimpression d’un item de @fr
toolkit definition: Item qui exemplifie une manifestation imprimée servant de base à une réédition d’une manifestation. @fr
label: is herdruk van item van @nl
definition: Relateert een manifestatie aan een item dat een gedrukte manifestatie vertegenwoordigt en dat is gebruikt als basis voor een heruitgave van een manifestatie. @nl
toolkit label: herdruk van item van @nl
toolkit definition: Een item dat een gedrukte manifestatie vertegenwoordigt en dat is gebruikt als basis voor een heruitgave van een manifestatie. @nl
label: هو إعادة طبع لمفردة لـ @ar
definition: يربط بين تجسيدة ومفردة تمثل تجسيدة مطبوعة تستخدم كأساس لإعادة إصدار تجسيدة. @ar
toolkit label: إعادة طبع لمفردة لـ @ar
toolkit definition: مفردة تمثل تجسيدة مطبوعة تستخدم كأساس لإعادة إصدار تجسيدة @ar
label: és reimpressió d’un ítem de @ca
definition: Relaciona una manifestació amb un ítem que exemplifica una manifestació impresa que s’usa com a base d’una reimpressió d’una manifestació. @ca
toolkit label: reimpressió d’un ítem de @ca
toolkit definition: Ítem que exemplifica una manifestació impresa que s’usa com a base d’una reimpressió d’una manifestació. @ca
label: er genoptryk af eksemplar af @da
definition: Relaterer en manifestation til et eksemplar, som eksemplificerer en trykt manifestation, som anvendes som grundlag for en genudgivelse af en manifestation. @da
toolkit label: genoptryk af eksemplar af @da
toolkit definition: Eksemplar, som eksemplificerer en trykt manifestation, som anvendes som grundlag for en genudgivelse af en manifestation. @da
label: kordustrükk eksemplarist @et
definition: Seostab kehastuse eksemplariga, mis esindab kehastuse uuesti väljaandmise alusena kasutatud trükitud kehastust. @et
toolkit label: kordustrükk eksemplarist @et
toolkit definition: Eksemplar, mis esindab kehastuse uuesti väljaandmise alusena kasutatud trükitud kehastust. @et
label: ist Nachdruck eines Exemplars von @de
definition: Setzt eine Manifestation in Beziehung zu einem Exemplar einer gedruckten Manifestation, das als Grundlage für eine Neuausgabe einer Manifestation verwendet wird. @de
toolkit label: Nachdruck eines Exemplars von @de
toolkit definition: Ein Exemplar einer gedruckten Manifestation, das als Grundlage für eine Neuausgabe einer Manifestation verwendet wird. @de
label: reprintje a következő példánynak: @hu
definition: Egy megjelenési formát hozzákapcsol egy olyan példányhoz, amely egy nyomtatott megjelenési forma mintapéldánya, amelyet egy megjelenési forma újrakiadásának alapjául használnak. @hu
toolkit label: reprintje a következő példánynak: @hu
toolkit definition: Egy példány, amely egy nyomtatott megjelenési forma mintapéldánya, amelyet egy megjelenési forma újrakiadásának alapjául használnak. @hu
label: è ristampa di item di @it
definition: Correla una manifestazionea un item che esemplifica una manifestazione a stampa utilizzata come base per la riemissione di una manifestazione. @it
toolkit label: ristampa di item di @it
toolkit definition: Item che esemplifica una manifestazione a stampa utilizzata come base per la riemissione di una manifestazione. @it
label: ir reprints vienībai @lv
definition: Sasaista manifestāciju ar vienību, kura ir iespiestas manifestācijas paraugeksemplārs, kurš izmantots kā pamats atkārtotam metienam. @lv
toolkit label: ir reprints vienībai @lv
toolkit definition: Vienība, kura ir iespiestas manifestācijas paraugeksemplārs, kurš izmantots kā pamats atkārtotam metienam. @lv
alternative label: إعادة طبع لـ (مفردة) @ar
alternative label: genoptryk af (eksemplar) @da
alternative label: Nachdruck von (Exemplar) @de
alternative label: reimpressió de (ítem) @ca
alternative label: ……的重印本（单件） @zh-hans
label: 是……的单件的重印本 @zh-hans
definition: 将一种载体表现与用作一种载体表现重新发行本之基础的例证一种印刷载体表现的一个单件关联起来。 @zh-hans
toolkit label: ……的单件的重印本 @zh-hans
toolkit definition: 用作一种载体表现重新发行本之基础的例证一种印刷载体表现的一个单件 @zh-hans
alternative label: réimpression de (item) @fr
alternative label: reprintje a következőnek (példány): @hu
alternative label: (kopyanın) yeniden basımı @tr
label: kopyasının yeniden basımıdır @tr
definition: Bir gösterimi, bir kopyanın yeniden düzenlenmesi için temel olarak kullanılan basılı bir kopyayı örnekleyen bir kalemle ilişkilendirir. @tr
toolkit label: kopyanın yeniden basımı @tr
toolkit definition: Bir gösterimin yeniden basımı için temel olarak kullanılan basılı bir gösterimi örnekleyen bir kopya. @tr
alternative label: reimpresión de (item) @es
label: es una reimpresión del item de @es
definition: Relaciona una manifestación con un item que ejemplifica una manifestación impresa que se utiliza como base para una reedición de una manifestación. @es
toolkit label: reimpresión del item de @es
toolkit definition: Un item que ejemplifica una manifestación impresa que se utiliza como base para una reedición de una manifestación. @es
has subproperty: P30302

is reprint of manifestation of
status: Published
definition: Relates a manifestation to a manifestation that is a printed manifestation that is used as the basis for a reissue of a manifestation.
type: Property
domain: C10007
sub property of: is reproduction of manifestation of
lexical alias: reprintOfManifestationOf.en
toolkit label: reprint of manifestation of
toolkit definition: A manifestation that is a printed manifestation that is used as the basis for a reissue of a manifestation.
label: est une réimpression d’une manifestation de @fr
definition: Met une manifestation en relation avec une manifestation qui consiste en une manifestation imprimée servant de base à une réédition d’une manifestation. @fr
toolkit label: réimpression d’une manifestation de @fr
toolkit definition: Manifestation qui consiste en une manifestation imprimée servant de base à une réédition d’une manifestation. @fr
toolkit label: reimpresión de la manifestación de @es
toolkit definition: Una manifestación impresa que se utiliza como base para una reedición de una manifestación. @es
instruction number: 24.5
toolkit label: herdruk van manifestatie van @nl
toolkit definition: Een manifestatie die is een gedrukte manifestatie die gebruikt is als basis voor een heruitgave van een manifestatie. @nl
label: là bản in lại của (biểu thị) @vi
definition: Liên kết biểu thị với biểu thị in được sử dụng như là cơ sở cho công bố lại của biểu hiện. @vi
toolkit label: bản in lại của (biểu thị) @vi
toolkit definition: Biểu thị in được sử dụng như là cơ sở cho công bố lại của biểu hiện. @vi
label: er genoptryk af manifestation af @da
definition: Relaterer en manifestation til en trykt manifestation, som anvendes som grundlag for en genudgivelse af en manifestation. @da
toolkit label: genoptryk af manifestation af @da
toolkit definition: Trykt manifestation, som anvendes som grundlag for en genudgivelse af en manifestation. @da
label: ist Nachdruck einer Manifestation von @de
definition: Setzt eine Manifestation in Beziehung zu einer gedruckten Manifestation, die als Grundlage für eine Neuausgabe einer Manifestation verwendet wird. @de
toolkit label: Nachdruck einer Manifestation von @de
toolkit definition: Eine gedruckte Manifestation, die als Grundlage für eine Neuausgabe einer Manifestation verwendet wird. @de
label: és reimpressió d’una manifestació de @ca
definition: Relaciona una manifestació amb una manifestació que és una manifestació impresa que s’usa com la base d’una reimpressió d’una manifestació. @ca
toolkit label: reimpressió d’una manifestació de @ca
toolkit definition: Manifestació que és una manifestació impresa que s’usa com la base d’una reimpressió d’una manifestació. @ca
definition: Liittää manifestaation painetussa muodossa olevaan manifestaatioon, jota käytetään manifestaation uusintajulkaisun pohjana. @fi
toolkit label: uusintapainos manifestaatiosta @fi
toolkit definition: Painetussa muodossa oleva manifestaatio, jota käytetään manifestaation uusintajulkaisun pohjana. @fi
toolkit label: opptrykk av manifestasjon av @no
toolkit definition: En trykt manifestasjon som brukes som utgangspunkt for et opptrykk av en manifestasjon. @no
label: είναι ανατύπωση της (εκδήλωση) @el
definition: Συνδέει μια εκδήλωση με μια έντυπη εκδήλωση που χρησιμοποιείται ως η βάση για μια επανέκδοση μιας εκδήλωσης. @el
toolkit label: ανατύπωση της (εκδήλωση) @el
toolkit definition: Μια έντυπη εκδήλωση που χρησιμοποιείται ως η βάση για μια επανέκδοση μιας εκδήλωσης. @el
has element type: 2
label: reprintje a következő megjelenési formának: @hu
definition: Egy megjelenési formát hozzákapcsol egy nyomtatott megjelenési formához, amelyet egy megjelenési forma újrakiadásának az alapjaként használnak. @hu
toolkit label: reprintje a következő megjelenési formának: @hu
toolkit definition: Egy nyomtatott megjelenési forma, amelyet egy megjelenési forma újrakiadásának alapjaként használnak. @hu
alternative label: reprint of (manifestation)
label: uusintapainos manifestaatiosta @fi
label: er opptrykk av manifestasjon av @no
definition: Relaterer en manifestasjon til en trykt manifestasjon som brukes som utgangspunkt for et opptrykk av en manifestasjon. @no
label: is herdruk van manifestatie van @nl
definition: Relateert een manifestatie aan een manifestatie die is een gedrukte manifestatie die gebruikt is als basis voor een heruitgave van een manifestatie. @nl
label: هو إعادة طبع لتجسيدة .. @ar
definition: يربط بين تجسيدة وتجسيدة مطبوعة مستخدمة كأساس لإعادة إصدار تجسيدة. @ar
toolkit label: إعادة طبع لتجسيدة .. @ar
toolkit definition: تجسيدة مطبوعة مستخدمة كأساس لإعادة إصدار تجسيدة. @ar
label: kordustrükk kehastusest @et
definition: Seostab kehastuse trükitud kehastusega, mis on kehastuse kordustrüki aluseks. @et
toolkit label: kordustrükk kehastusest @et
toolkit definition: Trükitud kehastus, mis on kehastuse kordustrüki aluseks. @et
label: è ristampa di manifestazione di @it
definition: Correla una manifestazione a una manifestazione a stampa utilizzata come base per una riemissione di una manifestazione. @it
toolkit label: ristampa di manifestazione di @it
toolkit definition: Manifestazione a stampa utilizzata come base per una riemissione di una manifestazione. @it
label: ir reprints manifestācijai @lv
definition: Sasaista manifestāciju ar manifestāciju, kas ir publicēta manifestācija, kas ir izmantota par pamatu atkārtotam metienam. @lv
toolkit label: ir reprints manifestācijai @lv
toolkit definition: Manifestācija, kas ir publicēta manifestācija, kas ir izmantota par pamatu atkārtotam metienam. @lv
alternative label: réimpression de (manifestation) @fr
alternative label: إعادة طبع لـ (تجسيدة) @ar
alternative label: genoptryk af (manifestation) @da
alternative label: Nachdruck von (Manifestation) @de
alternative label: reimpressió de (manifestació) @ca
alternative label: ……的重印本（载体表现） @zh-hans
label: 是……的载体表现的重印本 @zh-hans
definition: 将一种载体表现与作为用作一种载体表现重新发行本之基础的一种印刷载体表现的一种载体表现关联起来。 @zh-hans
toolkit label: ……的载体表现的重印 @zh-hans
toolkit definition: 作为用作一种载体表现重新发行本之基础的一种印刷载体表现的一种载体表现 @zh-hans

is reproduction of item of
status: Published
type: Property
lexical alias: reproductionOfItemOf.en
definition: Relates a manifestation to an item that is used as the basis for a reproduction.
domain: C10007
sub property of: has related item of manifestation
toolkit label: reproduction of item of
toolkit definition: An item that is used as the basis for a reproduction.
has element type: 2
alternative label: reproduction of (item)
label: jäljenne kappaleesta @fi
definition: Liittää manifestaation kappaleeseen, jota on käytetty jäljentämisen pohjana. @fi
toolkit label: jäljenne kappaleesta @fi
toolkit definition: Kappale, jota on käytetty jäljentämisen pohjana. @fi
label: er reproduksjon av eksemplar av @no
definition: Relaterer en manifestasjon til et eksemplar som brukes som grunnlag for en reproduksjon. @no
toolkit label: reproduksjon av eksemplar av @no
toolkit definition: Et eksemplar som brukes som grunnlag for en reproduksjon. @no
label: est une reproduction d’un item de @fr
definition: Met une manifestation en relation avec un item qui sert de base à une reproduction. @fr
toolkit label: reproduction d’un item de @fr
toolkit definition: Item qui sert de base à une reproduction. @fr
label: is reproductie van item van @nl
definition: Relateert een manifestatie aan een item dat gebruikt is als de basis voor een reproductie. @nl
toolkit label: reproductie van item van @nl
toolkit definition: Een item dat gebruikt is als de basis voor een reproductie. @nl
label: هو استنساخ لمفردة لـ @ar
definition: يربط بين تجسيدة ومفردة تستخدم كأساس لاستنساخٍ ما. @ar
toolkit label: استنساخ لمفردة لـ @ar
toolkit definition: مفردة تستخدم كأساس لاستنساخٍ ما. @ar
label: és reproducció d’un ítem de @ca
definition: Relaciona una manifestació amb un ítem que s’usa com a base d’una reproducció. @ca
toolkit label: reproducció d’un ítem de @ca
toolkit definition: Ítem que s’usa com a base d’una reproducció. @ca
label: er reproduktion af eksemplar af @da
definition: Relaterer en manifestation til et eksemplar, som anvendes som grundlag for en reproduktion. @da
toolkit label: reproduktion af eksemplar af @da
toolkit definition: Eksemplar, som anvendes som grundlag for en reproduktion. @da
label: reproduktsioon eksemplarist @et
definition: Seostab kehastuse eksemplariga, mida on kasutatud reproduktsiooni alusena. @et
toolkit label: reproduktsioon eksemplarist @et
toolkit definition: Eksemplar, mida on kasutatud reproduktsiooni alusena. @et
label: ist Reproduktion eines Exemplars von @de
definition: Setzt eine Manifestation in Beziehung zu einem Exemplar, das als Grundlage für eine Reproduktion verwendet wird. @de
toolkit label: Reproduktion eines Exemplars von @de
toolkit definition: Ein Exemplar, das als Grundlage für eine Reproduktion verwendet wird. @de
label: másolata a következő példánynak: @hu
definition: Hozzákapcsol egy megjelenési formát egy példányhoz, amelyet egy másolat alapjaként használnak. @hu
toolkit label: másolata a következő példánynak: @hu
toolkit definition: Egy példány, amelyet egy másolat alapjaként használnak. @hu
label: è riproduzione di item di @it
definition: Correla una manifestazione a un item utilizzato come base per una riproduzione. @it
toolkit label: riproduzione di item di @it
toolkit definition: Item utilizzato come base per una riproduzione. @it
label: ir reprodukcija vienībai @lv
definition: Sasaista manifestāciju ar vienību, kas ir izmantota par pamatu reprodukcijai. @lv
toolkit label: ir reprodukcija vienībai @lv
toolkit definition: Vienība, kas ir izmantota par pamatu reprodukcijai. @lv
alternative label: استنساخ لـ (مفردة) @ar
alternative label: reproduktion af (eksemplar) @da
alternative label: Reproduktion von (Exemplar) @de
alternative label: reproducció de (ítem) @ca
alternative label: ……的复制品（单件） @zh-hans
label: 是……的单件的复制品 @zh-hans
definition: 将一种载体表现与被用作一个复制品之基础的一个单件关联起来。 @zh-hans
toolkit label: ……的单件的复制品 @zh-hans
toolkit definition: 被用作一个复制品之基础的一个单件 @zh-hans
alternative label: reproduction de (item) @fr
alternative label: másolata a következőnek (példány): @hu
alternative label: (kopyanın) yeniden üretimi @tr
label: kopyasının yeniden yapımıdır @tr
definition: Bir gösterimi, yeniden üretim için temel olarak kullanılan bir kopya ile ilişkilendirir. @tr
toolkit label: kopyanın yeniden üretimi @tr
toolkit definition: Bir yeniden üretim için temel olarak kullanılan bir kopya. @tr
alternative label: reproducción de (item) @es
label: es una reproducción del item de @es
toolkit label: reproducción del item de @es
toolkit definition: Un item que se utiliza como base para una reproducción. @es
has subproperty: is digital transfer of item of
has subproperty: is electronic reproduction of item of

is reproduction of manifestation of
status: Published
definition: Relates a manifestation to a manifestation that is used as the basis for a reproduction.
type: Property
domain: C10007
sub property of: has equivalent manifestation
lexical alias: reproductionOfManifestationOf.en
toolkit label: reproduction of manifestation of
toolkit definition: A manifestation that is used as the basis for a reproduction.
label: est une reproduction d’une manifestation de @fr
definition: Met une manifestation en relation avec une manifestation qui sert de base à une reproduction. @fr
toolkit label: reproduction d’une manifestation de @fr
toolkit definition: Manifestation qui sert de base à une reproduction. @fr
toolkit label: reproducción de la manifestación de @es
toolkit definition: Una manifestación que se utiliza como base para una reproducción. @es
instruction number: 24.5
toolkit label: reproductie van manifestatie van @nl
toolkit definition: Een manifestatie die gebruikt is als de basis voor een reproductie. @nl
label: là sản xuất lại của (biểu thị) @vi
definition: Liên kết biểu thị với biểu thị được sử dụng như là cơ sở cho sản xuất lại. @vi
toolkit label: sản xuất lại của (biểu thị) @vi
toolkit definition: Biểu thị được sử dụng như là cơ sở cho sản xuất Lại. @vi
label: er reproduktion af manifestation af @da
definition: Relaterer en manifestation til en manifestation, som anvendes som grundlag for en reproduktion. @da
toolkit label: reproduktion af manifestation af @da
toolkit definition: Manifestation, som anvendes som grundlag for en reproduktion. @da
label: ist Reproduktion einer Manifestation von @de
definition: Setzt eine Manifestation in Beziehung zu einer Manifestation, die als Grundlage für eine Reproduktion verwendet wird. @de
toolkit label: Reproduktion einer Manifestation von @de
toolkit definition: Eine Manifestation, die als Grundlage für eine Reproduktion verwendet wird. @de
label: és reproducció d’una manifestació de @ca
definition: Relaciona una manifestació amb una manifestació que s’usa com a base d’una reproducció. @ca
toolkit label: reproducció d’una manifestació de @ca
toolkit definition: Manifestació que s’usa com a base d’una reproducció. @ca
definition: Liittää manifestaation manifestaatioon, jota on käytetty jäljentämisen pohjana. @fi
toolkit label: jäljenne manifestaatiosta @fi
toolkit definition: Manifestaatio, jota on käytetty jäljentämisen pohjana. @fi
toolkit label: reproduksjon av manifestasjon for @no
toolkit definition: En manifestasjon som brukes som utgangspunkt for en reproduksjon. @no
label: είναι αναπαραγωγή της (εκδήλωση) @el
definition: Συνδέει μια εκδήλωση με μια εκδήλωση που χρησιμοποιείται ως η βάση για μια αναπαραγωγή. @el
toolkit label: αναπαραγωγή της (εκδήλωση) @el
toolkit definition: Μια εκδήλωση που χρησιμοποιείται ως η βάση για μια αναπαραγωγή. @el
has element type: 2
label: másolata a következő megjelenési formának: @hu
definition: Hozzákapcsol egy megjelenési formát egy megjelenési formához, amelyet egy másolat alapjaként használnak. @hu
toolkit label: másolata a következő megjelenési formának: @hu
toolkit definition: Egy megjelenési forma, amelyet egy másolat alapjaként használnak. @hu
alternative label: reproduction of (manifestation)
label: jäljenne manifestaatiosta @fi
label: er reproduksjon av manifestasjon av @no
definition: Relaterer en manifestasjon til en manifestasjon som brukes som utgangspunkt for en reproduksjon. @no
label: is reproductie van manifestatie van @nl
definition: Relateert een manifestatie aan een manifestatie die gebruikt is als de basis voor een reproductie. @nl
label: هو إعادة إنتاج لتجسيدة لـ @ar
definition: يربط بين تجسيدة وتجسيدة تستخدم كأساس لإعادة الإنتاج. @ar
toolkit label: إعادة إنتاج لتجسيدة لـ @ar
toolkit definition: تجسيدة تستخدم كأساس لإعادة الإنتاج. @ar
label: reproduktsioon kehastusest @et
definition: Seostab kehastuse kehastusega, mida on kasutatud reproduktsiooni alusena. @et
toolkit label: reproduktsioon kehastusest @et
toolkit definition: Kehastus, mida on kasutatud reproduktsiooni alusena. @et
label: è riproduzione di una manifestazione di @it
definition: Correla una manifestazione a una manifestazione utilizzata come base per una riproduzione. @it
toolkit label: riproduzione di una manifestazione di @it
toolkit definition: Manifestazione utilizzata come base per una riproduzione. @it
label: ir reprodukcija manifestācijai @lv
definition: Sasaista manifestāciju ar manifestāciju, kas ir izmantota par pamatu reprodukcijai. @lv
toolkit label: ir reprodukcija manifestācijai @lv
toolkit definition: Manifestācija, kas ir izmantota par pamatu reprodukcijai. @lv
alternative label: إعادة إنتاج لـ (تجسيدة) @ar
alternative label: reproduktion af (manifestation) @da
alternative label: Reproduktion von (Manifestation) @de
alternative label: reproducció de (manifestació) @ca
alternative label: ……的复制品（载体表现） @zh-hans
label: 是……的载体表现的复制品 @zh-hans
definition: 将一种载体表现与被用作一个复制品之基础的一种载体表现关联起来。 @zh-hans
toolkit label: ……的载体表现的复制品 @zh-hans
toolkit definition: 被用作一个复制品之基础的一种载体表现 @zh-hans
alternative label: reproducción de (manifestación) @es

is review of (manifestation) (Deprecated)
status: Deprecated
type: Property
toolkit definition: A manifestation used as the basis for a brief evaluation. (Deprecated)
toolkit label: review of (manifestation) (Deprecated)
definition: Relates a work to a manifestation used as the basis for a brief evaluation. (Deprecated)
sub property of: is description of (manifestation) (Deprecated)
lexical alias: reviewOfManifestation.en
domain: C10001

has recording medium
status: Published
definition: Relates a manifestation to a type of medium used to record sound on an audio carrier.
type: Property
domain: C10007
sub property of: has sound characteristic
lexical alias: recordingMedium.en
instruction number: 3.16.3
toolkit label: recording medium
toolkit definition: A type of medium used to record sound on an audio carrier.
label: a pour support d’enregistrement @fr
definition: Met une manifestation en relation avec un type de support utilisé pour enregistrer du son sur un support matériel audio. @fr
toolkit label: support d’enregistrement @fr
toolkit definition: Type de support utilisé pour enregistrer du son sur un support matériel audio. @fr
toolkit label: medio de grabación @es
toolkit definition: Un tipo de medio utilizado para grabar sonido en un soporte de audio. @es
label: har inspelningssätt @sv
toolkit label: inspelningssätt @sv
toolkit label: opnamemedium @nl
toolkit definition: Een type medium gebruikt om geluid op te nemen op een geluidsdrager. @nl
label: có phương tiện ghi @vi
definition: Liên kết biểu thị với loại của phương tiện được sử dụng để ghi âm thanh trên vật mang tin audio. @vi
toolkit label: phương tiện ghi @vi
toolkit definition: Loại của phương tiện được sử dụng để ghi âm thanh trên vật mang tin audio. @vi
label: har optagemedie @da
definition: Relaterer en manifestation til en type af medie, som anvendes til at optage lyd på en lydbærer. @da
toolkit label: optagemedie @da
toolkit definition: Type af medie, som anvendes til at optage lyd på en lydbærer. @da
label: hat Aufzeichnungsmedium @de
definition: Setzt eine Manifestation in Beziehung zu einer Art des Mediums, das verwendet wird, um Ton auf einem Tonträger festzuhalten. @de
toolkit label: Aufzeichnungsmedium @de
toolkit definition: Eine Art des Mediums, das verwendet wird, um Ton auf einem Tonträger festzuhalten. @de
label: té com a suport d’enregistrament @ca
definition: Relaciona una manifestació amb un tipus de suport usat per enregistrar so en un suport físic àudio. @ca
toolkit label: suport d’enregistrament @ca
toolkit definition: Tipus de suport usat per enregistrar so en un suport físic àudio. @ca
definition: Liittää manifestaation menetelmään, jolla ääni tallennetaan äänitallenteelle. @fi
toolkit label: äänen tallennusmenetelmä @fi
toolkit definition: Menetelmä, jolla ääni tallennetaan äänitallenteelle. @fi
toolkit label: opptaksmedium @no
toolkit definition: En type opptaksmedium brukt til å registrere lyd på en lydbærer. @no
label: έχει μέσο ηχογράφησης @el
definition: Συνδέει μια εκδήλωση με έναν τύπο μέσου μετάδοσης που χρησιμοποιείται για την καταγραφή ήχου σε έναν φορέα αποθήκευσης ήχου. @el
toolkit label: μέσο ηχογράφησης @el
toolkit definition: Ένας τύπος μέσου μετάδοσης που χρησιμοποιείται για την καταγραφή ήχου σε έναν φορέα αποθήκευσης ήχου. @el
has element type: 4
label: rögzítőmédiuma a következő: @hu
definition: Hozzákapcsol egy megjelenési formát egy médiumtípushoz, amelyet egy hanghordozóra való hangrögzítésre használnak. @hu
toolkit label: rögzítőmédiuma: @hu
toolkit definition: Egy médiumtípus, amelyet egy hanghordozóra való hangrögzítésre használnak. @hu
label: äänen tallennusmenetelmä @fi
label: har opptaksmedium @no
definition: Relaterer en manifestasjon til en type opptaksmedium brukt til å registrere lyd på en lydbærer. @no
label: heeft opnamemedium @nl
definition: Relateert een manifestatie aan een type medium gebruikt om geluid op te nemen op een geluidsdrager. @nl
label: له وسيط تسجيل @ar
definition: يربط بين تجسيدة ونوع وسيط مستخدم في تسجيل الصوت على حامل صوتي. @ar
toolkit label: وسيط تسجيل @ar
toolkit definition: نوع وسيط مستخدم في تسجيل الصوت على حامل صوتي. @ar
label: salvestusmeedium @et
definition: Seostab kehastuse meediumi tüübiga, mida on kasutatud heli salvestamiseks helikandjale. @et
toolkit label: salvestusmeedium @et
toolkit definition: Meediumi tüüp, mida on kasutatud heli salvestamiseks helikandjale. @et
label: ha come mezzo di registrazione @it
definition: Correla una manifestazione a un tipo di mezzo utilizzato per la registrazione del suono su un supporto audio. @it
toolkit label: mezzo di registrazione @it
toolkit definition: Tipo di mezzo utilizzato per la registrazione del suono su un supporto audio. @it
label: ieraksta vide @lv
definition: Sasaista manifestāciju ar vides veidu, ko izmanto, lai ierakstītu skaņu audio nesējā. @lv
toolkit label: ieraksta vide @lv
toolkit definition: Vides veids, ko izmanto, lai ierakstītu skaņu audio nesējā. @lv
label: 有录音媒介 @zh-hans
definition: 将一种载体表现与用于在音频载体上记录声音的媒介类型关联起来。 @zh-hans
toolkit label: 录音媒介 @zh-hans
toolkit definition: 用于在音频载体上记录声音的媒介类型 @zh-hans
label: kayıt ortamı ile ilişkilidir @tr
definition: Bir gösterimi, sesi bir ses taşıyıcısına kaydeden bir ortamla ilişkilendirir. @tr
toolkit label: kayıt ortamı @tr
toolkit definition: Bir ses taşıyıcısında sesi kaydetmek için kullanılan bir ortam türü. @tr
label: tiene medio de grabación @es

has details of type of recording
status: Published
type: Property
lexical alias: detailsOfTypeOfRecording.en
definition: Relates a manifestation to details of a method that is used to encode audio content for playback.
domain: C10007
instruction number: 3.16.2.4
toolkit label: details of type of recording
toolkit definition: Details of a method that is used to encode audio content for playback.
toolkit label: detalles del tipo de grabación @es
toolkit definition: Detalles de un método que se utiliza para codificar contenido de audio para su reproducción. @es
sub property of: has details of sound characteristic
label: har detaljerad information om inspelningstyp @sv
toolkit label: detaljerad information om inspelningstyp @sv
toolkit label: details van opnamesoort @nl
toolkit definition: Details van een methode gebruikt om audio content te coderen voor afspelen. @nl
label: có chi tiết của loại ghi @vi
definition: Liên kết biểu thị với chi tiết của phương pháp được sử dụng để ghi mã nội dung cho phát lại. @vi
toolkit label: chi tiết của loại ghi @vi
toolkit definition: Chi tiết của phương pháp được sử dụng để ghi mã nội dung cho phát lại. @vi
label: har detaljer om indspilningskarakteristika @da
definition: Relaterer en manifestation til detaljer om en metode, som anvendes til at kode lydindhold til afspilning. @da
toolkit label: detaljer om indspilningskarakteristika @da
toolkit definition: Detaljer om en metode, som anvendes til at kode lydindhold til afspilning. @da
label: hat Details zur Art einer Aufnahme @de
definition: Setzt eine Manifestation in Beziehung zu den Details zu einem Verfahren, das zur Kodierung von Audio-Inhalt für die Wiedergabe verwendet wird. @de
toolkit label: Details zur Art einer Aufnahme @de
toolkit definition: Details zu einem Verfahren, das zur Kodierung von Audio-Inhalt für die Wiedergabe verwendet wird. @de
label: té com a particularitats de tipus d’enregistrament @ca
definition: Relaciona una manifestació amb les particularitats d’un mètode que s’usa per codificar el contingut àudio per a la reproducció. @ca
toolkit label: particularitats de tipus d’enregistrament @ca
toolkit definition: Particularitats d’un mètode que s’usa per codificar el contingut àudio per a la reproducció. @ca
definition: Liittää manifestaation tarkempiin tietoihin menetelmästä, jota on käytetty äänen tallentamiseksi äänentoistoa varten. @fi
toolkit label: äänen tallentamisen tavan tarkemmat tiedot @fi
toolkit definition: Tarkemmat tiedot menetelmästä, jota on käytetty äänen tallentamiseksi äänentoistoa varten. @fi
toolkit label: detaljer vedrørende typen opptak @no
toolkit definition: Detaljer vedrørende en metode som er brukt for å kode lydinnhold for avspilling. @no
label: έχει λεπτομέρειες του τύπου της ηχογράφησης @el
definition: Συνδέει μια εκδήλωση με τις λεπτομέρειες της μεθόδου που χρησιμοποιείται για την κωδικοποίηση ηχητικού περιεχομένου για αναπαραγωγή. @el
toolkit label: λεπτομέρειες του τύπου της ηχογράφησης @el
toolkit definition: Λεπτομέρειες της μεθόδου που χρησιμοποιείται για την κωδικοποίηση ηχητικού περιεχομένου για αναπαραγωγή. @el
label: a pour particularités d’un type d’enregistrement @fr
definition: Met une manifestation en relation avec des particularités d’une méthode qui est utilisée pour encoder un contenu audio pour la lecture. @fr
toolkit label: particularités d’un type d’enregistrement @fr
toolkit definition: Particularités d’une méthode qui est utilisée pour encoder un contenu audio pour la lecture. @fr
has element type: 6
label: rögzítéstípus részletei a következők: @hu
definition: Hozzákapcsol egy megjelenési formát azon módszer részleteihez, amelyet audiótartalom kódolásához használnak visszajátszás céljára. @hu
toolkit label: rögzítéstípus részletei: @hu
toolkit definition: Azon módszer részletei, amelyet audiótartalom kódolásához használnak visszajátszás céljára. @hu
label: äänen tallentamisen tavan tarkemmat tiedot @fi
label: har detaljer vedrørende typen opptak @no
definition: Relaterer en manifestasjon til detaljer vedrørende en metode som er brukt for å kode lydinnhold for avspilling. @no
label: heeft details van opnamesoort @nl
definition: Relateert een manifestatie aan details van een methode gebruikt om audio content te coderen voor afspelen. @nl
label: له تفاصيل نوع التسجيل @ar
definition: يربط بين تجسيدة وتفاصيل طريقة مستخدمة في تكويد المحتوى الصوتي لتشغيل الصوت. @ar
toolkit label: تفاصيل نوع التسجيل @ar
toolkit definition: تفاصيل طريقة مستخدمة في تكويد المحتوى الصوتي لتشغيل الصوت. @ar
label: video tunnuse täpsustus @et
definition: Seostab kehastuse täpsemate andmetega tehnilises kirjelduses, mis puudutab kehastuses sisalduvate videokujutiste kodeeringut. @et
toolkit label: video tunnuse täpsustus @et
toolkit definition: Täpsemad andmed tehnilises kirjelduses, mis puudutab kehastuses sisalduvate videokujutiste kodeeringut. @et
label: ha come particolari relativi al tipo di registrazione @it
definition: Correla una manifestazione ai particolari relativi a un metodo utilizzato per la codifica del contenuto audio per la riproduzione. @it
toolkit label: particolari relativi al tipo di registrazione @it
toolkit definition: Particolari relativi a un metodo utilizzato per la codifica del contenuto audio per la riproduzione. @it
label: detalizēti par skaņu ieraksta veidu @lv
definition: Sasaista manifestāciju ar detaļām par metodi, kādas lietotas, lai kodētu audio saturu atskaņošanai. @lv
toolkit label: detalizēti par skaņu ieraksta veidu @lv
toolkit definition: Detaļas par metodi, kādas lietotas, lai kodētu audio saturu atskaņošanai. @lv
label: 有录音的类型的细节 @zh-hans
definition: 将一种载体表现与用于编码音频内容供回放的方法的细节关联起来。 @zh-hans
toolkit label: 录音的类型的细节 @zh-hans
toolkit definition: 用于编码音频内容供回放的方法的细节 @zh-hans
label: kayıt türü ayrıntıları ile ilişkilidir @tr
definition: Bir gösterimi, oynatma için ses içeriğini kodlamak için kullanılan bir yöntemin ayrıntılarıyla ilişkilendirir. @tr
toolkit label: kayıt türünün ayrıntıları @tr
toolkit definition: Ses içeriğini oynatmak için kullanılan kodlama yönteminin ayrıntıları. @tr
label: tiene detalles del tipo de grabación @es

has details of recording medium
status: Published
type: Property
lexical alias: detailsOfRecordingMedium.en
definition: Relates a manifestation to details of a type of medium that is used to record sound on an audio carrier.
domain: C10007
instruction number: 3.16.3.4
toolkit label: details of recording medium
toolkit definition: Details of a type of medium that is used to record sound on an audio carrier.
toolkit label: detalles del medio de grabación @es
toolkit definition: Detalles de un tipo de medio que se utiliza para grabar sonido en un soporte de audio. @es
sub property of: has details of sound characteristic
label: har detaljerad information om inspelningssätt @sv
toolkit label: detaljerad information om inspelningssätt @sv
toolkit label: details van opnamemedium @nl
toolkit definition: Details van een type medium gebruikt om geluid op te nemen op een geluidsdrager. @nl
label: có chi tiết của phương tiện ghi @vi
definition: Liên kết biểu thị với chi tiết của loại của phương tiện được sử dụng để ghi âm thanh trên vật mang tin audio. @vi
toolkit label: chi tiết của phương tiện ghi @vi
toolkit definition: Chi tiết của loại của phương tiện được sử dụng để ghi âm thanh trên vật mang tin audio. @vi
label: har detaljer om optagemedie @da
definition: Relaterer en manifestation til detaljer om en type af medie, som anvendes til at optage lyd på en lydbærer. @da
toolkit label: detaljer om optagemedie @da
toolkit definition: Detaljer om en type af medie, som anvendes til at optage lyd på en lydbærer. @da
label: hat Details zum Aufzeichnungsmedium @de
definition: Setzt eine Manifestation in Beziehung zu den Details zur Art des Mediums, das verwendet wird, um Ton auf einem Tonträger festzuhalten. @de
toolkit label: Details zum Aufzeichnungsmedium @de
toolkit definition: Details zur Art des Mediums, das verwendet wird, um Ton auf einem Tonträger festzuhalten. @de
label: té com a particularitats de suport d’enregistrament @ca
definition: Relaciona una manifestació amb les particularitats d’un tipus de suport que s’usa per enregistrar so en un suport físic àudio. @ca
toolkit label: particularitats de suport d’enregistrament @ca
toolkit definition: Particularitats d’un tipus de suport que s’usa per enregistrar so en un suport físic àudio. @ca
definition: Liittää manifestaation tarkempiin tietoihin tallennusmediasta, jolla ääni tallennetaan äänitallenteelle. @fi
toolkit label: äänen tallennusmedian tyypin tarkemmat tiedot @fi
toolkit definition: Tarkemmat tiedot tallennusmediasta, jolla ääni tallennetaan äänitallenteelle. @fi
toolkit label: detaljer vedrørende opptaksmedium @no
toolkit definition: Detaljer vedrørende typen opptaksmedium som er brukt til å registrere lyd på en lydbærer. @no
label: έχει λεπτομέρειες του μέσου ηχογράφησης @el
definition: Συνδέει μια εκδήλωση με τις λεπτομέρειες ενός τύπου μέσου μετάδοσης που χρησιμοποιείται για την καταγραφή ήχου σε έναν φορέα ηχογράφησης ήχου. @el
toolkit label: λεπτομέρειες του μέσου ηχογράφησης @el
toolkit definition: Λεπτομέρειες ενός τύπου μέσου μετάδοσης που χρησιμοποιείται για την καταγραφή ήχου σε έναν φορέα ηχογράφησης ήχου. @el
label: a pour particularités d’un support d’enregistrement @fr
definition: Met une manifestation en relation avec des particularités d’un type de support qui est utilisé pour enregistrer du son sur un support matériel audio. @fr
toolkit label: particularités d’un support d’enregistrement @fr
toolkit definition: Particularités d’un type de support qui est utilisé pour enregistrer du son sur un support matériel audio. @fr
has element type: 6
label: rögzítőmédium részletei a következők: @hu
definition: Hozzákapcsol egy megjelenési formát azon médiumtípus részleteihez, amelyet egy hanghordozóra történő hangrögzítésre használnak. @hu
toolkit label: rögzítőmédium részletei: @hu
toolkit definition: Azon médiumtípus részletei, amelyet egy hanghordozóra történő hangrögzítésre használnak. @hu
label: äänen tallennusmedian tyypin tarkemmat tiedot @fi
label: har detaljer vedrørende opptaksmedium @no
definition: Relaterer en manifestasjon til detaljer vedrørende typen opptaksmedium som er brukt til å registrere lyd på en lydbærer. @no
label: heeft details van opnamemedium @nl
definition: Relateert een manifestatie aan details van een type medium gebruikt om geluid op te nemen op een geluidsdrager. @nl
label: له تفاصيل وسيط تسجيل @ar
definition: يربط بين تجسيدة وتفاصيل نوع وسيط مستخدم في تسجيل الصوت على حامل صوت. @ar
toolkit label: تفاصيل وسيط تسجيل @ar
toolkit definition: تفاصيل نوع وسيط مستخدم في تسجيل الصوت على حامل صوت. @ar
label: salvestusmeediumi täpsustus @et
definition: Seostab kehastuse täpsemate andmetega meediumi tüübi kohta, mida on kasutatud heli salvestamiseks helikandjale. @et
toolkit label: salvestusmeediumi täpsustus @et
toolkit definition: Täpsemad andmed meediumi tüübi kohta, mida on kasutatud heli salvestamiseks helikandjale. @et
label: ha come particolari relativi al mezzo di registrazione @it
definition: Correla una manifestazione ai particolari relativi a un tipo di mezzo utilizzato per la registrazione del suono su un supporto audio. @it
toolkit label: particolari relativi al mezzo di registrazione @it
toolkit definition: Particolari relativi a un tipo di mezzo utilizzato per la registrazione del suono su un supporto audio. @it
label: detalizēti par ieraksta vidi @lv
definition: Sasaista manifestāciju ar sīkāku informāciju par vides veidu, ko izmanto, lai ierakstītu skaņu uz audio nesēja. @lv
toolkit label: detalizēti par ieraksta vidi @lv
toolkit definition: Sīkāka informācija par vides veidu, ko izmanto, lai ierakstītu skaņu uz audio nesēja. @lv
label: 有录音媒介的细节 @zh-hans
definition: 将一种载体表现与用于在音频载体上记录声音的媒介类型的细节关联起来。 @zh-hans
toolkit label: 录音媒介的细节 @zh-hans
toolkit definition: 用于在音频载体上记录声音的媒介类型的细节 @zh-hans
label: kayıt ortamı ayrıntıları ile ilişkilidir @tr
definition: Bir gösterimi, bir ses taşıyıcısına ses kaydetmek için kullanılan bir ortam türünün ayrıntılarıyla ilişkilendirir. @tr
toolkit label: kayıt ortamının ayrıntıları @tr
toolkit definition: Bir ses taşıyıcısına ses kaydetmek için kullanılan bir ortam türünün ayrıntıları. @tr
label: tiene detalles del medio de grabación @es

has abbreviated title
status: Published
definition: Relates a manifestation to a nomen that is a title that has been abbreviated for purposes of indexing or identification.
type: Property
domain: C10007
sub property of: has title of manifestation
lexical alias: abbreviatedTitle.en
instruction number: 2.3.10
toolkit label: abbreviated title
toolkit definition: A nomen that is a title that has been abbreviated for purposes of indexing or identification.
label: a pour titre abrégé @fr
definition: Met une manifestation en relation avec un nomen qui est un titre qui a été abrégé à des fins d’indexation ou d’identification. @fr
toolkit label: titre abrégé @fr
toolkit definition: Nomen qui est un titre qui a été abrégé à des fins d’indexation ou d’identification. @fr
toolkit label: título abreviado @es
toolkit definition: Un nomen que es un título que ha sido abreviado con fines de indexación o identificación. @es
label: har förkortad titel @sv
toolkit label: förkortad titel @sv
toolkit label: verkorte titel @nl
toolkit definition: Een nomen dat is een titel die is verkort ten behoeve van indexering of identificatie. @nl
label: có nhan đề tắt @vi
definition: Liên kết biểu thị với nhan đề được rút gọn nhằm mục đích định chỉ mục hoặc nhận dạng. @vi
toolkit label: nhan đề tắt @vi
toolkit definition: Nhan đề được rút gọn nhằm mục đích định chỉ mục hoặc nhận dạng. @vi
label: har forkortet titel @da
definition: Relaterer en manifestation til en titel, som er forkortet med henblik på indeksering eller identifikation. @da
toolkit label: forkortet titel @da
toolkit definition: Titel, som er forkortet med henblik på indeksering eller identifikation. @da
label: hat Kurztitel @de
definition: Setzt eine Manifestation in Beziehung zu einem Titel, der zum Zwecke der Indexierung oder der Identifizierung gekürzt wurde. @de
toolkit label: Kurztitel @de
toolkit definition: Ein Titel, der zum Zwecke der Indexierung oder der Identifizierung gekürzt wurde. @de
label: té com a títol abreujat @ca
definition: Relaciona una manifestació amb un nomen que és un títol que ha estat abreujat amb la finalitat de la indexació o la identificació. @ca
toolkit label: títol abreujat @ca
toolkit definition: Nomen que és un títol que ha estat abreujat amb la finalitat de la indexació o la identificació. @ca
definition: Liittää manifestaation nomeniin, joka on indeksointia tai tunnistamista varten lyhennetty nimeke. @fi
toolkit label: lyhennetty nimeke @fi
toolkit definition: Nomen, joka on indeksointia tai tunnistamista varten lyhennetty nimeke. @fi
toolkit label: forkortet tittel @no
toolkit definition: En tittel som har blitt forkortet for indekserings- eller identifiseringsformål. @no
label: έχει συντομευμένο τίτλο @el
definition: Συνδέει μια εκδήλωση με έναν τίτλο που έχει συντμηθεί για τους σκοπούς της ευρετηρίασης ή της ταύτισης. @el
toolkit label: συντομευμένος τίτλος @el
toolkit definition: Ένας τίτλος που έχει συντμηθεί για τους σκοπούς της ευρετηρίασης ή της ταύτισης. @el
has element type: 3
label: rövidített címe a következő: @hu
definition: Hozzákapcsol egy megjelenési formát egy nomenhez, amely egy indexelés vagy azonosítás céljából rövidített cím. @hu
toolkit label: rövidített címe: @hu
toolkit definition: Egy nomen, amely egy indexelés vagy azonosítás céljából rövidített cím. @hu
label: lyhennetty nimeke @fi
label: har forkortet tittel @no
definition: Relaterer en manifestasjon til en tittel som har blitt forkortet for indekserings- eller identifiseringsformål. @no
label: heeft verkorte titel @nl
definition: Relateert een manifestatie aan een nomen dat is een titel die is verkort ten behoeve van indexering of identificatie. @nl
label: له عنوان مختصر @ar
definition: يربط بين تجسيدة وعنوان تم اختصاره لأغراض التكشيف أو التحديد. @ar
toolkit label: عنوان مختصر @ar
toolkit definition: عنوان تم اختصاره لأغراض التكشيف أو التحديد. @ar
label: lühendatud pealkiri @et
definition: Seostab kehastuse pealkirjaga, mis on esitatud indekseerimise või identifitseerimise tarbeks lühendatud kujul. @et
toolkit label: lühendatud pealkiri @et
toolkit definition: Pealkiri, mis on esitatud indekseerimise või identifitseerimise tarbeks lühendatud kujul. @et
label: ha come titolo abbreviato @it
definition: Correla una manifestazione a un titolo abbreviato per scopi di indicizzazione o identificazione. @it
toolkit label: titolo abbreviato @it
toolkit definition: Titolo abbreviato per scopi di indicizzazione o identificazione. @it
label: saīsināts nosaukums @lv
definition: Sasaista manifestāciju ar nomenu, kas ir saīsināts nosaukums prekšmetošanas vai indeksēšanas vajadzībām. @lv
toolkit label: saīsināts nosaukums @lv
toolkit definition: Saīsināts nosaukums prekšmetošanas vai indeksēšanas vajadzībām. @lv
label: 有缩略题名 @zh-hans
definition: 将一种载体表现与作为一个题名并为索引或标识的目的而被缩略的一个命名关联起来。 @zh-hans
toolkit label: 缩略题名 @zh-hans
toolkit definition: 作为一个题名并为索引或标识的目的而被缩略的一个命名 @zh-hans
label: kısaltılmış başlık ile ilişkilidir @tr
definition: Bir gösterimi,dizinleme veya tanımlama amacıyla kısaltılmış bir başlık olan bir isimle ilişkilendirir. @tr
toolkit label: kısaltılmış başlık @tr
toolkit definition: Dizinleme veya tanımlama amacıyla kısaltılmış bir başlık olan bir isim. @tr
label: tiene título abreviado @es

has track configuration
status: Published
definition: Relates a manifestation to a configuration of the audio track on a soundtrack film.
type: Property
domain: C10007
sub property of: has sound characteristic
lexical alias: trackConfiguration.en
instruction number: 3.16.6
toolkit label: track configuration
toolkit definition: A configuration of the audio track on a soundtrack film.
label: a pour configuration de piste @fr
definition: Met une manifestation en relation avec une configuration de la piste audio sur une bande sonore de film. @fr
toolkit label: configuration de piste @fr
toolkit definition: Configuration de la piste audio sur une bande sonore de film. @fr
toolkit label: configuración de pista @es
toolkit definition: Una configuración de la pista de audio de una película de banda sonora. @es
label: har ljudspårskonfiguration för film @sv
toolkit label: ljudspårskonfiguration för film @sv
toolkit label: trackconfiguratie @nl
toolkit definition: Een configuratie van het geluidsspoor van een geluidsfilm. @nl
label: có cấu hình rãnh @vi
definition: Liên kết biểu thị với cấu hình của rãnh audio trên phim có rãnh âm thanh. @vi
toolkit label: cấu hình rãnh @vi
toolkit definition: Cấu hình của rãnh audio trên phim có rãnh âm thanh. @vi
label: har sporkonfiguration @da
definition: Relaterer en manifestation til en konfiguration af lydsporet til en film med lydspor. @da
toolkit label: sporkonfiguration @da
toolkit definition: Konfiguration af lydsporet til en film med lydspor. @da
label: hat Tonspurlage @de
definition: Setzt eine Manifestation in Beziehung zu einer Positionierung der Tonspur auf einem Film mit Tonspur. @de
toolkit label: Tonspurlage @de
toolkit definition: Eine Positionierung der Tonspur auf einem Film mit Tonspur. @de
label: té com a configuració de pista @ca
definition: Relaciona una manifestació amb una configuració de la pista àudio en la banda sonora d’una pel·lícula. @ca
toolkit label: configuració de pista @ca
toolkit definition: Configuració de la pista àudio en la banda sonora d’una pel·lícula. @ca
definition: Liittää manifestaation ääniraidan asemointiin äänifilmissä. @fi
toolkit label: ääniraidan sijainti @fi
toolkit definition: Ääniraidan asemointi äänifilmissä. @fi
toolkit label: sporkonfigurasjon @no
toolkit definition: En konfigurasjon av lydsporet til en film med lydspor. @no
label: έχει διαμόρφωση κομματιού @el
definition: Συνδέει μια εκδήλωση με μια διαμόρφωση του ηχητικού κομματιού σε ένα τμήμα ήχου για ταινία. @el
toolkit label: διαμόρφωση κομματιού @el
toolkit definition: Μια διαμόρφωση του ηχητικού κομματιού σε ένα τμήμα ήχου για ταινία. @el
has element type: 4
label: sávkonfigurációja a következő: @hu
definition: Hozzákapcsol egy megjelenési formát egy hangsávos film audiosávjainak konfigurációjához. @hu
toolkit label: sávkonfigurációja: @hu
toolkit definition: Egy hangsávos film audiosávjainak konfigurációja. @hu
label: ääniraidan sijainti @fi
label: har sporkonfigurasjon @no
definition: Relaterer en manifestasjon til en konfigurasjon av lydsporet til en film med lydspor. @no
label: heeft trackconfiguratie @nl
definition: Relateert een manifestatie aan een configuratie van het geluidsspoor van een geluidsfilm. @nl
label: له بنية مسار @ar
definition: يربط بين تجسيدة وضبط المسار الصوتي على مسار الصوت على الفيلم. @ar
toolkit label: بنية مسار @ar
toolkit definition: ضبط المسار الصوتي على مسار الصوت على الفيلم. @ar
label: heliriba paigutus @et
definition: Seostab kehastuse helifilmi heliriba paigutusega. @et
toolkit label: heliriba paigutus @et
toolkit definition: Helifilmi heliriba paigutus. @et
label: ha come configurazione della traccia @it
definition: Correla una manifestazione a una configurazione della traccia audio su una pellicola con traccia audio. @it
toolkit label: configurazione della traccia @it
toolkit definition: Configurazione della traccia audio su una pellicola con traccia audio. @it
label: skaņas celiņu konfigurācija @lv
definition: Sasaista manifestāciju ar audio skaņas celiņu konfigurāciju kinofilmas lentē. @lv
toolkit label: skaņas celiņu konfigurācija @lv
toolkit definition: Audio skaņas celiņu konfigurācija kinofilmas lentē. @lv
label: 有音轨配置 @zh-hans
definition: 将一种载体表现与原声电影片上的音轨配置关联起来。 @zh-hans
toolkit label: 音轨配置 @zh-hans
toolkit definition: 原声电影片上的音轨配置 @zh-hans
label: parça yapılandırması ile ilişkilidir @tr
definition: Bir gösterimi, bir film müziği filmindeki ses parçasının bir konfigürasyonuyla ilişkilendirir. @tr
toolkit label: müzik parçası konfigürasyonu @tr
toolkit definition: Bir film müziği filminde müzik parçasının bir konfigürasyonu. @tr
label: tiene configuración de pista @es

has details of track configuration
status: Published
type: Property
lexical alias: detailsOfTrackConfiguration.en
definition: Relates a manifestation to details of a configuration of the audio track on a sound-track film.
domain: C10007
instruction number: 3.16.6.4
toolkit label: details of track configuration
toolkit definition: Details of a configuration of the audio track on a sound-track film.
toolkit label: detalles de la configuración de la pista @es
toolkit definition: Detalles de una configuración de la pista de audio en una película con banda sonora. @es
sub property of: has details of sound characteristic
label: har detaljerad information om ljudspårskonfiguration för film @sv
toolkit label: detaljerad information om ljudspårskonfiguration för film @sv
toolkit label: details van nummerconfiguratie @nl
toolkit definition: Details van een configuratie van het geluidsspoor van een geluidsfilm. @nl
label: có chi tiết của đặc trưng rãnh @vi
definition: Liên kết biểu thị với chi tiết của cấu hình của rãnh audio trên phim có rãnh âm thanh. @vi
toolkit label: chi tiết của đặc trưng rãnh @vi
toolkit definition: Chi tiết của cấu hình của rãnh audio trên phim có rãnh âm thanh. @vi
label: har detaljer om lydsporskonfiguration @da
definition: Relaterer en manifestation til detaljer om en konfiguration af lydsporet til en film med soundtrack. @da
toolkit label: detaljer om lydsporskonfiguration @da
toolkit definition: Detaljer om en konfiguration af lydsporet til en film med soundtrack. @da
label: hat Details zur Tonspurlage @de
definition: Setzt eine Manifestation in Beziehung zu Details zur Positionierung der Tonspur auf einem Film mit Tonspur. @de
toolkit label: Details zur Tonspurlage @de
toolkit definition: Details zur Positionierung der Tonspur auf einem Film mit Tonspur. @de
label: té com a particularitats de configuració de pista @ca
definition: Relaciona una manifestació amb les particularitats d’una configuració de la pista àudio en una banda sonora d’una pel·lícula. @ca
toolkit label: particularitats de configuració de pista @ca
toolkit definition: Particularitats d’una configuració de la pista àudio en una banda sonora d’una pel·lícula. @ca
definition: Liittää manifestaation tarkempiin tietoihin ääniraidan sijainnista äänifilmissä. @fi
toolkit label: ääniraidan sijainnin tarkemmat tiedot @fi
toolkit definition: Tarkemmat tiedot ääniraidan sijainnista äänifilmissä. @fi
toolkit label: detaljer vedrørende sporkonfigurasjon @no
toolkit definition: Detaljer vedrørende konfigurasjon av lydsporet til en film med lydspor. @no
label: έχει λεπτομέρειες της διαμόρφωσης κομματιού @el
definition: Συνδέει μια εκδήλωση με τις λεπτομέρειες μιας διαμόρφωσης του ηχητικού κομματιού σε ένα τμήμα ήχου για ταινία. @el
toolkit label: λεπτομέρειες της διαμόρφωσης του κομματιού @el
toolkit definition: Λεπτομέρειες μιας διαμόρφωσης του ηχητικού κομματιού σε ένα τμήμα ήχου για ταινία. @el
label: a pour particularités d’une configuration de piste @fr
definition: Met une manifestation en relation avec des particularités d’une configuration de la piste audio sur une bande sonore de film. @fr
toolkit label: particularités d’une configuration de piste @fr
toolkit definition: Particularités d’une configuration de la piste audio sur une bande sonore de film. @fr
has element type: 6
label: sávkonfiguráció részletei a következők: @hu
definition: Hozzákapcsol egy megjelenési formát a hangsáv konfigurációjának részleteihez egy hangsávos filmen. @hu
toolkit label: sávkonfiguráció részletei: @hu
toolkit definition: A hangsáv konfigurációjának részletei egy hangsávos filmen. @hu
label: ääniraidan sijainnin tarkemmat tiedot @fi
label: har detaljer vedrørende sporkonfigurasjon @no
definition: Relaterer en manifestasjon til detaljer vedrørende konfigurasjon av lydsporet til en film med lydspor. @no
label: heeft details van nummerconfiguratie @nl
definition: Relateert een manifestatie aan details van een configuratie van het geluidsspoor van een geluidsfilm. @nl
label: له تفاصيل عن بنية مسار @ar
definition: يربط بين تجسيدة وتفاصيل إعدادات مسار الصوت على مسار صوت الفيلم. @ar
toolkit label: تفاصيل عن بنية مسار @ar
toolkit definition: تفاصيل إعدادات مسار الصوت على مسار صوت الفيلم. @ar
label: salvestustüübi täpsustus @et
definition: Seostab kehastuse täpsemate andmetega meetodi kohta, mida on kasutatud helisisu kodeerimiseks taasesituse tarbeks. @et
toolkit label: salvestustüübi täpsustus @et
toolkit definition: Täpsemad andmed meetodi kohta, mida on kasutatud helisisu kodeerimiseks taasesituse tarbeks. @et
label: ha come particolari relativi alla configurazione della traccia @it
definition: Correla una manifestazione ai particolari relativi a una configurazione della traccia audio su una pellicola con traccia audio. @it
toolkit label: particolari relativi alla configurazione della traccia @it
toolkit definition: Particolari relativi a una configurazione della traccia audio su una pellicola con traccia audio. @it
label: detalizēti par skaņu celiņa konfigurāciju @lv
definition: Sasaista manifestāciju ar sīkāku informāciju par audio skaņas celiņa atrašanās vietu kinofilmas lentē. @lv
toolkit label: detalizēti par skaņu celiņa konfigurāciju @lv
toolkit definition: Sīkāka informācija par audio skaņas celiņa atrašanās vietu kinofilmas lentē. @lv
label: 有音轨配置的细节 @zh-hans
definition: 将一种载体表现与原声电影片上的音轨配置的细节关联起来。 @zh-hans
toolkit label: 音轨配置的细节 @zh-hans
toolkit definition: 原声电影片上的音轨配置的细节 @zh-hans
label: parça yapılandırmasının ayrıntıları ile ilişkilidir @tr
definition: Bir gösterimi, bir ses bandı filmi üzerindeki ses parçası konfigürasyonunun ayrıntılarıyla ilişkilendirir. @tr
toolkit label: parça yapılandırmasının ayrıntıları @tr
toolkit definition: Ses bantlı bir filmdeki ses parçasının yapılandırmasına ilişkin ayrıntılar. @tr
label: tiene detalles de la configuración de la pista @es

has series statement
status: Published
definition: Relates a manifestation to a statement that identifies a series that is associated with a manifestation and a numbering of a manifestation within the series,
type: Property
scope note: A series statement includes any or all of title of series, other title information of series, statement of responsibility relating to series, and numbering within sequence.
domain: C10007
lexical alias: seriesStatement.en
instruction number: 2.12
toolkit label: series statement
toolkit definition: A statement that identifies a series that is associated with a manifestation and a numbering of a manifestation within the series,
label: a pour mention de collection @fr
definition: Met une manifestation en relation avec une mention qui identifie une collection associée à une manifestation et une numérotation d’une manifestation à l’intérieur de la collection. @fr
scope note: Une mention de collection comprend une partie ou la totalité des informations suivantes : titre de collection, complément de titre de collection, mention de responsabilité relative à une collection et numérotation au sein d’une séquence. @fr
toolkit label: mention de collection @fr
toolkit definition: Mention qui identifie une collection associée à une manifestation et une numérotation d’une manifestation à l’intérieur de la collection. @fr
toolkit label: declaración de serie @es
toolkit definition: Una declaración que identifica una serie que está asociada a una manifestación y una numeración de una manifestación dentro de la serie, @es
label: har serieuppgift @sv
toolkit label: serieuppgift @sv
toolkit label: reeksvermelding @nl
toolkit definition: Een vermelding die een reeks identificeert die geassocieerd is met een manifestatie en een nummering van de manifestatie binnen de reeks. @nl
label: có thông tin tùng thư @vi
definition: Liên kết biểu thị với thông tin nhận dạng tùng thư mà biểu thị thuộc vào và đánh số của biểu thị bên trong tùng thư đó. @vi
scope note: Thông tin tùng thư có thể bao gồm thông tin nhận dạng một hoặc nhiều hơn tiểu tùng thư mà tài nguyên đạng được mô tả thuộc vào. Thông tin tùng thư đôi khi bao gồm thông tin trách nhiệm liên quan tới tùng thư hoặc tiểu tùng thư. @vi
toolkit label: thông tin tùng thư @vi
toolkit definition: Thông tin nhận dạng tùng thư mà biểu thị thuộc vào và đánh số của biểu thị bên trong tùng thư đó. @vi
scope note: Een reeksvermelding omvat een of alle hoofdtitels, andere titelinformatie, verantwoordelijkheidsvermelding en nummering binnen de reeks gerelateerd aan een reeks. @nl
label: har seriebetegnelse @da
definition: Relaterer en manifestation til en oplysning, som identificerer en serie og en nummerering indenfor serie, som er knyttet til en manifestation. @da
scope note: Seriebetegnelse indeholder hvilken som helst eller alle af: hovedtitel, anden titelinformation, ophavsangivelse, og en nummerering indenfor serie, som relaterer til en serie. @da
toolkit label: seriebetegnelse @da
toolkit definition: Oplysning, som identificerer en serie og en nummerering indenfor serie, som er knyttet til en manifestation. @da
label: hat Gesamttitelangabe @de
definition: Setzt eine Manifestation in Beziehung zu einer Angabe, die eine Reihe identifiziert, mit der eine Manifestation in Verbindung steht und die eine Zählung einer Manifestation innerhalb der Reihe aufweisen kann. @de
scope note: Darunter fallen eine, mehrere oder alle der folgenden Angaben: Titel einer Reihe, Titelzusätze einer Reihe, Verantwortlichkeitsangaben, die sich auf eine Reihe beziehen, und eine Zählung innerhalb einer Reihe. @de
toolkit label: Gesamttitelangabe @de
toolkit definition: Eine Angabe, die eine Reihe identifiziert, mit der eine Manifestation in Verbindung steht und die eine Zählung einer Manifestation innerhalb der Reihe aufweisen kann. @de
label: té com a menció de col·lecció @ca
definition: Relaciona una manifestació amb una menció que identifica una col·lecció que s’associa amb una manifestació i una numeració d’una manifestació dins d’una col·lecció. @ca
scope note: Una menció de col·lecció inclou, en tot o en part, el títol de col·lecció, el complement de títol de col·lecció, la menció de responsabilitat relativa a la col·lecció i la numeració dins d’una seqüència. @ca
toolkit label: menció de col·lecció @ca
toolkit definition: Menció que identifica una col·lecció que s’associa amb una manifestació i una numeració d’una manifestació dins d’una col·lecció. @ca
definition: Liittää manifestaation merkintöön, joka identifioi sarjan, joka liittyy manifestaatioon ja manifestaation numerointiin sarjassa. @fi
toolkit label: sarjamerkintö @fi
toolkit definition: Merkintö, joka identifioi sarjan, joka liittyy manifestaatioon ja manifestaation numerointiin sarjassa. @fi
toolkit label: serieangivelse @no
toolkit definition: En angivelse som identifiserer en serie og en nummerering innen serien som er knyttet til en manifestasjon. @no
label: έχει μνεία σειράς @el
definition: Συνδέει μια εκδήλωση με μια μνεία που ταυτίζει μια σειρά στην οποία ανήκει η εκδήλωση και μια αρίθμηση μιας εκδήλωσης εντός της σειράς. @el
scope note: Μια μνεία ευθύνης μπορεί επίσης να περιλαμβάνει πληροφορίες που ταυτίζουν μία ή περισσότερες υποσειρές στις οποίες ανήκει ο περιγραφόμενος πόρος. Μια μνεία σειράς κάποιες φορές περιλαμβάνει μνείες ευθύνης που σχετίζονται με μια σειρά ή υποσειρά. @el
toolkit label: μνεία σειράς @el
toolkit definition: Μια μνεία που ταυτίζει μια σειρά στην οποία ανήκει η εκδήλωση και μια αρίθμηση μιας εκδήλωσης εντός της σειράς. @el
has element type: 6
label: sorozati közlése a következő: @hu
definition: Hozzákapcsol egy megjelenési formát egy közléshez, amely azonosít egy megjelenési formához kapcsolódó sorozatot és a megjelenési forma sorozaton belüli számozását. @hu
scope note: Egy sorozati közlés magában foglalja a sorozat bármely vagy összes főcímét, egy sorozat egyébcím-információját, a sorozattal kapcsolatos felelősségi közlést-t és a sorrendiséget jelző számozást. @hu
toolkit label: sorozati közlése: @hu
toolkit definition: Egy közlés, amely azonosít egy megjelenési formához kapcsolódó sorozatot és a megjelenési forma sorozaton belüli számozását. @hu
scope note: Sarjamerkintö sisältää sarjaan liittyvän päänimikkeen, muun nimeketiedon, vastuullisuumerkinnön ja/tai sarjan sisäisen numeroinnin. @fi
label: sarjamerkintö @fi
label: har serieangivelse @no
definition: Relaterer en manifestasjon til en angivelse som identifiserer en serie og en nummerering innen serien som er knyttet til en manifestasjon. @no
scope note: En serieangivelse inkluderer en hvilken som helst hovedtittel eller annen tittelinformasjon, ansvarsangivelse og nummerering innen serien som knyttes til en serie. @no
label: heeft reeksvermelding @nl
definition: Relateert een manifestatie aan een vermelding die een reeks identificeert die geassocieerd is met een manifestatie en een nummering van de manifestatie binnen de reeks. @nl
label: له بيان السلسلة @ar
definition: يربط بين تجسيدة وبيان يحدد سلسلة وترقيم داخل السلاسل المرتبطة بتجسيدة. @ar
scope note: يشمل بيان السلسلة أي أو كل من العنوان نفسه وبيانات العنوان الأخرى وبيان المسئولية والترقيم داخل السلسلة. @ar
toolkit label: بيان السلسلة @ar
toolkit definition: بيان يحدد سلسلة وترقيم داخل السلاسل المرتبطة بتجسيدة. @ar
label: seeriaandmed @et
definition: Seostab kehastuse andmetega, mis identifitseerivad kehastusega seotud seeria ja seeriasisese numbri. @et
scope note: Seeriaandmed sisaldavad seeria põhipealkirja, pealkirja täiendandmed, vastutusandmed ja seeriasisese numbri, või vähemalt ühe neist. @et
alternative label: sarjaandmed @et
toolkit label: seeriaandmed @et
toolkit definition: Andmed, mis identifitseerivad kehastusega seotud seeria ja seeriasisese numbri. @et
label: ha come formulazione di serie @it
definition: Correla una manifestazione a una formulazione che identifica una serie e una numerazione all'interno della serie associata a una manifestazione. @it
scope note: Una formulazione di serie comprende una o tutte le informazioni relative alla serie: titolo proprio, altre informazioni sul titolo, formulazione di responsabilità e numerazione all’interno della serie. @it
toolkit label: formulazione di serie @it

has ISSN of series (Deprecated)
status: Deprecated
definition: Relates a manifestation to an identifier for manifestation that is assigned to a series by an ISSN registration agency. (Deprecated)
type: Property
domain: C10007
lexical alias: issnOfSeries.en
instruction number: 2.12.8
toolkit label: ISSN of series (Deprecated)
toolkit definition: An identifier for manifestation that is assigned to a series by an ISSN registration agency. (Deprecated)
label: a pour ISSN de collection @fr
definition: Met une manifestation en relation avec un identifiant attribué à une collection par une agence d’enregistrement de l’ISSN. @fr
toolkit label: ISSN de collection @fr
toolkit definition: Identifiant attribué à une collection par une agence d’enregistrement de l’ISSN. @fr
toolkit label: ISSN de series @es
toolkit definition: El identificador asignado a una serie por una agencia de registro del ISSN. @es
label: har series ISSN @sv
toolkit label: series ISSN @sv
toolkit label: ISSN van reeks @nl
toolkit definition: Een identificatie toegekend aan een reeks door een ISSN-registratiebureau. @nl
label: có issn của tùng thư @vi
definition: Liên kết biểu thị với chỉ số nhận dạng được cơ quan đăng ký ISSN gán cho tùng thư. @vi
toolkit label: ISSN của tùng thư @vi
toolkit definition: Chỉ số nhận dạng được cơ quan đăng ký ISSN gán cho tùng thư. @vi
label: har ISSN for serie @da
definition: Relaterer en manifestation til en unik identifikator givet til en serie af en ISSN-registreringsinstitution. @da
toolkit label: ISSN for serie @da
toolkit definition: Unik identifikator givet til en serie af en ISSN-registreringsinstitution. @da
label: hat ISSN der Reihe @de
definition: Setzt eine Manifestation mit einem Identifikator, der einer Reihe durch eine ISSN-Registrierungsstelle zugewiesen wird, in Beziehung. @de
toolkit label: ISSN der Reihe @de
toolkit definition: Ein Identifikator, der einer Reihe durch eine ISSN-Registrierungsstelle zugewiesen wird. @de
label: té com a ISSN de col·lecció @ca
definition: Relaciona una manifestació amb un identificador assignat a una col·lecció per una agència de registre de l’ISSN. @ca
toolkit label: ISSN de col·lecció @ca
toolkit definition: Identificador assignat a una col·lecció per una agència de registre de l’ISSN. @ca
label: sarjan ISSN-tunnus @fi
definition: Liittää manifestaation ISSN-keskuksen sarjalle antamaan tunnisteeseen. @fi
toolkit label: sarjan ISSN-tunnus @fi
toolkit definition: ISSN-keskuksen sarjalle antama tunniste. @fi
toolkit definition: En identifikator tildelt en serie av et ISSN-kontor. @no
label: έχει ISSN της σειράς @el
definition: Συνδέει μια εκδήλωση με ένα αναγνωριστικό που ανατίθεται σε μια σειρά από έναν φορέα απόδοσης του ISSN. @el
toolkit label: ISSN της σειράς @el
toolkit definition: Ένα αναγνωριστικό που ανατίθεται σε μια σειρά από έναν φορέα απόδοσης του ISSN. @el
has element type: 2
label: van sorozati ISSN-je @hu
definition: Egy megjelenési formát hozzákapcsol egy azonosítóhoz, amelyet egy ISSN regisztrációs ügynökség utal ki egy sorozatnak. @hu
toolkit label: sorozat ISSN-je @hu
toolkit definition: Egy azonosító, amelyet egy ISSN regisztrációs ügynökség utalt ki egy sorozatnak. @hu
has subproperty: P30166

has other title information of series
status: Published
definition: Relates a manifestation to a word, character, or group of words or characters that appears in conjunction with, and is subordinate to, a title of series.
type: Property
domain: C10007
lexical alias: otherTitleInformationOfSeries.en
instruction number: 2.12.4
toolkit label: other title information of series
toolkit definition: A word, character, or group of words or characters that appears in conjunction with, and is subordinate to, a title of series.
label: a pour complément de titre de collection @fr
definition: Met une manifestation en relation avec un mot, un caractère ou un groupe de mots ou de caractères qui figure conjointement avec un titre propre de collection et lui est subordonné. @fr
toolkit label: complément de titre de collection @fr
toolkit definition: Mot, caractère ou groupe de mots ou de caractères qui figure conjointement avec un titre propre de collection et lui est subordonné. @fr
toolkit label: otra información del título de la serie @es
toolkit definition: Una palabra, carácter o grupo de palabras o caracteres que aparece junto con, y está subordinada a, un título de serie. @es
label: har övrig titelinformation för serie @sv
toolkit label: övrig titelinformation för serie @sv
toolkit label: andere titelinformatie van reeks @nl
toolkit definition: Een woord, karakter of groep woorden en/of karakters die verschijnen samen met, en ondergeschikt zijn aan de hoofdtitel van een reeks. @nl
label: có thông tin nhan đề khác của tùng thư @vi
definition: Liên kết biểu thị với từ, ký tự, hoặc nhóm từ hoặc ký tự, xuất hiện cùng với, và là dưới cấp của, nhan đề hợp thức của tùng thư. @vi
toolkit label: thông tin nhan đề khác của tùng thư @vi
toolkit definition: Từ, ký tự, hoặc nhóm từ hoặc ký tự, xuất hiện cùng với, và là dưới cấp của, nhan đề hợp thức của tùng thư. @vi
label: har anden titelinformation for serie @da
definition: Relaterer en manifestation til et ord, tegn eller en gruppe af ord eller tegn, som optræder i forbindelse med, og er underordnet, en serietitel. @da
toolkit label: anden titelinformation for serie @da
toolkit definition: Ord, tegn eller gruppe af ord eller tegn, som optræder i forbindelse med, og er underordnet, en serietitel. @da
label: hat Titelzusatz einer Reihe @de
definition: Setzt eine Manifestation in Beziehung zu einem Wort, einem Zeichen oder einer Gruppe von Wörtern oder Zeichen, die in Verbindung mit dem Titel einer Reihe erscheinen und diesem nachgeordnet sind. @de
toolkit label: Titelzusatz einer Reihe @de
toolkit definition: Ein Wort, ein Zeichen oder eine Gruppe von Wörtern oder Zeichen, die in Verbindung mit dem Titel einer Reihe erscheinen und diesem nachgeordnet sind. @de
label: té com a complement de títol de col·lecció @ca
definition: Relaciona una manifestació amb una paraula, caràcter o grup de paraules o de caràcters que figura en conjunció i subordinat a un títol de col·lecció. @ca
toolkit label: complement de títol de col·lecció @ca
toolkit definition: Paraula, caràcter o grup de paraules o de caràcters que figura en conjunció i subordinat a un títol de col·lecció. @ca
definition: Liittää manifestaation sanaan, merkkiin tai ryhmään sanoja ja/tai merkkejä, jotka esiintyvät sarjan päänimekkeen kanssa ja sille alisteisina. @fi
toolkit label: sarjan muu nimeketieto @fi
toolkit definition: Sana, merkki tai ryhmä sanoja ja/tai merkkejä jotka esiintyvät sarjan päänimekkeen kanssa ja sille alisteisina. @fi
toolkit label: annen serietittelinformasjon @no
toolkit definition: Et ord, et tegn eller en gruppe av ord eller tegn som opptrer i forbindelse med, og er underordnet tittelen til en serie. @no
label: έχει άλλες πληροφορίες σχετικές με τον τίτλο σειράς @el
definition: Συνδέει μια εκδήλωση με μια λέξη, έναν χαρακτήρα ή μια ομάδα λέξεων ή χαρακτήρων που εμφανίζονται σε συνδυασμό με και είναι υποδεέστεροι του κύριου τίτλου μιας σειράς. @el
toolkit label: άλλες πληροφορίες σχετικές με τον τίτλο σειράς @el
toolkit definition: Μια λέξη, ένας χαρακτήρας ή μια ομάδα λέξεων ή χαρακτήρων που εμφανίζονται σε συνδυασμό με και είναι υποδεέστεροι του κύριου τίτλου μιας σειράς. @el
has element type: 6
label: sorozati egyéb címinformációja a következő: @hu
definition: Hozzákapcsol egy megjelenési formát egy szóhoz, karakterhez, vagy szavak vagy karakterek egy csoportjához, amely egy sorozat címével párosulva, vagy annak alávetve jelenik meg. @hu
toolkit label: sorozati egyéb címinformációja: @hu
toolkit definition: Egy szó, karakter, vagy szavak vagy karakterek egy csoportja, amely egy sorozat címével párosulva, vagy annak alávetve jelenik meg. @hu
alternative label: other title information of subseries
alternative label: alasarjan muu nimeketieto @fi
label: sarjan muu nimeketieto @fi
label: har annen serietittelinformasjon @no
definition: Relaterer en manifestasjon til et ord, et tegn eller en gruppe av ord eller tegn som opptrer i forbindelse med, og er underordnet tittelen til en serie. @no
alternative label: annen tittelinformasjon for underserie @no
alternative label: complément de titre de sous-collection @fr
label: heeft andere titelinformatie van reeks @nl
definition: Relateert een manifestatie aan een woord, karakter of groep woorden en/of karakters die verschijnen samen met, en ondergeschikt zijn aan de hoofdtitel van een reeks. @nl
label: له بيانات عناوين أخرى لسلسلة @ar
definition: يربط بين تجسيدة وكلمة أو حرف أو مجموعة كلمات أو تمثيلات تظهر بمصاحبة، وكفرع من عنوان سلسلة. @ar
alternative label: بيانات أخرى لعنوان السلسلة الفرعية @ar
toolkit label: بيانات عناوين أخرى لسلسلة @ar
toolkit definition: كلمة أو حرف أو مجموعة كلمات أو تمثيلات تظهر بمصاحبة، وكفرع من عنوان سلسلة. @ar
alternative label: complement de títol de subcol·lecció @ca
alternative label: anden titelinformation for underserie @da
label: seeriapealkirja täiendandmed @et
definition: Seostab kehastuse sõna, märgi või sõnade ja/või märkide rühmaga, mis on seotud seeria pealkirjaga ja allub sellele. @et
alternative label: allseeria pealkirja täiendandmed @et
toolkit label: seeriapealkirja täiendandmed @et
toolkit definition: Sõna, märk või sõnade ja/või märkide rühm, mis on seotud seeria pealkirjaga ja allub sellele. @et
alternative label: Titelzusatz einer Unterreihe @de
alternative label: alsorozatra vonatkozó egyéb címinformáció: @hu
label: ha come altre informazioni sul titolo della serie @it
definition: Correla una manifestazione a una parola, carattere, o gruppo di parole e/o caratteri che compaiono unitamente e subordinatamente al titolo di una serie. @it
alternative label: altre informazioni sul titolo della sottoserie @it
toolkit label: altre informazioni sul titolo della serie @it
toolkit definition: Parola, carattere, o gruppo di parole e/o caratteri che compaiono unitamente e subordinatamente al titolo di una serie. @it
label: sērijas citas nosaukumziņas @lv
toolkit label: sērijas citas nosaukumziņas @lv
toolkit definition: Ziņas, kas saistītas ar sērijas pamatnosaukumu un ir pakļautas sērijas pamatnosaukumam. @lv
toolkit label: 丛编的其他题名信息 @zh-hans

has parallel other title information of series
status: Published
definition: Relates a manifestation to an other title information of series in another language or script.
type: Property
domain: C10007
lexical alias: parallelOtherTitleInformationOfSeries.en
instruction number: 2.12.5
toolkit label: parallel other title information of series
toolkit definition: An other title information of series in another language or script.
label: a pour complément de titre parallèle de collection @fr
definition: Met une manifestation en relation avec un complément de titre de collection dans une autre langue ou écriture. @fr
toolkit label: complément de titre parallèle de collection @fr
toolkit definition: Complément de titre de collection dans une autre langue ou écriture. @fr
toolkit label: otra información de título paralela de la serie @es
toolkit definition: Otra información de título de serie en otro idioma o escritura. @es
label: har parallell övrig titelinformation för serie @sv
toolkit label: parallell övrig titelinformation för serie @sv
toolkit label: parallelle overige titelinformatie van reeks @nl
toolkit definition: Overige titelinformatie van een reeks in een taal en/of schrift dat afwijkt van die zoals is opgenomen in het element reeks. @nl
label: có thông tin nhan đề khác song song của tùng thư @vi
definition: Liên kết biểu thị với thông tin nhan đề khác của tùng thư trong ngôn ngữ hoặc hệ thống viết khác với được ghi trong yếu tố thông tin nhan đề khác của tùng thư. @vi
toolkit label: thông tin nhan đề khác song song của tùng thư @vi
toolkit definition: Thông tin nhan đề khác của tùng thư trong ngôn ngữ hoặc hệ thống viết khác với được ghi trong yếu tố thông tin nhan đề khác của tùng thư. @vi
label: har parallel anden titelinformation for serie @da
definition: Relaterer en manifestation til en anden titelinformation for serie på et andet sprog eller skriftsystem. @da
toolkit label: parallel anden titelinformation for serie @da
toolkit definition: Anden titelinformation for serie på et andet sprog eller skriftsystem. @da
label: hat parallelen Titelzusatz einer Reihe @de
definition: Setzt eine Manifestation in Beziehung zu einem Titelzusatz einer Reihe in einer anderen Sprache oder einer anderen Schrift. @de
toolkit label: Paralleler Titelzusatz einer Reihe @de
toolkit definition: Ein Titelzusatz einer Reihe in einer anderen Sprache oder einer anderen Schrift. @de
label: té com a complement paral·lel de títol de col·lecció @ca
definition: Relaciona una manifestació amb un complement de títol d’una col·lecció en una altra llengua o escriptura. @ca
toolkit label: complement paral·lel de títol de col·lecció @ca
toolkit definition: Complement de títol d’una col·lecció en una altra llengua o escriptura. @ca
definition: Liittää manifestaation sarjan muuhun nimeketietoon toisella kielellä ja/tai kirjoitusjärjestelmällä. @fi
toolkit label: sarjan rinnakkainen muu nimeketieto @fi
toolkit definition: Sarjan muu nimeketieto toisella kielellä ja/tai kirjoitusjärjestelmällä. @fi
toolkit label: parallell annen serietittelinformasjon @no
toolkit definition: Annen serietittelinformasjonpå et annet språk eller i et annet skriftsystem. @no
label: έχει άλλες πληροφορίες σχετικές με τον παράλληλο τίτλο σειράς @el
definition: Συνδέει μια εκδήλωση με άλλες πληροφορίες σχετικές με τον τίτλο σειράς σε μια γλώσσα ή γραφή που διαφέρει από εκείνη με την οποία καταχωρίστηκαν στο στοιχείο των άλλων πληροφοριών σχετικά με τον τίτλο σειράς. @el
toolkit label: άλλες πληροφορίες σχετικές με τον παράλληλο τίτλο σειράς @el
toolkit definition: Άλλες πληροφορίες σχετικές με τον τίτλο σειράς σε μια γλώσσα ή γραφή που διαφέρει από εκείνη με την οποία καταχωρίστηκαν στο στοιχείο των άλλων πληροφοριών σχετικών με τον τίτλο σειράς. @el
sub property of: has other title information of series
has element type: 3
sub property of: has parallel other title information
label: sorozat párhuzamos egyéb címinformációja a következő: @hu
definition: Hozzákapcsol egy megjelenési formát egy sorozat egyéb címinformációjához egy másik nyelven vagy írásmódban. @hu
toolkit label: sorozat párhuzamos egyéb címinformációja: @hu
toolkit definition: Egy sorozat egyéb címinformációja egy másik nyelven vagy írásmódban. @hu
alternative label: parallel other title information of subseries
alternative label: alasarja rinnakkainen muu nimeketieto @fi
label: sarjan rinnakkainen muu nimeketieto @fi
label: har parallell annen serietittelinformasjon @no
definition: Relaterer en manifestasjon til annen serietittelinformasjonpå et annet språk eller i et annet skriftsystem. @no
alternative label: parallell annen tittelinformasjon for underserie @no
alternative label: complément de titre parallèle de sous-collection @fr
label: heeft parallelle overige titelinformatie van reeks @nl
definition: Relateert een manifestatie aan overige titelinformatie van een reeks in een taal en/of schrift dat afwijkt van die zoals is opgenomen in het element reeks. @nl
label: له معلومات عنوان أخرى بديلة لسلسلة @ar
definition: يربط بين تجسيدة ومعلومات أخرى لعنوان سلسلة في لغة أخرى أو نظام آخر للحروف. @ar
alternative label: بيانات أخرى لعنوان بديل لسلسلة فرعية @ar
toolkit label: معلومات عنوان أخرى بديلة لسلسلة @ar
toolkit definition: معلومات أخرى لعنوان سلسلة في لغة أخرى أو نظام آخر للحروف. @ar
alternative label: complement paral·lel de títol de subcol·lecció @ca
alternative label: parallel anden titelinformation for underserie @da
label: seeriapealkirja rööptäiendandmed @et
definition: Seostab kehastuse seeriapealkirja täiendandmetega teises keeles või kirjasüsteemis. @et
alternative label: allseeria pealkirja rööptäiendandmed @et
toolkit label: seeriapealkirja rööptäiendandmed @et
toolkit definition: Seeriapealkirja täiendandmed teises keeles või kirjasüsteemis. @et
alternative label: Paralleler Titelzusatz einer Unterreihe @de
alternative label: alsorozat párhuzamos egyéb címinformációja: @hu
label: ha come altre informazioni sul titolo della serie parallele @it
definition: Correla una manifestazione ad altre informazioni sul titolo della serie in una lingua e/o scrittura diversa. @it
toolkit label: altre informazioni sul titolo della serie parallele @it
toolkit definition: Altre informazioni sul titolo della serie in una lingua e/o scrittura diversa. @it
label: sērijas paralēlās citas nosaukumziņas @lv
definition: Sasaista manifestāciju ar sērijas citām nosaukumziņām citā valodā vai rakstībā. @lv
toolkit label: sērijas paralēlās citas nosaukumziņas @lv

is source consulted of
status: Published
lexical alias: sourceConsultedOf.en
definition: Relates a manifestation to a work that is a metadata work for which a manifestation provides evidence.
toolkit label: source consulted of
toolkit definition: A work that is a metadata work for which a manifestation provides evidence.
type: Property
domain: C10007
sub property of: has related work of manifestation
has element type: 2
label: käytetty lähde metatietoteoksessa @fi
definition: Liittää manifestaation metatietoteokseen, jonka todisteena manifestaatio on. @fi
toolkit label: käytetty lähde metatietoteoksessa @fi
toolkit definition: Metatietoteos, jonka todisteena manifestaatio on. @fi
label: er kilde konsultert for @no
definition: Relaterer en manifestasjon til et verk som er et matadataverk som gir dokumentasjon for en manifestasjon. @no
toolkit label: kilde konsultert for @no
toolkit definition: Et verk som er et matadataverk som gir dokumentasjon for en manifestasjon. @no
label: est une source consultée de @fr
definition: Met une manifestation en relation avec une œuvre de métadonnées pour laquelle une manifestation fournit des preuves. @fr
toolkit label: source consultée de @fr
toolkit definition: Œuvre de métadonnées pour laquelle une manifestation fournit des preuves. @fr
label: is bron geraadpleegd van @nl
definition: Relateert een manifestatie aan een werk dat een metadatawerk is voor welke een manifestatie bewijs verschaft. @nl
toolkit label: bron geraadpleegd van @nl
toolkit definition: Een werk dat een metadatawerk is voor welke een manifestatie bewijs verschaft. @nl
label: هو مصدر استشارة لـ @ar
definition: يربط بين تجسيدة وعمل هو عبارة عن عمل ميتاداتا حيث تعطي التجسيدة حجة أو برهانًا له. @ar
toolkit label: مصدر استشارة لـ @ar
toolkit definition: عمل هو عبارة عن عمل ميتاداتا حيث تعطي التجسيدة حجة أو برهانًا له. @ar
label: és font consultada de @ca
definition: Relaciona una manifestació amb una obra que és una obra de metadades per a la qual una manifestació proporciona evidència. @ca
toolkit label: font consultada de @ca
toolkit definition: Obra que és una obra de metadades per a la qual una manifestació proporciona evidència. @ca
label: er konsulteret kilde af @da
definition: Relaterer en manifestation til et værk, som er et metadataværk, som en manifestation giver evidens for. @da
toolkit label: konsulteret kilde af @da
toolkit definition: Værk, som er et metadataværk, som en manifestation giver evidens for @da
label: kasutatud allikas metaandmeteosele @et
definition: Seostab kehastuse metaandmeteosega, mida kehastus varustab faktidega. @et
toolkit label: kasutatud allikas metaandmeteosele @et
toolkit definition: Metaandmeteos, mida kehastus varustab faktidega. @et
label: ist konsultierte Quelle von @de
definition: Setzt eine Manifestation in Beziehung zu einem Metadatenwerk, für das eine Manifestation den Nachweis erbringt. @de
toolkit label: Konsultierte Quelle von @de
toolkit definition: Ein Metadatenwerk, für das eine Manifestation den Nachweis erbringt. @de
label: felhasznált forrása a következőnek: @hu
definition: Hozzákapcsol egy megjelenési formát egy olyan metaadatműhöz, amelyhez egy megjelenési forma bizonyítékot szolgáltat. @hu
toolkit label: felhasznált forrása: @hu
toolkit definition: Egy olyan metaadatmű, amelyhez egy megjelenési forma bizonyítékot szolgáltat. @hu
label: è fonte consultata di @it
definition: Correla una manifestazione a un’opera che è un’opera di metadati per la quale una manifestazione fornisce prova. @it
toolkit label: fonte consultata di @it
toolkit definition: Opera di metadati per la quale una manifestazione fornisce prova. @it
label: ir vēres avots @lv
definition: Sasaista manifestāciju ar darbu, kas ir metadati, kuru izveidei manifestācijā ir atrodama informācija. @lv
toolkit label: ir vēres avots @lv
toolkit definition: Darbs, kas ir metadati, kuru izveidei manifestācijā ir atrodama informācija. @lv
label: 是……的查证信息源 @zh-hans
definition: 将一种载体表现与作为一种元数据作品被一种载体表现提供证据的一种作品关联起来。 @zh-hans
toolkit label: ……的查证信息源 @zh-hans
toolkit definition: 作为一种元数据作品被一种载体表现提供证据的一种作品 @zh-hans
label: başvuru kaynağıdır @tr
definition: Bir gösterimi, bir gösterimin kanıt sağladığı bir üst veri çalışması olan eserle ilişkilendirir. @tr
toolkit label: danışılan kaynak @tr
toolkit definition: Bir gösterimin kanıt sağladığı bir üstveri çalışması olan bir eser. @tr
label: es fuente consultada de @es
definition: Relaciona una manifestación con una obra que es una obra de metadatos para la cual una manifestación proporciona evidencia. @es
toolkit label: fuente consultada de @es
toolkit definition: Una obra que es una obra de metadatos para la cual una manifestación proporciona evidencia. @es
has subproperty: P30334

has special playback characteristic
status: Published
definition: Relates a manifestation to an equalization system, noise-reduction system, or other processing that is used in making an audio recording.
type: Property
domain: C10007
sub property of: has sound characteristic
lexical alias: specialPlaybackCharacteristic.en
instruction number: 3.16.9
toolkit label: special playback characteristic
toolkit definition: An equalization system, noise-reduction system, or other processing that is used in making an audio recording.
label: a pour caractéristique de lecture particulière @fr
definition: Met une manifestation en relation avec un système d’égalisation, un système de réduction du bruit ou un autre traitement qui est utilisé lors de la réalisation d’un enregistrement audio. @fr
toolkit label: caractéristique de lecture particulière @fr
toolkit definition: Système d’égalisation, système de réduction du bruit ou autre traitement qui est utilisé lors de la réalisation d’un enregistrement audio. @fr
toolkit label: característica de reproducción especial @es
toolkit definition: Un sistema de ecualización, sistema de reducción de ruido u otro procesamiento que se utiliza para realizar una grabación de audio. @es
label: har specifika uppspelningskaraktäristika @sv
toolkit label: specifika uppspelningskaraktäristika @sv
toolkit label: speciale afspeelkenmerken @nl
toolkit definition: Een equalisatiesysteem, ruisonderdrukkend systeem of ander systeem dat is gebruikt bij het maken van een geluidsopname. @nl
label: có đặc trưng phát lại đặc biệt @vi
definition: Liên kết biểu thị với hệ thống ngang bằng, hệ thống giảm tiếng ồn, v.v..., được sử dụng để tạo bản ghi audio. @vi
toolkit label: đặc trưng phát lại đặc biệt @vi
toolkit definition: Hệ thống ngang bằng, hệ thống giảm tiếng ồn, v.v..., được sử dụng để tạo bản ghi audio. @vi
label: har særlige afspilningskarakteristika @da
definition: Relaterer en manifestation til et equalizersystem, støjbegrænsningssystem etc., som anvendes til at lave en lydoptagelse. @da
toolkit label: særlige afspilningskarakteristika @da
toolkit definition: Equalizersystem, støjbegrænsningssystem etc., som anvendes til at lave en lydoptagelse. @da
label: hat besondere Wiedergabeeigenschaft @de
definition: Setzt eine Manifestation in Beziehung zu einem Ausgleichssystem, einem Störgeräusch-Reduktionssystem oder einer anderen Verarbeitung, das/die bei der Erstellung von Audioaufnahmen verwendet wird. @de
toolkit label: Besondere Wiedergabeeigenschaft @de
toolkit definition: Ein Ausgleichssystem, ein Störgeräusch-Reduktionssystem oder eine anderen Verarbeitung, das/die bei der Erstellung von Audioaufnahmen verwendet wird. @de
label: té com a característica especial de reproducció @ca
definition: Relaciona una manifestació amb un sistema d’equalització, de reducció de soroll o d’un altre processament que s’utilitza en fer un enregistrament àudio. @ca
toolkit label: característica especial de reproducció @ca
toolkit definition: Sistema d’equalització, de reducció de soroll o d’un altre processament que s’utilitza en fer un enregistrament àudio. @ca
definition: Liittää manifestaation äänitteen äänityksessä käytettyyn taajuuskorjausjärjestelmään, kohinanvaimennusjärjestelmään tai muuhun prosessointiin. @fi
toolkit label: äänentoiston erityisominaisuudet @fi
toolkit definition: Äänitteen äänityksessä käytetty taajuuskorjausjärjestelmä, kohinanvaimennusjärjestelmä tai muu prosessointi. @fi
toolkit label: spesiell avspillingsegenskap @no
toolkit definition: Et system for tonekontroll, støyreduksjon etc. som brukes ved produksjon av lydopptak. @no
label: έχει ειδικό χαρακτηριστικό της αναπαραγωγής @el
definition: Συνδέει μια εκδήλωση με ένα σύστημα εξισορρόπησης, ένα σύστημα μείωσης του θορύβου κ.λπ. που χρησιμοποιείται στην κατασκευή μιας ηχογράφησης. @el
toolkit label: ειδικό χαρακτηριστικό αναπαραγωγής @el
toolkit definition: Ένα σύστημα εξισορρόπησης, ένα σύστημα μείωσης του θορύβου κ.λπ. που χρησιμοποιείται στην κατασκευή μιας ηχογράφησης. @el
label: speciális visszajátszási jellemzője a következő: @hu
definition: Hozzákapcsol egy megjelenési formát egy kiegyenlítési rendszerhez, hangcsökkentő rendszerhez vagy egyéb eljáráshoz, amelyet egy hangfelvétel készítésénél használnak. @hu
toolkit label: speciális visszajátszási jellemzője: @hu
toolkit definition: Egy kiegyenlítési rendszer, hangcsökkentő rendszer vagy egyéb eljárás, amelyet egy hangfelvétel készítésénél használnak. @hu
label: äänentoiston erityisominaisuudet @fi
label: har spesiell avspillingsegenskap @no
definition: Relaterer en manifestasjon til et system for tonekontroll, støyreduksjon etc. som brukes ved produksjon av lydopptak. @no
label: heeft speciale afspeelkenmerken @nl
definition: Relateert een manifestatie aan een equalisatiesysteem, ruisonderdrukkend systeem of ander systeem dat is gebruikt bij het maken van een geluidsopname. @nl
label: له خاصية خاصة للتشغيل @ar
definition: يربط بين تجسيدة ونظام صوت، ونظام خفض ضوضاء، إلخ. مستخدم في إعداد تسجيل صوتي. @ar
toolkit label: خاصية خاصة للتشغيل @ar
toolkit definition: نظام صوت، ونظام خفض ضوضاء، إلخ. مستخدم في إعداد تسجيل صوتي. @ar
label: heli taasesituse eritunnus @et
definition: Seostab kehastuse heli salvestamisel kasutatud tasandussüsteemiga, müravähendussüsteemiga vms. @et
toolkit label: heli taasesituse eritunnus @et
toolkit definition: Heli salvestamisel kasutatud tasandussüsteem, müravähendussüsteem vms. @et
label: ha come caratteristica di riproduzione speciale @it
definition: Correla una manifestazione a un sistema di equalizzazione, sistema di riduzione del rumore, etc. utilizzato nella realizzazione di una registrazione. @it
toolkit label: caratteristica di riproduzione speciale @it
toolkit definition: Sistema di equalizzazione, sistema di riduzione del rumore, etc. utilizzato nella realizzazione di una registrazione. @it
label: specifiska atskaņojuma pazīme @lv
definition: Sasaista manifestāciju ar skaņu izlīdzināšanas sistēmu, trokšņu samazināšanas sistēmu, u.tml., kas izmantota skaņas ieraksta veidošanā. @lv
toolkit label: specifiska atskaņojuma pazīme @lv
toolkit definition: Skaņu izlīdzināšanas sistēma, trokšņu samazināšanas sistēma, u.tml., kas izmantota skaņas ieraksta veidošanā. @lv
has element type: 4
label: 有特别回放特征 @zh-hans
definition: 将一种载体表现与在一种录音制作中所使用的平衡系统、降噪系统或其他处理关联起来。 @zh-hans
toolkit label: 特别回放特征 @zh-hans
toolkit definition: 在一种录音制作中所使用的平衡系统、降噪系统或其他处理 @zh-hans
label: özel oynatma özelliği ile ilişkilidir @tr
definition: Bir gösterimi, bir ses kaydı yapmak için kullanılan bir eşitleme sistemi, gürültü azaltma sistemi veya diğer işlemlerle ilişkilendirir. @tr
toolkit label: özel oynatma özelliği @tr
toolkit definition: Bir ses kaydı yapmak için kullanılan bir eşitleme sistemi, gürültü azaltma sistemi veya diğer işlemler. @tr
label: tiene una característica de reproducción especial @es

has details of special playback characteristic
status: Published
type: Property
lexical alias: detailsOfSpecialPlaybackCharacteristic.en
definition: Relates a manifestation to details of an equalization system, noise-reduction system, or other processing that is used in making an audio recording.
domain: C10007
instruction number: 3.16.9.4
toolkit label: details of special playback characteristic
toolkit definition: Details of an equalization system, noise-reduction system, or other processing that is used in making an audio recording.
toolkit label: detalles de características especiales de reproducción @es
toolkit definition: Detalles de un sistema de ecualización, sistema de reducción de ruido u otro procesamiento que se utiliza para realizar una grabación de audio. @es
sub property of: has details of sound characteristic
label: har detaljerad information om specifika uppspelningskaraktäristika @sv
toolkit label: detaljerad information om specifika uppspelningskaraktäristika @sv
toolkit label: details van bijzondere afspeelkenmerken @nl
toolkit definition: Details van equalisatiesysteem, ruisonderdrukkend systeem of ander systeem dat gebruikt wordt bij het maken van een geluidsopname. @nl
label: có chi tiết của đặc trưng phát lại @vi
definition: Liên kết biểu thị với chi tiết của hệ thống ngang bằng, hệ thống giảm tiếng ồn, v.v..., được sử dụng để tạo bản ghi audio. @vi
toolkit label: chi tiết của đặc trưng phát lại @vi
toolkit definition: Chi tiết của hệ thống ngang bằng, hệ thống giảm tiếng ồn, v.v..., được sử dụng để tạo bản ghi audio. @vi
label: har detaljer om særlige afspilningskarakteristika @da
definition: Relaterer en manifestation til detaljer om et equalizersystem, støjdæmpningssystem etc., som anvendes til at lave en lydoptagelse. @da
toolkit label: detaljer om særlige afspilningskarakteristika @da
toolkit definition: Detaljer om et equalizersystem, støjdæmpningssystem etc., som anvendes til at lave en lydoptagelse. @da
label: hat Details zu einer besonderen Wiedergabeeigenschaft @de
definition: Setzt eine Manifestation in Beziehung zu den Details zu einem Ausgleichssystem, einem Störgeräusch-Reduktionssystem oder einer anderen Verarbeitung, das/die zur Erstellung von Audioaufnahmen verwendet wird. @de
toolkit label: Details zu einer besonderen Wiedergabeeigenschaft @de
toolkit definition: Details zu einem Ausgleichssystem, einem Störgeräusch-Reduktionssystem oder einer anderen Verarbeitung, das/die zur Erstellung von Audioaufnahmen verwendet wird. @de
label: té com a particularitats de característiques especials de reproducció @ca
definition: Relaciona una manifestació amb les particularitats d’un sistema d’equalització, de reducció de soroll o un altre processament que s’usa en fer un enregistrament àudio. @ca
toolkit label: particularitats de característiques especials de reproducció @ca
toolkit definition: Particularitats d’un sistema d’equalització, de reducció de soroll o un altre processament que s’usa en fer un enregistrament àudio. @ca
definition: Liittää manifestaation tarkempiin tietoihin äänitteen äänityksessä käytetystä taajuuskorjausjärjestelmästä, kohinanvaimennusjärjestelmästä tai muusta prosessoinnista. @fi
toolkit label: äänentoiston erityisominaisuuksien tarkemmat tiedot @fi
toolkit definition: Tarkemmat tiedot äänitteen äänityksessä käytetystä taajuuskorjausjärjestelmästä, kohinanvaimennusjärjestelmästä tai muusta prosessoinnista. @fi
toolkit label: detaljer vedrørende spesielle avspillingsegenskaper @no
toolkit definition: Detaljer vedrørende systemer for tonekontroll, støyreduksjon etc. som er brukt ved produksjon av lydopptak. @no
label: έχει λεπτομέρειες του ειδικού χαρακτηριστικού της αναπαραγωγής @el
definition: Συνδέει μια εκδήλωση με τις λεπτομέρειες ενός συστήματος εξισορρόπησης, ενός συστήματος μείωσης του θορύβου κ.λπ. που χρησιμοποιείται στην κατασκευή μιας ηχογράφησης. @el
toolkit label: λεπτομέρειες του ειδικού χαρακτηριστικού αναπαραγωγής @el
toolkit definition: Λεπτομέρειες ενός συστήματος εξισορρόπησης, συστήματος μείωσης του θορύβου κ.λπ. που χρησιμοποιείται στην κατασκευή μιας ηχογράφησης. @el
label: a pour particularités d’une caractéristique de lecture particulière @fr
definition: Met une manifestation en relation avec des particularités d’un système d’égalisation, d’un système de réduction du bruit ou d’un autre traitement utilisé lors de la réalisation d’un enregistrement audio. @fr
toolkit label: particularités d’une caractéristique de lecture particulière @fr
toolkit definition: Particularités d’un système d’égalisation, d’un système de réduction du bruit ou d’un autre traitement utilisé lors de la réalisation d’un enregistrement audio. @fr
has element type: 6
label: speciális visszajátszási jellemzők részletei a következők: @hu
definition: Hozzákapcsol egy megjelenési formát egy kiegyenlítési rendszer, hangcsökkentő rendszer, vagy egyéb eljárás részleteihez, amelyeket egy hangfelvétel készítésénél használnak. @hu
toolkit label: speciális visszajátszási jellemzők részletei: @hu
toolkit definition: Egy kiegyenlítési rendszer, hangcsökkentő rendszer, vagy egyéb eljárás részletei, amelyeket egy hangfelvétel készítésénél használnak. @hu
label: äänentoiston erityisominaisuuksien tarkemmat tiedot @fi
label: har detaljer vedrørende spesielle avspillingsegenskaper @no
definition: Relaterer en manifestasjon til detaljer vedrørende systemer for tonekontroll, støyreduksjon etc. som er brukt ved produksjon av lydopptak. @no
label: heeft details van bijzondere afspeelkenmerken @nl
definition: Relateert een manifestatie aan details van equalisatiesysteem, ruisonderdrukkend systeem of ander systeem dat gebruikt wordt bij het maken van een geluidsopname. @nl
label: له تفاصيل عن خاصية خاصة للتشغيل @ar
definition: يربط بين تجسيدة وتفاصيل نظام صوت، ونظام خفض ضوضاء، إلخ. مستخدم في إعداد تسجيل صوتي. @ar
toolkit label: تفاصيل عن خاصية خاصة للتشغيل @ar
toolkit definition: تفاصيل نظام صوت، ونظام خفض ضوضاء، إلخ. مستخدم في إعداد تسجيل صوتي. @ar
label: heli taasesituse eritunnuse täpsustus @et
definition: Seostab kehastuse täpsemate andmetega heli salvestamisel kasutatud tasandussüsteemi, müravähendussüsteemi vms kohta. @et
toolkit label: heli taasesituse eritunnuse täpsustus @et
toolkit definition: Täpsemad andmed heli salvestamisel kasutatud tasandussüsteemi, müravähendussüsteemi vms kohta. @et
label: ha come particolari relativi alla caratteristica di riproduzione speciale @it
definition: Correla una manifestazione ai particolari relativi a un sistema di equalizzazione, sistema di riduzione del rumore, etc. utilizzato nella realizzazione di una registrazione audio. @it
toolkit label: particolari relativi alla caratteristica di riproduzione speciale @it
toolkit definition: Particolari relativi a un sistema di equalizzazione, sistema di riduzione del rumore, etc. utilizzato nella realizzazione di una registrazione audio. @it
label: detalizēti par specifisku atskaņojuma pazīmi @lv
definition: Sasaista manifestāciju ar sīkāku informāciju par skaņu izlīdzināšanas sistēmu, trokšņu samazināšanas sistēmu, u.tml., kas izmantota skaņas ieraksta veidošanā. @lv
toolkit label: detalizēti par specifisku atskaņojuma pazīmi @lv
toolkit definition: Sīkāka informācija par skaņu izlīdzināšanas sistēmu, trokšņu samazināšanas sistēmu, u.tml., kas izmantota skaņas ieraksta veidošanā. @lv
label: 有特别回放特征的细节 @zh-hans
definition: 将一种载体表现与在一种录音制作中所使用的平衡系统、降噪系统或其他处理的细节关联起来。 @zh-hans
toolkit label: 特别回放特征的细节 @zh-hans
toolkit definition: 在一种录音制作中所使用的平衡系统、降噪系统或其他处理的细节 @zh-hans
label: özel oynatma özelliğinin ayrıntıları ile ilişkilidir @tr
definition: Bir gösterimdeki, bir ses kaydının yapılmasında kullanılan bir eşitleme sisteminin, gürültü azaltma sisteminin veya diğer işlemlerin ayrıntılarıyla ilişkilendirir. @tr
toolkit label: özel oynatma özelliğinin ayrıntıları @tr
toolkit definition: Bir ses kaydı yapılırken kullanılan bir eşitleme sisteminin, gürültü azaltma sisteminin veya diğer işlemlerin ayrıntıları. @tr
label: tiene detalles de características especiales de reproducción @es

has statement of responsibility relating to named revision of edition
status: Published
definition: Relates a manifestation to a statement of responsibility that is associated with a named revision of an edition.
type: Property
domain: C10007
lexical alias: statementOfResponsibilityRelatingToNamedRevisionOfEdition.en
instruction number: 2.5.8
toolkit label: statement of responsibility relating to named revision of edition
toolkit definition: A statement of responsibility that is associated with a named revision of an edition.
label: a pour mention de responsabilité relative à une révision nommée d’une édition @fr
definition: Met une manifestation en relation avec une mention de responsabilité qui est associée à une révision nommée d’une édition. @fr
toolkit label: mention de responsabilité relative à une révision nommée d’une édition @fr
toolkit definition: Mention de responsabilité qui est associée à une révision nommée d’une édition. @fr
toolkit label: declaración de responsabilidad relacionada con la revisión nombrada de la edición @es
toolkit definition: Una declaración de responsabilidad que está asociada con una revisión nombrada de una edición. @es
label: har upphovsuppgift som hänför sig till påföljande upplageuppgift @sv
toolkit label: upphovsuppgift som hänför sig till påföljande upplageuppgift @sv
toolkit label: verantwoordelijkheidsvermelding gerelateerd aan benoemde herziening van editie @nl
toolkit definition: Een verantwoordelijkheidsvermelding die geassocieerd is met een benoemde herziening van een editie. @nl
label: có thông tin trách nhiệm liên quan tới sửa chữa được định rõ của ấn bản @vi
definition: Liên kết biểu thị với thông tin liên quan tới nhận dạng các tác nhân có trách nhiệm đối với sửa chữa được định rõ của ấn bản. @vi
toolkit label: thông tin trách nhiệm liên quan tới sửa chữa được định rõ của ấn bản @vi
toolkit definition: Thông tin liên quan tới nhận dạng các tác nhân có trách nhiệm đối với sửa chữa được định rõ của ấn bản. @vi
label: har ophavsangivelse, som relaterer til en navngivet revision af udgave @da
definition: Relaterer en manifestation til en ophavsangivelse, som er knyttet til en navngivet revision af en udgave. @da
toolkit label: ophavsangivelse, som relaterer til en navngivet revision af en udgave @da
toolkit definition: Ophavsangivelse, som er knyttet til en navngivet revision af en udgave. @da
label: hat Verantwortlichkeitsangabe, die sich auf eine näher erläuterte Überarbeitung einer Ausgabe bezieht @de
definition: Setzt eine Manifestation in Beziehung zu einer Verantwortlichkeitsangabe, die mit einer näher erläuterten Überarbeitung einer Ausgabe in Verbindung steht. @de
toolkit label: Verantwortlichkeitsangabe, die sich auf eine näher erläuterte Überarbeitung einer Ausgabe bezieht @de
toolkit definition: Eine Verantwortlichkeitsangabe, die mit einer näher erläuterten Überarbeitung einer Ausgabe in Verbindung steht. @de
label: té com a menció de responsabilitat relativa a una revisió explícita d’edició @ca
definition: Relaciona una manifestació amb una menció de responsabilitat que s’associa amb una revisió explícita d’una edició. @ca
toolkit label: menció de responsabilitat relativa a una revisió explícita d’edició @ca
toolkit definition: Menció de responsabilitat que s’associa amb una revisió explícita d’una edició. @ca
definition: Liittää manifestaation vastuullisuusmerkintöön, joka liittyy nimettyyn uudistettuun painokseen. @fi
toolkit label: nimettyyn uudistettuun painokseen liittyvä vastuullisuusmerkintö @fi
toolkit definition: Vastuullisuusmerkintö, joka liittyy nimettyyn uudistettuun painokseen. @fi
toolkit label: ansvarsangivelse knyttet til en bestemt revisjon av utgave @no
toolkit definition: En ansvarsangivelse knyttet til en bestemt revisjon av en utgave. @no
label: έχει μνεία ευθύνης σχετική με την κατονομαζόμενη αναθεώρηση της έκδοσης @el
definition: Συνδέει μια εκδήλωση με μια μνεία που σχετίζεται με την ταύτιση των φορέων που είναι υπεύθυνοι για μια κατονομαζόμενη αναθεώρηση μιας έκδοσης. @el
toolkit label: μνεία ευθύνης σχετική με την κατονομαζόμενη αναθεώρηση της έκδοσης @el
toolkit definition: Μια μνεία που σχετίζεται με την ταύτιση των φορέων που είναι υπεύθυνοι για μια κατονομαζόμενη αναθεώρηση μιας έκδοσης. @el
has element type: 6
label: kiadás nevesített átdolgozásához kötődő felelősségi közlése a következő: @hu
definition: Egy megjelenési formát hozzákapcsol egy felelősségi közléshez, amely egy kiadás nevesített átdolgozásához társul. @hu
toolkit label: kiadás nevesített átdolgozásához kötődő felelősségi közlése: @hu
toolkit definition: Egy felelősségi közlés, amely egy kiadás nevesített átdolgozásához társul. @hu
sub property of: has statement of responsibility
label: nimettyyn uudistettuun painokseen liittyvä vastuullisuusmerkintö @fi
label: har ansvarsangivelse knyttet til en bestemt revisjon av utgave @no
definition: Relaterer en manifestasjon til en ansvarsangivelse knyttet til en bestemt revisjon av en utgave. @no
label: heeft verantwoordelijkheidsvermelding gerelateerd aan benoemde herziening van editie @nl
definition: Relateert een manifestatie aan een verantwoordelijkheidsvermelding die geassocieerd is met een benoemde herziening van een editie. @nl
label: له بيان مسئولية مرتبط بمراجعة مسماه لطبعة @ar
definition: يربط تجسيدة وبيان مسئولية يرتبط بمراجعة من طبعه مسماه. @ar
toolkit label: بيان مسئولية مرتبط بمراجعة مسماه لطبعة @ar
toolkit definition: بيان مسئولية يرتبط بمراجعة من طبعه مسماه. @ar
label: editsiooni nimelise uusversiooniga seotud vastutusandmed @et
definition: Seostab kehastuse vastutusandmetega, mis on seotud editsiooni nimelise uusversiooniga. @et
toolkit label: editsiooni nimelise uusversiooniga seotud vastutusandmed @et
toolkit definition: Vastutusandme, mis on seotud editsiooni nimelise uusversiooniga. @et
label: ha come formulazione di responsabilità relativa a una revisione identificata di un’edizione @it
definition: Correla una manifestazione a una formulazione di responsabilità associata a una revisione identificata di un’edizione. @it
alternative label: formulazione di responsabilità relativa alla sottoserie @it
toolkit label: formulazione di responsabilità relativa a una revisione identificata di un’edizione @it
toolkit definition: Formulazione di responsabilità associata a una revisione identificata di un’edizione. @it
label: pārstrādātā izdevuma atbildības ziņas @lv
definition: Sasaista manifestāciju ar atbildības ziņām, kas attiecas uz pārstrādātā izdevuma atbildīgo identificēšanu. @lv
toolkit label: pārstrādātā izdevuma atbildības ziņas @lv
toolkit definition: Atbildības ziņas, kas attiecas uz pārstrādātā izdevuma atbildīgo identificēšanu. @lv
label: 有和版本的命名修订有关的责任说明 @zh-hans
definition: 将一种载体表现与和版本的命名修订有关的一个责任说明关联起来。 @zh-hans
toolkit label: 和版本的命名修订有关的责任说明 @zh-hans
toolkit definition: 和版本的命名修订有关的一个责任说明 @zh-hans
label: basımın adlandırılmış revizyonunun sorumluluk bildirimi ile ilişkilidir @tr
definition: Bir gösterimi, bir basımın adlandırılmış bir revizyonu ile ilişkili bir sorumluluk bildirimi ile ilişkilendirir. @tr
toolkit label: basımın adlandırılmış gözden geçirimine ilişkin sorumluluk bildirimi @tr
toolkit definition: Bir basımın adlandırılmış bir revizyonu ile bağlantılı olan bir sorumluluk bildirimi. @tr

has broadcast standard
status: Published
definition: Relates a manifestation to a system used to format a manifestation of a video for television broadcast.
type: Property
domain: C10007
sub property of: has video characteristic
lexical alias: broadcastStandard.en
instruction number: 3.18.3
toolkit label: broadcast standard
toolkit definition: A system used to format a manifestation of a video for television broadcast.
label: a pour norme de diffusion @fr
definition: Met une manifestation en relation avec un système utilisé pour formater une manifestation d’une vidéo pour la télédiffusion. @fr
toolkit label: norme de diffusion @fr
toolkit definition: Système utilisé pour formater une manifestation d’une vidéo pour la télédiffusion. @fr
toolkit label: estándar de transmisión @es
toolkit definition: Un sistema utilizado para formatear una manifestación de un video para transmisión televisiva. @es
label: har sändningsstandard @sv
toolkit label: sändningsstandard @sv
toolkit label: uitzendstandaard @nl
toolkit definition: Een systeem gebruikt voor het formatteren van een video resource voor televisie-uitzending. @nl
label: có chuẩn phát sóng @vi
definition: Liên kết biểu thị với hệ thống được sử dụng để định dạng biểu thị của video cho phát sòng truyền hình. @vi
toolkit label: chuẩn phát sóng @vi
toolkit definition: Hệ thống được sử dụng để định dạng biểu thị của video cho phát sòng truyền hình. @vi
label: har transmissionsstandard @da
definition: Relaterer en manifestation til et system, som anvendes til at formatere en videomanifestation til tv-transmission. @da
toolkit label: transmissionsstandard @da
toolkit definition: System, som anvendes til at formatere en videomanifestation til tv-transmission. @da
label: hat Sendestandard @de
definition: Setzt eine Manifestation in Beziehung zu einem System, das zur Formatierung einer Manifestation eines Videos für eine Fernsehsendung verwendet wird. @de
toolkit label: Sendestandard @de
toolkit definition: Ein System, das zur Formatierung einer Manifestation eines Videos für eine Fernsehsendung verwendet wird. @de
label: té com a estàndard d’emissió @ca
definition: Relaciona una manifestació amb un sistema usat per formatar una manifestació d’un vídeo per a l’emissió per televisió. @ca
toolkit label: estàndard d’emissió @ca
toolkit definition: Sistema usat per formatar una manifestació d’un vídeo per a l’emissió per televisió. @ca
definition: Liittää manifestaation järjestelmään, jonka mukaan videoaineiston manifestaatio muunnetaan televisiolähetystä varten. @fi
toolkit label: lähetysstandardi @fi
toolkit definition: Järjestelmä, jonka mukaan videoaineiston manifestaatio muunnetaan televisiolähetystä varten. @fi
toolkit label: kringkastingsstandard @no
toolkit definition: Et system for å formatere en videomanifestasjon for fjernsynskringkasting. @no
label: έχει πρότυπο εκπομπής @el
definition: Συνδέει μια εκδήλωση με ένα σύστημα που χρησιμοποιείται για τη διαμόρφωση μιας εκδήλωσης ενός βίντεο για τηλεοπτική εκπομπή. @el
toolkit label: πρότυπο εκπομπής @el
toolkit definition: Ένα σύστημα που χρησιμοποιείται για τη διαμόρφωση μιας εκδήλωσης ενός βίντεο για τηλεοπτική εκπομπή. @el
has element type: 4
label: műsorszórási szabványa a következő: @hu
definition: Hozzákapcsol egy megjelenési formát egy rendszerhez, amelyet egy televíziós közvetítésre szánt videó megjelenési formájának a formátumaként használnak. @hu
toolkit label: műsorszórási szabványa: @hu
toolkit definition: Egy rendszer, amelyet egy televíziós közvetítésre szánt videó megjelenési formájának a formátumaként használnak. @hu
label: lähetysstandardi @fi
label: har kringkastingsstandard @no
definition: Relaterer en manifestasjon til et system for å formatere en videomanifestasjon for fjernsynskringkasting. @no
label: heeft uitzendstandaard @nl
definition: Relateert een manifestatie aan een systeem gebruikt voor het formatteren van een video resource voor televisie-uitzending. @nl
label: له معيار بث @ar
definition: يربط بين تجسيدة ونظام مستخدم لتهيئة تجسيدة من فيديو للبث التلفزيوني. @ar
toolkit label: معيار بث @ar
toolkit definition: نظام مستخدم لتهيئة تجسيدة من فيديو للبث التلفزيوني. @ar
label: leviedastusstandard @et
definition: Seostab kehastuse standardiga, mida on kasutatud videoressursi kehastuse muundamiseks teleülekande jaoks sobivasse formaati. @et
toolkit label: leviedastusstandard @et
toolkit definition: Standard, mida on kasutatud videoressursi kehastuse muundamiseks teleülekande jaoks sobivasse formaati. @et
label: ha come standard di trasmissione @it
definition: Correla una manifestazione a un sistema utilizzato per la formattazione di una risorsa video per la trasmissione televisiva. @it
toolkit label: standard di trasmissione @it
toolkit definition: Sistema utilizzato per la formattazione di una risorsa video per la trasmissione televisiva. @it
label: apraides standarts @lv
definition: Sasaista manifestāciju ar sistēmu, ko lieto, lai pārveidotu video manifestāciju televīzijas pārraides vajadzībām. @lv
toolkit label: apraides standarts @lv
toolkit definition: Sistēma, ko lieto, lai pārveidotu video manifestāciju televīzijas pārraides vajadzībām. @lv
label: 有广播标准 @zh-hans
definition: 将一种载体表现与用于电视广播的视频的一种载体表现的格式的一个体系关联起来。 @zh-hans
toolkit label: 广播标准 @zh-hans
toolkit definition: 用于电视广播的视频的一种载体表现的格式的一个体系 @zh-hans
label: yayın standardı ile ilişkilidir @tr
definition: Bir gösterimi, televizyon yayını için bir videonun bir gösterimini formatlamak için kullanılan bir sistemle ilişkilendirir. @tr
toolkit label: yayın standardı @tr
toolkit definition: Bir video gösteriminin televizyon yayınına uygun biçimde biçimlendirilmesinde kullanılan sistem. @tr
label: tiene estándar de transmisión @es

has details of broadcast standard
status: Published
type: Property
lexical alias: detailsOfBroadcastStandard.en
definition: Relates a manifestation to details of a system that is used to format a manifestation of a video for television broadcast.
domain: C10007
instruction number: 3.18.3.4
toolkit label: details of broadcast standard
toolkit definition: Details of a system that is used to format a manifestation of a video for television broadcast.
toolkit label: detalles del estándar de transmisión @es
toolkit definition: Detalles de un sistema que se utiliza para formatear una manifestación de un video para transmisión televisiva. @es
sub property of: has details of video characteristic
label: har detaljerad information om sändningsstandard @sv
toolkit label: detaljerad information om sändningsstandard @sv
toolkit label: details van uitzendstandaard @nl
toolkit definition: Details van een systeem dat gebruikt wordt om een video resource geschikt te maken voor een televisie-uitzending. @nl
label: có chi tiết của chuẩn phát sóng @vi
definition: Liên kết biểu thị với chi tiết của hệ thống được sử dụng để dịnh dạng biểu thị của video cho phát sóng truyền hình. @vi
toolkit label: chi tiết của chuẩn phát sóng @vi
toolkit definition: Chi tiết của hệ thống được sử dụng để dịnh dạng biểu thị của video cho phát sóng truyền hình. @vi
label: har detaljer om transmissionsstandard @da
definition: Relaterer en manifestation til detaljer om et system, som anvendes til at formatere en videomanifestation til tv-transmission. @da
toolkit label: detaljer om transmissionsstandard @da
toolkit definition: Detaljer om et system, som anvendes til at formatere en videomanifestation til tv-transmission. @da
label: hat Details zum Sendestandard @de
definition: Setzt eine Manifestation in Beziehung zu den Details zu einem System, das zur Formatierung einer Manifestation eines Videos für eine Fernsehsendung verwendet wird. @de
toolkit label: Details zum Sendestandard @de
toolkit definition: Details zu einem System, das zur Formatierung einer Manifestation eines Videos für eine Fernsehsendung verwendet wird. @de
label: té com a particularitats d’estàndard d’emissió @ca
definition: Relaciona una manifestació amb les particularitats d’un sistema que s’usa per formatar una manifestació d’un vídeo per a l’emissió per televisió. @ca
toolkit label: particularitats d’estàndard d’emissió @ca
toolkit definition: Particularitats d’un sistema que s’usa per formatar una manifestació d’un vídeo per a l’emissió per televisió. @ca
definition: Liittää manifestaation tarkempiin tietoihin järjestelmästä, jonka mukaan videon manifestaatio muunnetaan televisiolähetystä varten. @fi
toolkit label: lähetysstandardin tarkemmat tiedot @fi
toolkit definition: Tarkemmat tiedot järjestelmästä, jonka mukaan videon manifestaatio muunnetaan televisiolähetystä varten. @fi
toolkit label: detaljer vedrørende kringkastingsstandard @no
toolkit definition: Detaljer vedrørende et system som brukes for å formatere en videomanifestasjon for fjernsynskringkasting. @no
label: έχει λεπτομέρειες του προτύπου εκπομπής @el
definition: Συνδέει μια εκδήλωση με τις λεπτομέρειες ενός συστήματος που χρησιμοποιείται για τη διαμόρφωση μιας εκδήλωσης ενός βίντεο για τηλεοπτική εκπομπή. @el
toolkit label: λεπτομέρειες του προτύπου εκπομπής @el
toolkit definition: Λεπτομέρειες ενός συστήματος που χρησιμοποιείται για τη διαμόρφωση μιας εκδήλωσης ενός βίντεο για τηλεοπτική εκπομπή. @el
label: a pour particularités d’une norme de diffusion @fr
definition: Met une manifestation en relation avec des particularités d’un système qui est utilisé pour formater une manifestation d’une vidéo pour la télédiffusion. @fr
toolkit label: particularités d’une norme de diffusion @fr
toolkit definition: Particularités d’un système qui est utilisé pour formater une manifestation d’une vidéo pour la télédiffusion. @fr
has element type: 6
label: műsorszórási szabvány részletei a következők: @hu
definition: Hozzákapcsol egy megjelenési formát egy videó megjelenési formájának televíziós műsorszórás-formátumához használt rendszer részleteihez. @hu
toolkit label: műsorszórási szabvány részletei: @hu
toolkit definition: Egy videó megjelenési formájának televíziós műsorszórás-formátumához használt rendszer részletei. @hu
label: lähetysstandardin tarkemmat tiedot @fi
label: har detaljer vedrørende kringkastingsstandard @no
definition: Relaterer en manifestasjon til detaljer vedrørende et system som brukes for å formatere en videomanifestasjon for fjernsynskringkasting. @no
label: heeft details van uitzendstandaard @nl
definition: Relateert een manifestatie aan details van een systeem dat gebruikt wordt om een video resource geschikt te maken voor een televisie-uitzending. @nl
label: له تفاصيل معيار بث @ar
definition: يربط بين تجسيدة وتفاصيل نظام الذي يستخدم في تكوين تجسيدة من فيديو للبث التليفزيوني. @ar
toolkit label: تفاصيل معيار بث @ar
toolkit definition: تفاصيل نظام الذي يستخدم في تكوين تجسيدة من فيديو للبث التليفزيوني. @ar
label: leviedastusstandardi täpsustus @et
definition: Seostab kehastuse täpsemate andmetega standardi kohta, mida on kasutatud videoressursi kehastuse muundamiseks teleülekande jaoks sobivasse formaati. @et
toolkit label: leviedastusstandardi täpsustus @et
toolkit definition: Täpsemad andmed standardi kohta, mida on kasutatud videoressursi kehastuse muundamiseks teleülekande jaoks sobivasse formaati. @et
label: ha come particolari relativi allo standard di trasmissione @it
definition: Correla una manifestazione ai particolari relativi a un sistema utilizzato per la formattazione di una risorsa video per la trasmissione televisiva. @it
toolkit label: particolari relativi allo standard di trasmissione @it
toolkit definition: Particolari relativi a un sistema utilizzato per la formattazione di una risorsa video per la trasmissione televisiva. @it
label: detalizēti par apraides standartu @lv
definition: Sasaista manifestāciju ar sīkāku informāciju par sistēmu, kas izmantota, lai pārveidotu video manifestāciju televīzijas pārraides vajadzībām. @lv
toolkit label: detalizēti par apraides standartu @lv
toolkit definition: Sīkāka informācija par sistēmu, kas izmantota, lai pārveidotu video manifestāciju televīzijas pārraides vajadzībām. @lv
label: 有广播标准细节 @zh-hans
definition: 将一种载体表现与用于电视广播的视频的一种载体表现的格式的一个体系的细节关联起来。 @zh-hans
toolkit label: 广播标准细节 @zh-hans
toolkit definition: 用于电视广播的视频的一种载体表现的格式的一个体系的细节 @zh-hans
label: yayın standardının ayrıntıları ile ilişkilidir @tr
definition: Bir gösterimi, bir sistemin ayrıntılarıyla televizyon yayını için bir video gösterimini biçimlendirmek için kullanılır. @tr
toolkit label: yayın standardının detayları @tr
toolkit definition: Televizyon yayını için bir video gösterimini formatlamak için kullanılan bir sistemin ayrıntıları. @tr
label: tiene detalles del estándar de transmisión @es

has surveyor agent
status: Published
lexical alias: surveyorAgent.en
definition: Relates a manifestation to an agent who is a contributor agent of cartography who provides measurements or dimensional relationships for a geographic area.
toolkit label: surveyor agent
toolkit definition: An agent who is a contributor agent of cartography who provides measurements or dimensional relationships for a geographic area.
type: Property
domain: C10007
sub property of: has contributor agent of cartography
instruction number: 18.5
has element type: 2
alternative label: surveyor
label: maanmittari (toimija) @fi
definition: Liittää manifestaation toimijaan, joka kartografiaan osallisena toimijana tuottaa maantieteellisen alueen mitat tai mittasuhteet. @fi
alternative label: maanmittari @fi
toolkit label: maanmittari (toimija) @fi
toolkit definition: Toimija, joka kartografiaan osallisena toimijana tuottaa maantieteellisen alueen mitat tai mittasuhteet. @fi
label: har landmåler (agent) @no
definition: Relaterer en manifestasjon til en agent som er en kartograf til aggregat som tilfører målinger eller størrelsesforhold for et geografisk område. @no
alternative label: landmåler @no
toolkit label: landmåler (agent) @no
toolkit definition: En agent som er en kartograf til aggregat som tilfører målinger eller størrelsesforhold for et geografisk område. @no
label: a pour agent arpenteur @fr
definition: Met une manifestation en relation avec un agent contributeur de cartographie qui fournit des mesures ou des relations dimensionnelles pour une aire géographique. @fr
alternative label: arpenteur @fr
toolkit label: agent arpenteur @fr
toolkit definition: Agent contributeur de cartographie qui fournit des mesures ou des relations dimensionnelles pour une aire géographique. @fr
label: heeft landmeter-actor @nl
definition: Relateert een manifestatie aan een actor die is een bijdrager-actor van cartografie die metingen of dimensionele verhoudingen verschaft voor een geografisch gebied. @nl
toolkit label: landmeter-actor @nl
toolkit definition: Een actor die is een bijdrager-actor van cartografie die metingen of dimensionele verhoudingen verschaft voor een geografisch gebied. @nl
label: له وكيل مساح @ar
definition: يربط بين تجسيدة ووكيل مسئول عن رسم الخرائط في عمل تجميعي يقدم علاقات القياسات أو الأبعاد لمنطقة جغرافية. @ar
alternative label: مساح @ar
toolkit label: وكيل مساح @ar
toolkit definition: وكيل مسئول عن رسم الخرائط في عمل تجميعي يقدم علاقات القياسات أو الأبعاد لمنطقة جغرافية. @ar
label: té com a agent agrimensor @ca
definition: Relaciona una manifestació amb un agent que és un agent contribuïdor de cartografia que proporciona mesuraments o relacions dimensionals d’una àrea geogràfica. @ca
alternative label: agrimensor @ca
toolkit label: agent agrimensor @ca
toolkit definition: Agent que és un agent contribuïdor de cartografia que proporciona mesuraments o relacions dimensionals d’una àrea geogràfica. @ca
label: har agent, som er landinspektør @da
definition: Relaterer en manifestation til en agent, som er kartograf til samling, som angiver målinger eller dimensionelle forhold for et geografisk område. @da
toolkit label: agent, som er landinspektør @da
toolkit definition: Agent, som er kartograf til samling, som angiver målinger eller dimensionelle forhold for et geografisk område. @da
label: maamõõtja (tegija) @et
definition: Seostab kehastuse tegijaga, kes liitumi kartograafina hangib geograafilise piirkonna mõõdud või mõõdusuhted. @et
alternative label: maamõõtja @et
toolkit label: maamõõtja (tegija) @et
toolkit definition: Tegija, kes liitumi kartograafina hangib geograafilise piirkonna mõõdud või mõõdusuhted. @et
label: hat Landvermesserin/Landvermesser (Akteur) @de
definition: Setzt eine Manifestation in Beziehung zu einer Beiträgerin/einem Beiträger einer Kartografie (Akteur), die/der Messwerte oder Abmessungsverhältnisse für den dargestellten geografischen Bereich zur Verfügung stellt. @de
toolkit label: Landvermesserin/Landvermesser (Akteur) @de
toolkit definition: Eine Beiträgerin/Ein Beiträger einer Kartografie (Akteur), die/der Messwerte oder Abmessungsverhältnisse für den dargestellten geografischen Bereich zur Verfügung stellt. @de
label: földmérő ágense a következő: @hu
definition: Hozzákapcsol egy megjelenési formát egy térképészeti közreműködő ágenshez, amely egy földrajzi területről méréseket vagy dimenziós összefüggéseket szolgáltat. @hu
alternative label: földmérője: @hu
toolkit label: földmérő ágens @hu
toolkit definition: Egy térképészeti közreműködő ágens, amely egy földrajzi területről méréseket vagy dimenziós összefüggéseket szolgáltat. @hu
label: topogrāfs (aģents) @lv
definition: Sasaista manifestāciju ar aģentu, kas ir apkopojuma kartogrāfs un nodrošina ģeogrāfiskā apgabala mērījumus vai dimensiju attiecības. @lv
toolkit label: topogrāfs (aģents) @lv
toolkit definition: Aģents, kas ir apkopojuma kartogrāfs un nodrošina ģeogrāfiskā apgabala mērījumus vai dimensiju attiecības. @lv
alternative label: Landvermesser @de
alternative label: 测绘者 @zh-hans
label: 有测绘者行为者 @zh-hans
definition: 将一种载体表现与作为地图绘制的贡献者行为者并为一个地理区域提供测量或尺寸关系的一个行为者关联起来。 @zh-hans
toolkit label: 测绘者行为者 @zh-hans
toolkit definition: 作为地图绘制的贡献者行为者并为一个地理区域提供测量或尺寸关系的一个行为者 @zh-hans
alternative label: topograf @tr
label: topograf temsilcisi ile ilişkilidir @tr
definition: Bir gösterimi, coğrafi bir alan için ölçümler veya boyutsal ilişkiler sağlayan kartografyaya katkıda bulunan bir temsilciyle ilişkilendirir. @tr
toolkit label: topograf temsilci @tr
toolkit definition: Bir coğrafi bir alan için ölçümler veya boyutsal ilişkiler sağlayan kartografyaya katkıda bulunan bir temsilci. @tr
alternative label: topógrafo @es
label: tiene agente topógrafo @es
toolkit label: agente topógrafo @es
toolkit definition: Un agente que es un agente aportante de cartografía que proporciona medidas o relaciones dimensionales para un área geográfica. @es
has subproperty: has surveyor collective agent
has subproperty: has surveyor person
has subproperty: P30312

has surveyor collective agent
status: Published
lexical alias: surveyorCollectiveAgent.en
definition: Relates a manifestation to a collective agent who is a contributor agent of cartography who provides measurements or dimensional relationships for a geographic area.
toolkit label: surveyor collective agent
toolkit definition: A collective agent who is a contributor agent of cartography who provides measurements or dimensional relationships for a geographic area.
type: Property
domain: C10007
has element type: 2
sub property of: has contributor collective agent of cartography
sub property of: has surveyor agent
label: maanmittari (yhteistoimija) @fi
definition: Liittää manifestaation yhteistoimijaan, joka kartografiaan osallisena toimijana tuottaa maantieteellisen alueen mitat tai mittasuhteet. @fi
toolkit label: maanmittari (yhteistoimija) @fi
toolkit definition: Yhteistoimija, joka kartografiaan osallisena toimijana tuottaa maantieteellisen alueen mitat tai mittasuhteet. @fi
label: har landmåler (kollektiv agent) @no
definition: Relaterer en manifestasjon til en kollektiv agent som er en kartograf til aggregat som tilfører målinger eller størrelsesforhold for et geografisk område. @no
toolkit label: landmåler (kollektiv agent) @no
toolkit definition: En kollektiv agent som er en kartograf til aggregat som tilfører målinger eller størrelsesforhold for et geografisk område. @no
label: a pour agent collectif arpenteur @fr
definition: Met une manifestation en relation avec un agent collectif contributeur de cartographie qui fournit des mesures ou des relations dimensionnelles pour une aire géographique. @fr
toolkit label: agent collectif arpenteur @fr
toolkit definition: Agent collectif contributeur de cartographie qui fournit des mesures ou des relations dimensionnelles pour une aire géographique. @fr
label: heeft landmeter-collectieve actor @nl
definition: Relateert een manifestatie aan een collectieve actor die is een bijdrager-actor van cartografie die metingen of dimensionele verhoudingen verschaft voor een geografisch gebied. @nl
toolkit label: landmeter-collectieve actor @nl
toolkit definition: Een collectieve actor die is een bijdrager-actor van cartografie die metingen of dimensionele verhoudingen verschaft voor een geografisch gebied. @nl
label: له وكيل جماعي مساح @ar
definition: يربط بين تجسيدة ووكيل جماعي مسئول عن رسم الخرائط في عمل تجميعي يقدم علاقات القياسات أو الأبعاد لمنطقة جغرافية. @ar
toolkit label: وكيل جماعي مساح @ar
toolkit definition: وكيل جماعي مسئول عن رسم الخرائط في عمل تجميعي يقدم علاقات القياسات أو الأبعاد لمنطقة جغرافية. @ar
label: té com a agent col·lectiu agrimensor @ca
definition: Relaciona una manifestació amb un agent col·lectiu que és un agent contribuïdor de cartografia i que proporciona mesuraments o relacions dimensionals d’una àrea geogràfica. @ca
toolkit label: agent col·lectiu agrimensor @ca
toolkit definition: Agent col·lectiu que és un agent contribuïdor de cartografia i que proporciona mesuraments o relacions dimensionals d’una àrea geogràfica. @ca
label: har kollektiv agent, som er landinspektør @da
definition: Relaterer en manifestation til en kollektiv agent, som er kartograf til samling, som angiver målinger eller dimensionelle forhold for et geografisk område. @da
toolkit label: kollektiv agent, som er landinspektør @da
toolkit definition: Kollektiv agent, som er kartograf til samling, som angiver målinger eller dimensionelle forhold for et geografisk område. @da
label: maamõõtja (kollektiiv) @et
definition: Seostab kehastuse kollektiiviga, kes liitumi kartograafina hangib geograafilise piirkonna mõõdud või mõõdusuhted. @et
toolkit label: maamõõtja (kollektiiv) @et
toolkit definition: Kollektiiv, kes liitumi kartograafina hangib geograafilise piirkonna mõõdud või mõõdusuhted. @et
label: hat Landvermesserin/Landvermesser (Gemeinschaftlicher Akteur) @de
definition: Setzt eine Manifestation in Beziehung zu einer Beiträgerin/einem Beiträger einer Kartografie (Gemeinschaftlicher Akteur), die/der Messwerte oder Abmessungsverhältnisse für den dargestellten geografischen Bereich zur Verfügung stellt. @de
toolkit label: Landvermesserin/Landvermesser (Gemeinschaftlicher Akteur) @de
toolkit definition: Eine Beiträgerin/Ein Beiträger einer Kartografie (Gemeinschaftlicher Akteur), die/der Messwerte oder Abmessungsverhältnisse für den dargestellten geografischen Bereich zur Verfügung stellt. @de
label: földmérő kollektív ágense a következő: @hu
definition: Hozzákapcsol egy megjelenési formát egy kollektív ágenshez, amely egy kartográfia közreműködő ágenseként egy földrajzi területről méréseket vagy dimenziós összefüggéseket szolgáltat. @hu
toolkit label: földmérő kollektív ágense: @hu
toolkit definition: Egy kollektív ágens, amely egy kartográfia közreműködő ágenseként egy földrajzi területről méréseket vagy dimenziós összefüggéseket szolgáltat. @hu
label: ha come topografo agente @it
definition: Correla una manifestazione all'agente collettivo, cartografo di aggregato, che fornisce misurazioni o rapporti dimensionali per un'area geografica. @it
toolkit label: topografo agente collettivo @it
toolkit definition: Agente collettivo, cartografo di aggregato, che fornisce misurazioni o rapporti dimensionali per un'area geografica. @it
label: topogrāfs (grupa) @lv
definition: Sasaista manifestāciju ar grupu, kas ir apkopojuma kartogrāfs un nodrošina ģeogrāfiskā apgabala mērījumus vai dimensiju attiecības. @lv
toolkit label: topogrāfs (grupa) @lv
toolkit definition: Grupa, kas ir apkopojuma kartogrāfs un nodrošina ģeogrāfiskā apgabala mērījumus vai dimensiju attiecības. @lv
label: 有测绘者集体行为者 @zh-hans
definition: 将一种载体表现与作为地图绘制的贡献者行为者并为一个地理区域提供测量或尺寸关系的一个集体行为者关联起来。 @zh-hans
toolkit label: 测绘者集体行为者 @zh-hans
toolkit definition: 作为地图绘制的贡献者行为者并为一个地理区域提供测量或尺寸关系的一个集体行为者 @zh-hans
label: topograf kolektif temsilcisi ile ilişkilidir @tr
definition: Bir coğrafi alan için ölçümler veya boyutsal ilişkiler sağlayan, haritacılıkta katkıda bulunan bir aracı olan kolektif bir aracıyla bir gösterimi ilişkilendirir. @tr
toolkit label: topograf kolektif temsilcisi @tr
toolkit definition: Bir coğrafi alan için ölçümler veya boyutsal ilişkiler sağlayan haritacılıkta katkıda bulunan bir temsilci olan kolektif bir temsici. @tr
label: tiene agente colectivo agrimensor @es
definition: Relaciona una manifestación con un agente colectivo que es un agente colaborador de cartografía que proporciona medidas o relaciones dimensionales para un área geográfica. @es
toolkit label: agente colectivo agrimensor @es
toolkit definition: Un agente colectivo que es un agente colaborador de cartografía que proporciona medidas o relaciones dimensionales para un área geográfica. @es
has subproperty: has surveyor corporate body
has subproperty: has surveyor family
has subproperty: P30366

has surveyor corporate body
status: Published
lexical alias: surveyorCorporateBody.en
definition: Relates a manifestation to a corporate body who is a contributor agent of cartography who provides measurements or dimensional relationships for a geographic area.
toolkit label: surveyor corporate body
toolkit definition: A corporate body who is a contributor agent of cartography who provides measurements or dimensional relationships for a geographic area.
type: Property
domain: C10007
has element type: 2
sub property of: has contributor corporate body of cartography
sub property of: has surveyor collective agent
label: maanmittari (yhteisö) @fi
definition: Liittää manifestaation yhteisöön, joka kartografiaan osallisena toimijana tuottaa maantieteellisen alueen mitat tai mittasuhteet. @fi
toolkit label: maanmittari (yhteisö) @fi
toolkit definition: Yhteisö, joka kartografiaan osallisena toimijana tuottaa maantieteellisen alueen mitat tai mittasuhteet. @fi
label: har landmåler (korporasjon) @no
definition: Relaterer en manifestasjon til en korporasjon som er en kartograf til aggregat som tilfører målinger eller størrelsesforhold for et geografisk område. @no
toolkit label: landmåler (korporasjon) @no
toolkit definition: En korporasjon som er en kartograf til aggregat som tilfører målinger eller størrelsesforhold for et geografisk område. @no
label: a pour collectivité arpenteuse @fr
definition: Met une manifestation en relation avec une collectivité contributrice de cartographie qui fournit des mesures ou des relations dimensionnelles pour une aire géographique. @fr
toolkit label: collectivité arpenteuse @fr
toolkit definition: Collectivité contributrice de cartographie qui fournit des mesures ou des relations dimensionnelles pour une aire géographique. @fr
label: heeft landmeter-corporatie @nl
definition: Relateert een manifestatie aan een corporatie die is een bijdrager-actor van cartografie die metingen of dimensionele verhoudingen verschaft voor een geografisch gebied. @nl
toolkit label: landmeter-corporatie @nl
toolkit definition: Een corporatie die is een bijdrager-actor van cartografie die metingen of dimensionele verhoudingen verschaft voor een geografisch gebied. @nl
label: له هيئة مساح @ar
definition: يربط بين تجسيدة وهيئة مسئولة عن رسم الخرائط في عمل تجميعي يقدم علاقات القياسات أو الأبعاد لمنطقة جغرافية. @ar
toolkit label: هيئة مساح @ar
toolkit definition: هيئة مسئولة عن رسم الخرائط في عمل تجميعي يقدم علاقات القياسات أو الأبعاد لمنطقة جغرافية. @ar
label: té com a entitat corporativa agrimensora @ca
definition: Relaciona una manifestació amb una entitat corporativa que és un agent contribuïdor de cartografia que proporciona mesuraments o relacions dimensionals d’una àrea geogràfica. @ca
toolkit label: entitat corporativa agrimensora @ca
toolkit definition: Entitat corporativa que és un agent contribuïdor de cartografia que proporciona mesuraments o relacions dimensionals d’una àrea geogràfica. @ca
label: har korporation, som er landinspektør @da
definition: Relaterer en manifestation til en korporation, som er kartograf til samling, som angiver målinger eller dimensionelle forhold for et geografisk område. @da
toolkit label: korporation, som er landinspektør @da
toolkit definition: Korporation, som er kartograf til samling, som angiver målinger eller dimensionelle forhold for et geografisk område. @da
label: maamõõtja (asutus) @et
definition: Seostab kehastuse asutusega, kes liitumi kartograafina hangib geograafilise piirkonna mõõdud või mõõdusuhted. @et
toolkit label: maamõõtja (asutus) @et
toolkit definition: Asutus, kes liitumi kartograafina hangib geograafilise piirkonna mõõdud või mõõdusuhted. @et
label: hat Landvermesserin/Landvermesser (Körperschaft) @de
definition: Setzt eine Manifestation in Beziehung zu einer Beiträgerin/einem Beiträger einer Kartografie (Körperschaft), die/der Messwerte oder Abmessungsverhältnisse für den dargestellten geografischen Bereich zur Verfügung stellt. @de
toolkit label: Landvermesserin/Landvermesser (Körperschaft) @de
toolkit definition: Eine Beiträgerin/Ein Beiträger einer Kartografie (Körperschaft), die/der Messwerte oder Abmessungsverhältnisse für den dargestellten geografischen Bereich zur Verfügung stellt. @de
label: földmérő testülete a következő: @hu
definition: Hozzákapcsol egy megjelenési formát egy testülethez, amely egy kartográfia közreműködő ágense, amely egy földrajzi területről méréseket vagy dimenziós összefüggéseket szolgáltat. @hu
toolkit label: földmérő testülete: @hu
toolkit definition: Egy testület, amely egy kartográfia közreműködő ágense, amely egy földrajzi területről méréseket vagy dimenziós összefüggéseket szolgáltat. @hu
label: ha come topografo ente @it
definition: Correla una manifestazione all'ente cartografo di aggregato, che fornisce misurazioni o rapporti dimensionali per un'area geografica. @it
toolkit label: topografo ente @it
toolkit definition: Ente cartografo di aggregato, che fornisce misurazioni o rapporti dimensionali per un'area geografica. @it
label: topogrāfs (institūcija) @lv
definition: Sasaista manifestāciju ar institūciju, kas ir apkopojuma kartogrāfs un nodrošina ģeogrāfiskā apgabala mērījumus vai dimensiju attiecības. @lv
toolkit label: topogrāfs (institūcija) @lv
toolkit definition: Institūcija, kas ir apkopojuma kartogrāfs un nodrošina ģeogrāfiskā apgabala mērījumus vai dimensiju attiecības. @lv
label: 有测绘者团体 @zh-hans
definition: 将一种载体表现与作为地图绘制的贡献者行为者并为一个地理区域提供测量或尺寸关系的一个团体关联起来。 @zh-hans
toolkit label: 测绘者团体 @zh-hans
toolkit definition: 作为地图绘制的贡献者行为者并为一个地理区域提供测量或尺寸关系的一个团体 @zh-hans
label: topograf tüzel kişisi ile ilişkilidir @tr
definition: Bir gösterimi coğrafi alan için ölçümler veya boyutsal ilişkiler sağlayan, haritacılıkta katkıda bulunan bir aracı olan bir tüzel kişiyle ilişkilendirir. @tr
toolkit label: topograf tüzel kişi @tr
toolkit definition: Bir coğrafi alan için ölçümler veya boyutsal ilişkiler sağlayan, haritacılıkta katkıda bulunan bir aracı olan bir tüzel kişilik. @tr
label: tiene cuerpo corporativo topógrafo @es
definition: Relaciona una manifestación con un cuerpo corporativo que es un agente colaborador de cartografía que proporciona medidas o relaciones dimensionales para un área geográfica. @es
toolkit label: cuerpo corporativo topógrafo @es
toolkit definition: Un cuerpo corporativo que es un agente colaborador de cartografía que proporciona medidas o relaciones dimensionales para un área geográfica. @es
has subproperty: P30395

has surveyor family
status: Published
lexical alias: surveyorFamily.en
definition: Relates a manifestation to a family who is a contributor agent of cartography who provides measurements or dimensional relationships for a geographic area.
toolkit label: surveyor family
toolkit definition: A family who is a contributor agent of cartography who provides measurements or dimensional relationships for a geographic area.
type: Property
domain: C10007
has element type: 2
sub property of: has contributor family of cartography
sub property of: has surveyor collective agent
label: maanmittari (suku) @fi
definition: Liittää manifestaation sukuun, joka kartografiaan osallisena toimijana tuottaa maantieteellisen alueen mitat tai mittasuhteet. @fi
toolkit label: maanmittari (suku) @fi
toolkit definition: Suku, joka kartografiaan osallisena toimijana tuottaa maantieteellisen alueen mitat tai mittasuhteet. @fi
label: har landmåler (familie) @no
definition: Relaterer en manifestasjon til en familie som er en kartograf til aggregat som tilfører målinger eller størrelsesforhold for et geografisk område. @no
toolkit label: landmåler (familie) @no
toolkit definition: En familie som er en kartograf til aggregat som tilfører målinger eller størrelsesforhold for et geografisk område. @no
label: a pour famille arpenteuse @fr
definition: Met une manifestation en relation avec une famille contributrice de cartographie qui fournit des mesures ou des relations dimensionnelles pour une aire géographique. @fr
toolkit label: famille arpenteuse @fr
toolkit definition: Famille contributrice de cartographie qui fournit des mesures ou des relations dimensionnelles pour une aire géographique. @fr
label: heeft landmeter-familie @nl
definition: Relateert een manifestatie aan een familie die is een bijdrager-actor van cartografie die metingen of dimensionele verhoudingen verschaft voor een geografisch gebied. @nl
toolkit label: landmeter-familie @nl
toolkit definition: Een familie die is een bijdrager-actor van cartografie die metingen of dimensionele verhoudingen verschaft voor een geografisch gebied. @nl
label: له عائلة مساح @ar
definition: يربط بين تجسيدة وعائلة مسئولة عن رسم الخرائط في عمل تجميعي يقدم علاقات القياسات أو الأبعاد لمنطقة جغرافية. @ar
toolkit label: عائلة مساح @ar
toolkit definition: عائلة مسئولة عن رسم الخرائط في عمل تجميعي يقدم علاقات القياسات أو الأبعاد لمنطقة جغرافية. @ar
label: té com a família agrimensora @ca
definition: Relaciona una manifestació amb una família que és un agent contribuïdor de cartografia que proporciona mesuraments o relacions dimensionals d’una àrea geogràfica. @ca
toolkit label: família agrimensora @ca
toolkit definition: Família que és un agent contribuïdor de cartografia que proporciona mesuraments o relacions dimensionals d’una àrea geogràfica. @ca
label: har familie, som er landinspektør @da
definition: Relaterer en manifestation til en familie, som er kartograf til samling, som angiver målinger eller dimensionelle forhold for et geografisk område. @da
toolkit label: familie, som er landinspektør @da
toolkit definition: Familie, som er kartograf til samling, som angiver målinger eller dimensionelle forhold for et geografisk område. @da
label: maamõõtja (perekond) @et
definition: Seostab kehastuse perekonnaga, kes liitumi kartograafina hangib geograafilise piirkonna mõõdud või mõõdusuhted. @et
toolkit label: maamõõtja (perekond) @et
toolkit definition: Perekond, kes liitumi kartograafina hangib geograafilise piirkonna mõõdud või mõõdusuhted. @et
label: hat Landvermesserin/Landvermesser (Familie) @de
definition: Setzt eine Manifestation in Beziehung zu einer Beiträgerin/einem Beiträger einer Kartografie (Familie), die/der Messwerte oder Abmessungsverhältnisse für den dargestellten geografischen Bereich zur Verfügung stellt. @de
toolkit label: Landvermesserin/Landvermesser (Familie) @de
toolkit definition: Eine Beiträgerin/Ein Beiträger einer Kartografie (Familie), die/der Messwerte oder Abmessungsverhältnisse für den dargestellten geografischen Bereich zur Verfügung stellt. @de
label: földmérő családja a következő: @hu
definition: Hozzákapcsol egy megjelenési formát egy családhoz, egy kartográfia közreműködő ágenséhez, amely egy földrajzi területről méréseket vagy dimenziós összefüggéseket szolgáltat. @hu
toolkit label: földmérő család @hu
toolkit definition: Egy család, egy kartográfia közreműködő ágense, amely egy földrajzi területről méréseket vagy dimenziós összefüggéseket szolgáltat. @hu
label: ha come topografo famiglia @it
definition: Correla una manifestazione alla famiglia cartografa di un aggregato che fornisce misurazioni o rapporti dimensionali per un'area geografica. @it
toolkit label: topografo famiglia @it
toolkit definition: Famiglia cartografo di un aggregato che fornisce misurazioni o rapporti dimensionali per un'area geografica. @it
label: topogrāfs (dzimta/ģimene) @lv
definition: Sasaista manifestāciju ar dzimtu/ģimeni, kas ir apkopojuma kartogrāfs un nodrošina ģeogrāfiskā apgabala mērījumus vai dimensiju attiecības. @lv
toolkit label: topogrāfs (dzimta/ģimene) @lv
toolkit definition: Dzimta/ģimene, kas ir apkopojuma kartogrāfs un nodrošina ģeogrāfiskā apgabala mērījumus vai dimensiju attiecības. @lv
label: 有测绘者家族 @zh-hans
definition: 将一种载体表现与作为地图绘制的贡献者行为者并为一个地理区域提供测量或尺寸关系的一个家族关联起来。 @zh-hans
toolkit label: 测绘者家族 @zh-hans
toolkit definition: 作为地图绘制的贡献者行为者并为一个地理区域提供测量或尺寸关系的一个家族 @zh-hans
label: topograf ailesi ile ilişkilidir @tr
definition: Bir gösterimi, coğrafi bölge için ölçüler veya boyutsal ilişkiler sağlayan, kartografyanın katkı sağlayan temsilcisi olan aileyle ilişkilendirir. @tr
toolkit label: topograf aile @tr
toolkit definition: Coğrafi bölge için ölçüler veya boyutsal ilişkiler sağlayan, kartografyanın katkı sağlayan temsilcisi olan aile. @tr
label: tiene familia agrimensora @es
definition: Relaciona una manifestación con una familia que es agente contribuidor de cartografía quien provee medidas o relaciones dimensionales para un área geográfica. @es
toolkit label: familia agrimensora @es
toolkit definition: Una familia que es agente contribuidor de cartografía quien provee medidas o relaciones dimensionales para un área geográfica. @es
has subproperty: P30424

has surveyor person
status: Published
lexical alias: surveyorPerson.en
definition: Relates a manifestation to a person who is a contributor agent of cartography who provides measurements or dimensional relationships for a geographic area.
toolkit label: surveyor person
toolkit definition: A person who is a contributor agent of cartography who provides measurements or dimensional relationships for a geographic area.
type: Property
domain: C10007
has element type: 2
sub property of: has contributor person of cartography
sub property of: has surveyor agent
label: maanmittari (henkilö) @fi
definition: Liittää manifestaation henkilöön, joka kartografiaan osallisena toimijana tuottaa maantieteellisen alueen mitat tai mittasuhteet. @fi
toolkit label: maanmittari (henkilö) @fi
toolkit definition: Henkilö, joka kartografiaan osallisena toimijana tuottaa maantieteellisen alueen mitat tai mittasuhteet. @fi
label: har landmåler (person) @no
definition: Relaterer en manifestasjon til en person som er en kartograf til aggregat som tilfører målinger eller størrelsesforhold for et geografisk område. @no
toolkit label: landmåler (person) @no
toolkit definition: En person som er en kartograf til aggregat som tilfører målinger eller størrelsesforhold for et geografisk område. @no
label: a pour personne arpenteuse @fr
definition: Met une manifestation en relation avec une personne contributrice de cartographie qui fournit des mesures ou des relations dimensionnelles pour une aire géographique. @fr
toolkit label: personne arpenteuse @fr
toolkit definition: Personne contributrice de cartographie qui fournit des mesures ou des relations dimensionnelles pour une aire géographique. @fr
label: heeft landmeter-persoon @nl
definition: Relateert een manifestatie aan een persoon die is een bijdrager-actor van cartografie die metingen of dimensionele verhoudingen verschaft voor een geografisch gebied. @nl
toolkit label: landmeter-persoon @nl
toolkit definition: Een persoon die is een bijdrager-actor van cartografie die metingen of dimensionele verhoudingen verschaft voor een geografisch gebied. @nl
label: له شخص مساح @ar
definition: يربط بين تجسيدة وشخص مسئول عن رسم الخرائط في عمل تجميعي يقدم علاقات القياسات أو الأبعاد لمنطقة جغرافية. @ar
toolkit label: شخص مساح @ar
toolkit definition: شخص مسئول عن رسم الخرائط في عمل تجميعي يقدم علاقات القياسات أو الأبعاد لمنطقة جغرافية. @ar
label: té com a persona agrimensora @ca
definition: Relaciona una manifestació amb una persona que és un contribuïdor de cartografia i que proporciona mesuraments o relacions dimensionals d’una àrea geogràfica. @ca
toolkit label: persona agrimensora @ca
toolkit definition: Persona que és un contribuïdor de cartografia i que proporciona mesuraments o relacions dimensionals d’una àrea geogràfica. @ca
label: har person, som er landinspektør @da
definition: Relaterer en manifestation til en person, som er kartograf til samling, som angiver målinger eller dimensionelle forhold for et geografisk område. @da
toolkit label: person, som er landinspektør @da
toolkit definition: Person, som er kartograf til samling, som angiver målinger eller dimensionelle forhold for et geografisk område. @da
label: maamõõtja (isik) @et
definition: Seostab kehastuse isikuga, kes liitumi kartograafina hangib geograafilise piirkonna mõõdud või mõõdusuhted. @et
toolkit label: maamõõtja (isik) @et
toolkit definition: Isik, kes liitumi kartograafina hangib geograafilise piirkonna mõõdud või mõõdusuhted. @et
label: hat Landvermesserin/Landvermesser (Person) @de
definition: Setzt eine Manifestation in Beziehung zu einer Beiträgerin/einem Beiträger einer Kartografie (Person), die/der Messwerte oder Abmessungsverhältnisse für den dargestellten geografischen Bereich zur Verfügung stellt. @de
toolkit label: Landvermesserin/Landvermesser (Person) @de
toolkit definition: Eine Beiträgerin/Ein Beiträger einer Kartografie (Person), die/der Messwerte oder Abmessungsverhältnisse für den dargestellten geografischen Bereich zur Verfügung stellt. @de
label: földmérő személye a következő: @hu
definition: Hozzákapcsol egy megjelenési formát egy személyhez, aki egy kartográfia közreműködő ágense, aki egy földrajzi területről méréseket vagy dimenziós összefüggéseket szolgáltat. @hu
toolkit label: földmérő személy @hu
toolkit definition: Egy személy, aki egy kartográfia közreműködő ágense, aki egy földrajzi területről méréseket vagy dimenziós összefüggéseket szolgáltat. @hu
label: ha come topografo persona @it
definition: Correla una manifestazione alla persona cartografa di aggregato che fornisce misurazioni o rapporti dimensionali per un'area geografica. @it
toolkit label: topografo persona @it
toolkit definition: Persona cartografa di aggregato che fornisce misurazioni o rapporti dimensionali per un'area geografica. @it
label: topogrāfs (persona) @lv
definition: Sasaista manifestāciju ar personu, kura ir apkopojuma kartogrāfs un nodrošina ģeogrāfiskā apgabala mērījumus vai dimensiju attiecības. @lv
toolkit label: topogrāfs (persona) @lv
toolkit definition: Persona, kura ir apkopojuma kartogrāfs un nodrošina ģeogrāfiskā apgabala mērījumus vai dimensiju attiecības. @lv
label: 有测绘者个人 @zh-hans
definition: 将一种载体表现与作为地图绘制的贡献者行为者并为一个地理区域提供测量或尺寸关系的一个个人关联起来。 @zh-hans
toolkit label: 测绘者个人 @zh-hans
toolkit definition: 作为地图绘制的贡献者行为者并为一个地理区域提供测量或尺寸关系的一个个人 @zh-hans
label: topograf kişisi ile ilişkilidir @tr
definition: Bir gösterimi, coğrafi alan için ölçümler veya boyutsal ilişkiler sağlayan kartografiye katkıda bulunan bir kişiyle ilişkilendirir. @tr
toolkit label: kartograf @tr
toolkit definition: Coğrafi bir alan için ölçümler veya boyutsal ilişkiler sağlayan kartografyaya katkıda bulunan bir kişi. @tr
label: tiene persona topógrafo @es
definition: Relaciona una manifestación con una persona que es un agente colaborador de cartografía que proporciona medidas o relaciones dimensionales para un área geográfica. @es
toolkit label: persona topógrafo @es
toolkit definition: Una persona que es un agente colaborador de cartografía que proporciona medidas o relaciones dimensionales para un área geográfica. @es
has subproperty: P30337

has edition statement
status: Published
definition: Relates a manifestation to a statement that identifies an edition to which a manifestation belongs.
type: Property
domain: C10007
lexical alias: editionStatement.en
scope note: An edition statement sometimes includes a designation of a named revision of an edition. An edition statement sometimes includes a statement of responsibility relating to the edition or to a named revision of an edition.
instruction number: 2.5
toolkit label: edition statement
toolkit definition: A statement that identifies an edition to which a manifestation belongs.
label: a pour mention d’édition @fr
definition: Met une manifestation en relation avec une mention qui identifie une édition à laquelle appartient une manifestation. @fr
scope note: Une mention d’édition comprend parfois une désignation d’une révision nommée d’une édition. Une mention d’édition comprend parfois une mention de responsabilité relative à une édition ou à une révision nommée d’une édition. @fr
toolkit label: mention d’édition @fr
toolkit definition: Mention qui identifie une édition à laquelle appartient une manifestation. @fr
toolkit label: declaración de edición @es
toolkit definition: Una declaración que identifica una edición a la que pertenece una manifestación. @es
label: har upplageuppgift @sv
toolkit label: upplageuppgift @sv
toolkit label: editievermelding @nl
toolkit definition: Een vermelding die een editie identificeert waartoe een manifestatie behoort. @nl
label: có thông tin ấn bản @vi
definition: Liên kết biểu thị với thông tin nhận dạng ấn bản mà biểu thị thuộc vào. @vi
scope note: Thông tin ấn bản đôi khi bao gồm định danh của sửa chữa được định rõ của ấn bản. Thông tin ấn bản đôi khi bao gồm thông tin trách nhiệm liên quan tới ấn bản đó hoặc tới sửa chữa được định rõ của ấn bản. @vi
toolkit label: thông tin ấn bản @vi
toolkit definition: Thông tin nhận dạng ấn bản mà biểu thị thuộc vào. @vi
scope note: Een editievermelding omvat soms een aanduiding van een benoemde bewerking van een editie. Een editievermelding omvat soms een verantwoordelijkheidsvermelding gerelateerd aan de editie of een benoemde herziening van een editie. @nl
label: har udgavebetegnelse @da
definition: Relaterer en manifestation til en oplysning, som identificerer den udgave, hvortil en manifestation tilhører. @da
scope note: Udgavebetegnelse omfatter sommetider en betegnelse af en navngiven revision af en udgave. En udgavebetegnelse omfatter sommetider en eller flere ophavsangivelser, som relaterer til udgaven eller en navngivet revision af en udgave. @da
toolkit label: udgavebetegnelse @da
toolkit definition: Oplysning, som identificerer den udgave, hvortil en manifestation tilhører. @da
label: hat Ausgabevermerk @de
definition: Setzt eine Manifestation in Beziehung zu einer Angabe, die eine Ausgabe identifiziert, zu der eine Manifestation gehört. @de
scope note: Darunter fallen manchmal auch Ausgabebezeichnungen einer näher erläuterten Überarbeitung. Darunter fallen manchmal auch Verantwortlichkeitsangaben, die sich auf die Ausgabe oder auf eine näher erläuterte Überarbeitung einer Ausgabe beziehen. @de
toolkit label: Ausgabevermerk @de
toolkit definition: Eine Angabe, die eine Ausgabe identifiziert, zu der eine Manifestation gehört. @de
label: té com a menció d’edició @ca
definition: Relaciona una manifestació amb una menció que identifica una edició a la qual pertany una manifestació. @ca
scope note: Una menció d’edició a vegades inclou una designació d’una revisió explícita d’edició. Una menció d’edició a vegades inclou una menció de responsabilitat relativa a l’edició o a una revisió explícita d’edició. @ca
toolkit label: menció d’edició @ca
toolkit definition: Menció que identifica una edició a la qual pertany una manifestació. @ca
definition: Liittää manifestaation merkintöön, joka identifioi manifestaation painoksen. @fi
toolkit label: painosmerkintö @fi
toolkit definition: Merkintö, joka identifioi manifestaation painoksen. @fi
toolkit label: utgaveangivelse @no
toolkit definition: En angivelse som identifiserer en utgave som en manifestasjon tilhører. @no
label: έχει μνεία έκδοσης @el
definition: Συνδέει μια εκδήλωση με μια μνεία που ταυτίζει μια έκδοση στην οποία ανήκει μια εκδήλωση. @el
scope note: Μια μνεία ευθύνης κάποιες φορές περιλαμβάνει έναν προσδιορισμό μιας κατονομαζόμενης αναθεώρησης μιας έκδοσης. Μια μνεία έκδοσης κάποιες φορές περιλαμβάνει μια μνεία ευθύνης σχετική με την έκδοση ή με μια κατονομαζόμενη αναθεώρηση μιας έκδοσης. @el
toolkit label: μνεία έκδοσης @el
toolkit definition: Μια μνεία που ταυτίζει μια έκδοση στην οποία ανήκει μια εκδήλωση. @el
has element type: 6
label: kiadásjelzése a következő: @hu
definition: Hozzákapcsol egy megjelenési formát egy kiadást azonosító közléshez, amelyhez egy megjelenési forma tartozik. @hu
scope note: Egy kiadásközlés időnként tartalmazza egy kiadás nevesített revíziójának a jelölését. Egy kiadásközlés időnként tartalmaz a kiadásra vagy egy kiadás nevesített revíziójára vonatkozó felelősségi közlést. @hu
toolkit label: kiadásjelzése: @hu
toolkit definition: Egy kiadást azonosító közlés, amelyhez egy megjelenési forma tartozik. @hu
scope note: Painosmerkintö sisältää joskus nimetyn uudistetun painoksen määritteen. Painosmerkintö sisältää joskus painokseen tai nimettyyn uudistettuun painokseen liittyvän vastuullisuusmerkinnön. @fi
label: painosmerkintö @fi
label: har utgaveangivelse @no
definition: Relaterer en manifestasjon til en angivelse som identifiserer en utgave som en manifestasjon tilhører. @no
scope note: En utgaveangivelse kan inkludere en betegnelse for en bestemt revisjon av en utgave. En utgaveangivelse kan inkludere en ansvarsangivelse knyttet til utgaven eller en bestemt revisjon av en utgave. @no
label: heeft editievermelding @nl
definition: Relateert een manifestatie aan een vermelding die een editie identificeert waartoe een manifestatie behoort. @nl
label: له بيان الطبعة @ar
definition: يربط بين تجسيدة وبيان يحدد طبعة تنتمي إليها تجسيدة. @ar
scope note: يشمل بيان الطبعة في بعض الأحيان تسمية لمراجعة محددة لطبعة ما. يشمل بيان الطبعة في بعض الأحيان بيان المسئولية المرتبط بالطبعة أو مراجعة محددة لطبعة ما. @ar
toolkit label: بيان الطبعة @ar
toolkit definition: بيان يحدد طبعة تنتمي إليها تجسيدة. @ar
label: editsiooniandmed @et
definition: Seostab kehastuse andmetega, mis identifitseerivad editsiooni, millesse kehastus kuulub. @et
scope note: Editsiooniandmed võivad sisaldada editsiooni nimelise uusversiooni tähistust, samuti editsiooniga või editsiooni nimelise uusversiooniga seotud vastutusandmeid. @et
toolkit label: editsiooniandmed @et
toolkit definition: Andmed, mis identifitseerivad editsiooni, millesse kehastus kuulub. @et
label: ha come formulazione di edizione @it
definition: Correla una manifestazione a una formulazione che identifica l'edizione a cui la risorsa appartiene. @it
scope note: Una formulazione di edizione comprende talora una designazione di una revisione identificata di un'edizione. Una formulazione di edizione comprende talora una formulazione di responsabilità relativa all'edizione, o a una designazione di revisione di un'edizione. @it
toolkit label: formulazione di edizione @it
toolkit definition: Formulazione che identifica l'edizione a cui la risorsa appartiene. @it

has statement of responsibility
status: Published
definition: Relates a manifestation to a statement that identifies, and indicates the function of, an agent who is responsible for a work or its expression that is embodied by a manifestation.
type: Property
domain: C10007
lexical alias: statementOfResponsibility.en
scope note: A statement of responsibility may include words or phrases that are neither names nor linking words.
instruction number: 2.4
toolkit label: statement of responsibility
toolkit definition: A statement that identifies, and indicates the function of, an agent who is responsible for a work or its expression that is embodied by a manifestation.
label: a pour mention de responsabilité @fr
definition: Met une manifestation en relation avec une mention qui identifie un agent responsable d’une œuvre ou de son expression matérialisée par une manifestation et indique la fonction exercée par l’agent. @fr
scope note: Une mention de responsabilité peut comprendre des mots ou des expressions qui ne sont ni des noms ni des mots de liaison. @fr
toolkit label: mention de responsabilité @fr
toolkit definition: Mention qui identifie un agent responsable d’une œuvre ou de son expression matérialisée par une manifestation et indique la fonction exercée par l’agent. @fr
toolkit label: declaración de responsabilidad @es
toolkit definition: Una declaración que identifica e indica la función de un agente responsable de una obra o de su expresión que se materializa en una manifestación. @es
label: har upphovsuppgift @sv
toolkit label: upphovsuppgift @sv
toolkit label: verantwoordelijkheidsvermelding @nl
toolkit definition: Een vermelding die een actor identificeert, en diens functie aangeeft, die verantwoordelijk is voor een werk of expressie daarvan die verwezenlijkt is in een manifestatie. @nl
label: có thông tin trách nhiệm @vi
definition: Liên kết biểu thị với thông tin liên quan tới nhận dạng hoặc chức năng của các tác nhân có trách nhiệm về sáng tạo, hoặc đóng góp thực hiện nội dung trí tuệ và nghệ thuật của biểu thị. @vi
scope note: Thông tin trách nhiệm đôi khi bao gồm từ hoặc cụm từ không phải tên hoặc từ nối. @vi
toolkit label: thông tin trách nhiệm @vi
toolkit definition: Thông tin liên quan tới nhận dạng hoặc chức năng của các tác nhân có trách nhiệm về sáng tạo, hoặc đóng góp thực hiện nội dung trí tuệ và nghệ thuật của biểu thị. @vi
scope note: Een verantwoordelijkheidsvermelding bevat soms woorden of zinnen die geen namen zijn noch verbindende woorden. @nl
label: har ophavsangivelse @da
definition: Relaterer en manifestation til en oplysning, som identificerer og beskriver funktionen af en agent, som er ansvarlig for et værk eller dets udtryk, som er indeholdt i en manifestation. @da
scope note: Ophavsangivelse omfatter sommetider ord eller fraser, som hverken er navne eller forbindende ord. @da
toolkit label: ophavsangivelse @da
toolkit definition: Oplysning, som identificerer og beskriver funktionen af en agent, som er ansvarlig for et værk eller dets udtryk, som er indeholdt i en manifestation. @da
label: hat Verantwortlichkeitsangabe @de
definition: Setzt eine Manifestation in Beziehung zu einer Angabe, die sich auf die Identifizierung und die Funktion eines Akteurs bezieht, der für ein Werk oder dessen Expression, die durch eine Manifestation verkörpert ist, verantwortlich ist. @de
scope note: Darunter fallen Wörter oder Phrasen, die weder Namen noch verbindende Wörter sind. @de
toolkit label: Verantwortlichkeitsangabe @de
toolkit definition: Eine Angabe, die sich auf die Identifizierung und die Funktion eines Akteur bezieht, der für ein Werk oder dessen Expression, die durch eine Manifestation verkörpert ist, verantwortlich ist. @de
label: té com a menció de responsabilitat @ca
definition: Relaciona una manifestació amb una menció que identifica i indica la funció d’un agent que és responsable d’una obra o de la seva expressió que es materialitza en una manifestació. @ca
scope note: Una menció de responsabilitat pot incloure paraules o frases que no són noms ni paraules d’enllaç. @ca
toolkit label: menció de responsabilitat @ca
toolkit definition: Menció que identifica i indica la funció d’un agent que és responsable d’una obra o de la seva expressió que es materialitza en una manifestació. @ca
definition: Liittää manifestaation merkintöön, joka ilmaisee teoksesta tai manifestaatioon sisältyvien teoksen ekspressioista vastuussa olevan toimijan ja toimijaan liittyvän roolin. @fi
toolkit label: vastuullisuusmerkintö @fi
toolkit definition: Merkintö, joka ilmaisee teoksesta tai manifestaatioon sisältyvistä teoksen ekspressioista vastuussa olevan toimijan ja toimijaan liittyvän roolin. @fi
toolkit label: ansvarsangivelse @no
toolkit definition: En angivelse som identifiserer og indikerer funksjonen til en agent som er ansvarlig for et verk eller verkets uttrykk som er realisert i en manifestasjon. @no
label: έχει μνεία ευθύνης @el
definition: Συνδέει μια εκδήλωση με μια μνεία που σχετίζεται με την ταύτιση ή τη λειτουργία των φορέων που είναι υπεύθυνοι για τη δημιουργία του ή για τη συνεισφορά στην υλοποίηση του πνευματικού ή καλλιτεχνικού περιεχομένου μιας εκδήλωσης. @el
scope note: Μια μνεία ευθύνης κάποιες φορές περιλαμβάνει λέξεις ή φράσεις που δεν είναι ονόματα ή συνδετικές λέξεις. @el
toolkit label: μνεία ευθύνης @el
toolkit definition: Μια μνεία που σχετίζεται με την ταύτιση ή τη λειτουργία των φορέων που είναι υπεύθυνοι για τη δημιουργία του ή για τη συνεισφορά στην υλοποίηση του πνευματικού ή καλλιτεχνικού περιεχομένου μιας εκδήλωσης. @el
has element type: 6
label: felelősségi közlése a következő: @hu
definition: Egy megjelenési formát hozzákapcsol egy közléshez, amely kötődik azon ágensek (személyek, családok vagy testületek) meghatározásához vagy funkciójához, akik/amelyek felelősek egy megjelenési forma szellemi vagy művészi tartalmának a megalkotásáért, vagy annak létrehozásában való közreműködésért. @hu
scope note: felelősségi közlése: @hu
toolkit label: Egy közlés, amely ágensek (személyek, családok vagy testületek) meghatározására vagy funkciójára vonatkozik, akik felelősek egy megjelenési forma tartalmának megalkotásáért, vagy annak megvalósításában való közreműködésért. @hu
toolkit definition: Egy felelősségi közlés időnként magába foglal olyan szavakat vagy kifejezéseket, amelyek sem nem nevek, sem nem kötőszavak. @hu
scope note: Vastuullisuusmerkintöön voi sisältyä sanoja ja ilmauksia, jotka eivät ole nimiä eikä linkittäviä sanoja. @fi
label: vastuullisuusmerkintö @fi
label: har ansvarsangivelse @no
definition: Relaterer en manifestasjon til en angivelse som identifiserer og indikerer funksjonen til en agent som er ansvarlig for et verk eller verkets uttrykk som er realisert i en manifestasjon. @no
scope note: Ansvarsangivelse kan inkludere ord og fraser som hverken er navn eller bindeord. @no
label: heeft verantwoordelijkheidsvermelding @nl
definition: Relateert een manifestatie aan een vermelding die een actor identificeert, en diens functie aangeeft, die verantwoordelijk is voor een werk of expressie daarvan die verwezenlijkt is in een manifestatie. @nl
label: له بيان مسئولية @ar
definition: يربط بين تجسيدة وبيان يحدد وظيفة وكيل مسئول عن عمل أو تعبيرته التي تم تجسيدها في تجسيدة. @ar
scope note: يمكن أن يشمل بيان المسئولية على كلمات أو عبارات ليست أسماء أو كلمات ربط. @ar
toolkit label: بيان مسئولية @ar
toolkit definition: بيان يحدد وظيفة وكيل مسئول عن عمل أو تعبيرته التي تم تجسيدها في تجسيدة. @ar
label: vastutusandmed @et
definition: Seostab kehastuse andmetega, mis identifitseerivad tegija, kes vastutab kehastuses teostatud teose või selle väljenduse eest, ning tegija rolli. @et
scope note: Vastutusandmed võivad sisaldada sõnu ja fraase, mis ei ole nimed ega sidendid. @et
toolkit label: vastutusandmed @et
toolkit definition: Andmed, mis identifitseerivad tegija, kes vastutab kehastuses teostatud teose või selle väljenduse eest, ning tegija rolli. @et
label: ha come formulazione di responsabilità @it
definition: Correla una manifestazione a una formulazione che identifica un agente, e ne indica la funzione, responsabile di un’opera o della sua espressione materializzata in una manifestazione. @it
scope note: Una formulazione di responsabilità può comprendere parole o espressioni che non sono né nomi, né vocaboli di collegamento. @it
toolkit label: formulazione di responsabilità @it
toolkit definition: Formulazione che identifica un agente, e ne indica la funzione, responsabile di un’opera o della sua espressione materializzata in una manifestazione. @it

has statement of responsibility relating to subseries (Deprecated)
status: Deprecated
definition: Relates a manifestation to a statement relating to the identification of agents responsible for a subseries. (Deprecated)
type: Property
domain: C10007
lexical alias: statementOfResponsibilityRelatingToSubseries.en
instruction number: 2.12.14
toolkit label: statement of responsibility relating to subseries (Deprecated)
toolkit definition: A statement relating to the identification of agents responsible for a subseries. (Deprecated)
label: a pour mention de responsabilité relative à une sous-collection @fr
definition: Met une manifestation en relation avec une mention relative à l’identification des agents responsables d’une sous-collection. @fr
toolkit label: mention de responsabilité relative à une sous-collection @fr
toolkit definition: Mention relative à l’identification des agents responsables d’une sous-collection. @fr
toolkit label: mención de responsabilidad relacionada con la subserie @es
toolkit definition: Una mención relacionada con la identificación de personas, familias o entidades corporativas responsables por una subserie. @es
label: har upphovsuppgift till underserie @sv
toolkit label: upphovsuppgift till underserie @sv
toolkit label: verantwoordelijkheidsvermelding betreffende onderreeks @nl
toolkit definition: Een vermelding betreffende de identificatie van personen, families of corporaties verantwoordelijk voor een onderreeks. @nl
label: có thông tin trách nhiệm liên quan tới tiểu tùng thư @vi
definition: Liên kết biểu thị với thông tin liên quan tới nhận dạng các tác nhân có trách nhiệm đối với tiểu tùng thư. @vi
toolkit label: thông tin trách nhiệm liên quan tới tiểu tùng thư @vi
toolkit definition: Thông tin liên quan tới nhận dạng các tác nhân có trách nhiệm đối với tiểu tùng thư. @vi
label: har ophavsangivelse relateret til underserie @da
definition: Relaterer en manifestation til oplysninger relateret til identificering af en hvilken som helst agent eller agenter, der er ansvarlige for en underserie. @da
toolkit label: ophavsangivelse relateret til underserie @da
toolkit definition: Oplysninger relateret til identificering af en hvilken som helst agent eller agenter, der er ansvarlige for en underserie. @da
label: hat Verantwortlichkeitsangabe, die sich auf eine Unterreihe bezieht @de
definition: Setzt eine Manifestation mit einer Verantwortlichkeitsangabe, die sich auf die Identifizierung von Akteuren bezieht, die für eine Unterreihe verantwortlich sind, in Beziehung. @de
toolkit label: Verantwortlichkeitsangabe, die sich auf eine Unterreihe bezieht @de
toolkit definition: Eine Verantwortlichkeitsangabe, die sich auf die Identifizierung von Akteuren bezieht, die für eine Unterreihe verantwortlich sind. @de
label: té com a menció de responsabilitat relativa a una subcol·lecció @ca
definition: Relaciona una manifestació amb una menció relativa a la identificació dels agents responsables d’una subcol·lecció. @ca
toolkit label: menció de responsabilitat relativa a una subcol·lecció @ca
toolkit definition: Menció relativa a la identificació dels agents responsables d’una subcol·lecció. @ca
label: alasarjan vastuullisuustieto @fi
definition: Liittää manifestaation tietoon, joka liittyy alasarjasta vastuussa olevien toimijoiden identifiointiin. @fi
toolkit label: alasarjan vastuullisuustieto @fi
toolkit definition: Tieto, joka liittyy alasarjasta vastuussa olevien toimijoiden identifiointiin. @fi
toolkit label: ansvarsangivelse knyttet til underserie @no
toolkit definition: Opplysninger knyttet til identifisering av agenter med ansvar for en underserie. @no
label: έχει μνεία ευθύνης σχετική με την υποσειρά @el
definition: Συνδέει μια εκδήλωση με μια μνεία που σχετίζεται με την ταύτιση των φορέων που είναι υπεύθυνοι για μια υποσειρά. @el
toolkit label: μνεία ευθύνης σχετική με την υποσειρά @el
toolkit definition: Μια μνεία που σχετίζεται με την ταύτιση των φορέων που είναι υπεύθυνοι για μια υποσειρά. @el
has element type: 6
label: van alsorozathoz kötődő szerzőségi közlése @hu
definition: Egy megjelenési formát hozzákapcsol egy közléshez, amely kötődik egy alsorozatért felelős ágensek (személyek, családok vagy testületek) azonosításához és megnevezéséhez. @hu
toolkit label: alsorozatra vonatkozó szerzőségi közlés @hu
toolkit definition: Egy közlés, amely ágensek (személyek, családok vagy testületek) azonosítására és megnevezésére vonatkozik, akik/amelyek felelősek egy alsorozatért. @hu
sub property of: has statement of responsibility
has subproperty: has parallel statement of responsibility relating to subseries (Deprecated)
has subproperty: P30120

has statement of responsibility relating to edition
status: Published
definition: Relates a manifestation to a statement of responsibility that is associated with an edition.
type: Property
domain: C10007
lexical alias: statementOfResponsibilityRelatingToEdition.en
instruction number: 2.5.4
toolkit label: statement of responsibility relating to edition
toolkit definition: A statement of responsibility that is associated with an edition.
label: a pour mention de responsabilité relative à une édition @fr
definition: Met une manifestation en relation avec une mention de responsabilité qui est associée à une édition. @fr
toolkit label: mention de responsabilité relative à une édition @fr
toolkit definition: Mention de responsabilité qui est associée à une édition. @fr
toolkit label: declaración de responsabilidad relativa a la edición @es
toolkit definition: Una declaración de responsabilidad que está asociada a una edición. @es
label: har upplagespecifik upphovsuppgift @sv
toolkit label: upplagespecifik upphovsuppgift @sv
toolkit label: verantwoordelijkheidsvermelding gerelateerd aan editie @nl
toolkit definition: Een verantwoordelijkheidsvermelding die geassocieerd is met een editie. @nl
label: có thông tin trách nhiệm liên quan tới ấn bản @vi
definition: Liên kết biểu thị với thông tin liên quan tới nhận dạng các tác nhân có trách nhiệm đối với ấn bản đang được mô tả nhưng không phải tất cả các ấn bản. @vi
toolkit label: thông tin trách nhiệm liên quan tới ấn bản @vi
toolkit definition: Thông tin liên quan tới nhận dạng các tác nhân có trách nhiệm đối với ấn bản đang được mô tả nhưng không phải tất cả các ấn bản. @vi
label: har ophavsangivelse, som relaterer til udgave @da
definition: Relaterer en manifestation til en ophavsangivelse, som er knyttet til en udgave. @da
toolkit label: ophavsangivelse, som relaterer til udgave @da
toolkit definition: Ophavsangivelse, som er knyttet til en udgave. @da
label: hat Verantwortlichkeitsangabe, die sich auf eine Ausgabe bezieht @de
definition: Setzt eine Manifestation in Beziehung zu einer Verantwortlichkeitsangabe, die mit einer Ausgabe in Verbindung steht. @de
toolkit label: Verantwortlichkeitsangabe, die sich auf eine Ausgabe bezieht @de
toolkit definition: Eine Verantwortlichkeitsangabe, die mit einer Ausgabe in Verbindung steht. @de
label: té com a menció de responsabilitat relativa a una edició @ca
definition: Relaciona una manifestació amb una menció de responsabilitat que s’associa amb una edició. @ca
toolkit label: menció de responsabilitat relativa a una edició @ca
toolkit definition: Menció de responsabilitat que s’associa amb una edició. @ca
definition: Liittää manifestaation painokseen liittyvään vastuullisuusmerkintöön. @fi
toolkit label: painokseen liittyvä vastuullisuusmerkintö @fi
toolkit definition: Painokseen liittyvä vastuullisuusmerkintö. @fi
toolkit label: ansvarsangivelse knyttet til utgave @no
toolkit definition: En ansvarsangivelse knyttet til en utgave. @no
label: έχει μνεία ευθύνης σχετική με την έκδοση @el
definition: Συνδέει μια εκδήλωση με μια μνεία που σχετίζεται με την ταύτιση των φορέων που είναι υπεύθυνοι για μια περιγραφόμενη έκδοση αλλά όχι για όλες τις εκδόσεις. @el
toolkit label: μνεία ευθύνης σχετική με την έκδοση @el
toolkit definition: Μια μνεία που σχετίζεται με την ταύτιση των φορέων που είναι υπεύθυνοι για μια περιγραφόμενη έκδοση αλλά όχι για όλες τις εκδόσεις. @el
has element type: 6
label: kiadáshoz kötődő felelősségi közlése a következő: @hu
definition: Egy megjelenési formát hozzákapcsol egy felelősségi közléshez, amely egy kiadáshoz társul. @hu
toolkit label: kiadáshoz kötődő felelősségi közlése: @hu
toolkit definition: Egy felelősségi közlés, amely egy kiadáshoz társul. @hu
sub property of: has statement of responsibility
label: painokseen liittyvä vastuullisuusmerkintö @fi
label: har ansvarsangivelse knyttet til utgave @no
definition: Relaterer en manifestasjon til en ansvarsangivelse knyttet til en utgave. @no
label: heeft verantwoordelijkheidsvermelding gerelateerd aan editie @nl
definition: Relateert een manifestatie aan een verantwoordelijkheidsvermelding die geassocieerd is met een editie. @nl
label: له بيان مسئولية مرتبط بطبعة @ar
definition: يربط بين تجسيدة وبيان مسئولية يرتبط بطبعة. @ar
toolkit label: بيان مسئولية مرتبط بطبعة @ar
toolkit definition: بيان مسئولية يرتبط بطبعة. @ar
label: editsiooniga seotud vastutusandmed @et
definition: Seostab kehastuse vastutusandmetega, mis on seotud editsiooniga. @et
toolkit label: editsiooniga seotud vastutusandmed @et
toolkit definition: Vastutusandmed, mis on seotud editsiooniga. @et
label: ha come formulazione di responsabilità relativa all’edizione @it
definition: Correla una manifestazione a una formulazione di responsabilità associata a un’edizione. @it
toolkit label: formulazione di responsabilità relativa all’edizione @it
toolkit definition: Formulazione di responsabilità associata a un’edizione. @it
label: izdevuma atbildības ziņas @lv
definition: Sasaista manifestāciju ar atbildības ziņām, kas attiecas uz izdevumu. @lv
toolkit label: izdevuma atbildības ziņas @lv
toolkit definition: Atbildības ziņas, kas attiecas uz izdevumu @lv
label: 有和版本有关的责任说明 @zh-hans
definition: 将一种载体表现与和版本有关的一个责任说明关联起来。 @zh-hans
toolkit label: 和版本有关的责任说明 @zh-hans
toolkit definition: 和版本有关的一个责任说明 @zh-hans
label: basıma ilişkin sorumluluk bildirimi ile ilişkilidir @tr
definition: Bir gösterimi, bir basımla ilişkili bir sorumluluk bildirimiyle ilişkilendirir. @tr
toolkit label: basıma ilişkin sorumluluk bildirimi @tr
toolkit definition: Bir basımla bağlantılı olan bir sorumluluk bildirimi. @tr
label: tiene declaración de responsabilidad relativa a la edición @es

has statement of responsibility relating to series
status: Published
definition: Relates a manifestation to a statement of responsibility that is associated with a series.
type: Property
domain: C10007
lexical alias: statementOfResponsibilityRelatingToSeries.en
instruction number: 2.12.6
toolkit label: statement of responsibility relating to series
toolkit definition: A statement of responsibility that is associated with a series.
label: a pour mention de responsabilité relative à une collection @fr
definition: Met une manifestation en relation avec une mention de responsabilité qui est associée à une collection. @fr
toolkit label: mention de responsabilité relative à une collection @fr
toolkit definition: Mention de responsabilité qui est associée à une collection. @fr
toolkit label: declaración de responsabilidad relativa a la serie @es
toolkit definition: Una declaración de responsabilidad que está asociada a una serie. @es
label: har upphovsuppgift till serie @sv
toolkit label: upphovsuppgift till serie @sv
toolkit label: verantwoordelijkheidsvermelding gerelateerd aan reeks @nl
toolkit definition: Een verantwoordelijkheidsvermelding die geassocieerd is met een reeks. @nl
label: có thông tin trách nhiệm liên quan tới tùng thư @vi
definition: Liên kết biểu thị với thông tin liên quan tới nhận dạng các tác nhân có trách nhiệm đối với tùng thư. @vi
toolkit label: thông tin trách nhiệm liên quan tới tùng thư @vi
toolkit definition: Thông tin liên quan tới nhận dạng các tác nhân có trách nhiệm đối với tùng thư. @vi
label: har ophavsangivelse, som relaterer til serie @da
definition: Relaterer en manifestation til en ophavsangivelse, som er knyttet til en serie. @da
toolkit label: ophavsangivelse, som relaterer til serie @da
toolkit definition: Ophavsangivelse, som er knyttet til en serie. @da
label: hat Verantwortlichkeitsangabe, die sich auf eine Reihe bezieht @de
definition: Setzt eine Manifestation in Beziehung zu einer Verantwortlichkeitsangabe, die mit einer Reihe in Verbindung steht. @de
toolkit label: Verantwortlichkeitsangabe, die sich auf eine Reihe bezieht @de
toolkit definition: Eine Verantwortlichkeitsangabe, die mit einer Reihe in Verbindung steht. @de
label: té com a menció de responsabilitat relativa a una col·lecció @ca
definition: Relaciona una manifestació amb una menció de responsabilitat que s’associa amb una col·lecció. @ca
toolkit label: menció de responsabilitat relativa a una col·lecció @ca
toolkit definition: Menció de responsabilitat que s’associa amb una col·lecció. @ca
definition: Liittää manifestaation sarjaan liittyvään vastuullisuusmerkintöön. @fi
toolkit label: sarjan vastuullisuusmerkintö @fi
toolkit definition: Sarjaan liittyvä vastuullisuusmerkintö. @fi
toolkit label: ansvarsangivelse knyttet til serie @no
toolkit definition: En ansvarsangivelse knyttet til en serie. @no
label: έχει μνεία ευθύνης σχετική με τη σειρά @el
definition: Συνδέει μια εκδήλωση με μια μνεία που σχετίζεται με την ταύτιση των φορέων που είναι υπεύθυνοι για μια σειρά. @el
toolkit label: μνεία ευθύνης σχετική με τη σειρά @el
toolkit definition: Μια μνεία που σχετίζεται με την ταύτιση των φορέων που είναι υπεύθυνοι για μια σειρά. @el
has element type: 6
label: sorozathoz kapcsolódó felelősségi közlése a következő: @hu
definition: Egy megjelenési formát hozzákapcsol egy felelősségi közléshez, amely egy sorozathoz társul. @hu
toolkit label: sorozathoz kapcsolódó felelősségi közlése: @hu
toolkit definition: Egy felelősségi közlés, amely egy sorozathoz társul. @hu
sub property of: has statement of responsibility
alternative label: statement of responsibility relating to subseries
alternative label: alasarjan vastuullisuusmerkintö @fi
label: sarjan vastuullisuusmerkintö @fi
label: har ansvarsangivelse knyttet til serie @no
definition: Relaterer en manifestasjon til en ansvarsangivelse knyttet til en serie. @no
alternative label: ansvarsangivelse knyttet til underserie @no
alternative label: mention de responsabilité relative à une sous-collection @fr
label: heeft verantwoordelijkheidsvermelding gerelateerd aan reeks @nl
definition: Relateert een manifestatie aan een verantwoordelijkheidsvermelding die geassocieerd is met een reeks. @nl
label: له بيان مسئولية مرتبط بسلسلة @ar
definition: يربط بين تجسيدة وبيان مسئولية يرتبط بسلسلة. @ar
alternative label: بيان مسئولية مرتبط بسلسلة فرعية @ar
toolkit label: بيان مسئولية مرتبط بسلسلة @ar
toolkit definition: بيان مسئولية يرتبط بسلسلة. @ar
alternative label: menció de responsabilitat relativa a una subcol·lecció @ca
alternative label: ophavsangivelse, som relaterer til underserie @da
label: seeriaga seotud vastutusandmed @et
definition: Seostab kehastuse vastutusandmetega, mis on seotud seeriaga. @et
alternative label: allseeriaga seotud vastutusandmed @et
toolkit label: seeriaga seotud vastutusandmed @et
toolkit definition: Vastutusandmed, mis on seotud seeriaga. @et
alternative label: Verantwortlichkeitsangabe, die sich auf eine Unterreihe bezieht @de
alternative label: alsorozatra vonatkozó párhuzamos felelősségi közlése: @hu
label: ha come formulazione di responsabilità relativa alla serie @it
definition: Correla una manifestazione a una formulazione di responsabilità associata a una serie. @it
toolkit label: formulazione di responsabilità relativa alla serie @it
toolkit definition: Formulazione di responsabilità associata a una serie. @it
label: sērijas atbildības ziņas @lv
definition: Sasaista manifestāciju ar atbildības ziņām, kas attiecas uz sēriju. @lv
toolkit label: sērijas atbildības ziņas @lv
toolkit definition: Atbildības ziņas, kas attiecas uz sēriju. @lv

has statement of responsibility relating to title proper
status: Published
definition: Relates a manifestation to a statement of responsibility that is associated with a title proper.
type: Property
domain: C10007
sub property of: has statement of responsibility
lexical alias: statementOfResponsibilityRelatingToTitleProper.en
instruction number: 2.4.2
toolkit label: statement of responsibility relating to title proper
toolkit definition: A statement of responsibility that is associated with a title proper.
label: a pour mention de responsabilité relative à un titre propre @fr
definition: Met une manifestation en relation avec une mention de responsabilité qui est associée à un titre propre. @fr
toolkit label: mention de responsabilité relative à un titre propre @fr
toolkit definition: Mention de responsabilité qui est associée à un titre propre. @fr
toolkit label: declaración de responsabilidad relativa al título propiamente dicho @es
toolkit definition: Una declaración de responsabilidad que está asociada a un título propiamente dicho. @es
label: har parallell upphovsuppgift som hänför sig till huvudtiteln @sv
toolkit label: parallell upphovsuppgift som hänför sig till huvudtiteln @sv
toolkit label: verantwoordelijkheidsvermelding gerelateerd aan hoofdtitel @nl
toolkit definition: Een verantwoordelijkheidsvermelding die geassocieerd is met de hoofdtitel. @nl
label: có thông tin trách nhiệm liên quan tới nhan đề hợp thức @vi
definition: Liên kết biểu thị với thông tin liên quan tới nhan đề hợp thức của biểu thị có quan hệ với nhận dạng hoặc chức năng của các tác nhân có trách nhiệm về sáng tạo, hoặc đóng góp thực hiện nội dung trí tuệ và nghệ thuật của tác phẩm. @vi
toolkit label: thông tin trách nhiệm liên quan tới nhan đề hợp thức @vi
toolkit definition: Thông tin liên quan tới nhan đề hợp thức của biểu thị có quan hệ với nhận dạng hoặc chức năng của các tác nhân có trách nhiệm về sáng tạo, hoặc đóng góp thực hiện nội dung trí tuệ và nghệ thuật của tác phẩm. @vi
label: har ophavsangivelse, som relaterer til hovedtitel @da
definition: Relaterer en manifestation til en ophavsangivelse, som er knyttet til en hovedtitel. @da
toolkit label: ophavsangivelse, som relaterer til hovedtitel @da
toolkit definition: Ophavsangivelse, som er knyttet til en hovedtitel. @da
label: hat Verantwortlichkeitsangabe, die sich auf einen Haupttitel bezieht @de
definition: Setzt eine Manifestation in Beziehung zu einer Verantwortlichkeitsangabe, die mit einem Haupttitel in Verbindung steht. @de
toolkit label: Verantwortlichkeitsangabe, die sich auf einen Haupttitel bezieht @de
toolkit definition: Eine Verantwortlichkeitsangabe, die mit einem Haupttitel in Verbindung steht. @de
label: té com a menció de responsabilitat relativa a un títol propi @ca
definition: Relaciona una manifestació amb una menció de responsabilitat que s’associa amb un títol propi. @ca
toolkit label: menció de responsabilitat relativa a un títol propi @ca
toolkit definition: Menció de responsabilitat que s’associa amb un títol propi. @ca
definition: Liittää manifestaation päänimekkeeseen liittyvään vastuullisuusmerkintöön. @fi
toolkit label: päänimekkeeseen liittyvä vastuullisuusmerkintö @fi
toolkit definition: Päänimekkeeseen liittyvä vastuullisuusmerkintö. @fi
toolkit label: ansvarsangivelse knyttet til hovedtittel @no
toolkit definition: Opplysninger om ansvar som knyttes til en hovedtittel. @no
label: έχει μνεία ευθύνης σχετική με τον κύριο τίτλο @el
definition: Συνδέει μια εκδήλωση με μια μνεία η οποία συνδέεται με έναν κύριο τίτλο μιας εκδήλωσης που σχετίζεται με την εκδήλωση ή τη λειτουργία των φορέων που είναι υπεύθυνοι για τη δημιουργία του ή για τη συμβολή στην υλοποίηση του πνευματικού ή καλλιτεχνικού περιεχομένου ενός έργου. @el
toolkit label: μνεία ευθύνης σχετική με τον κύριο τίτλο @el
toolkit definition: Μια μνεία η οποία συνδέεται με έναν κύριο τίτλο μιας εκδήλωσης που σχετίζεται με την εκδήλωση ή τη λειτουργία των φορέων που είναι υπεύθυνοι για τη δημιουργία του ή για τη συμβολή στην υλοποίηση του πνευματικού ή καλλιτεχνικού περιεχομένου ενός έργου. @el
has element type: 6
label: főcímhez kapcsolódó felelősségi közlése a következő: @hu
definition: Egy megjelenési formát hozzákapcsol egy felelősségi közléshez, amely egy főcímhez társul. @hu
toolkit label: főcímhez kapcsolódó felelősségi közlése: @hu
toolkit definition: Egy felelősségi közlés, amely egy főcímhez társul. @hu
scope note: A statement of responsibility relating to title proper does not include a statement of responsibility relating to an edition or a series.
scope note: Päänimekkeeseen liittyvään vastuullisuusmerkintöön ei sisälly painoksen tai sarjan vastuullisuusmerkintö. @fi
label: päänimekkeeseen liittyvä vastuullisuusmerkintö @fi
label: har ansvarsangivelse knyttet til hovedtittel @no
definition: Relaterer en manifestasjon til opplysninger om ansvar som knyttes til en hovedtittel. @no
scope note: Opplysninger om ansvar knyttet til hovedtittel inkluderer ikke ansvarsopplysninger som knyttes til en utgave eller en serie. @no
scope note: Une mention de responsabilité relative à un titre propre ne comprend pas une mention de responsabilité relative à une édition ou à une collection. @fr
label: heeft verantwoordelijkheidsvermelding gerelateerd aan hoofdtitel @nl
definition: Relateert een manifestatie aan een verantwoordelijkheidsvermelding die geassocieerd is met de hoofdtitel. @nl
scope note: Een verantwoordelijkheidsvermelding gerelateerd aan de hoofdtitel omvat niet een verantwoordelijkheidsvermelding gerelateerd aan een editie of reeks. @nl
label: له بيان مسئولية مرتبط بالعنوان نفسه @ar
definition: يربط بين تجسيدة وبيان مسئولية يرتبط بالعنوان نفسه. @ar
scope note: بيان المسئولية المرتبط بالعنوان نفسه لا يشمل بيان المسئولة المرتبط بالطبعة أو السلسلة @ar
toolkit label: بيان مسئولية مرتبط بالعنوان نفسه @ar
toolkit definition: بيان مسئولية يرتبط بالعنوان نفسه. @ar
scope note: Una menció de responsabilitat relativa a un títol propi no inclou una menció de responsabilitat relativa a una edició o a una col·lecció. @ca
scope note: Ophavsangivelse vedrørende hovedtitlen, omfatter ikke en ophavsangivelse, som vedrører en udgave eller en serie. @da
label: põhipealkirjaga seotud vastutusandmed @et
definition: Seostab kehastuse vastutusandmetega, mis on seotud põhipealkirjaga. @et
scope note: Põhipealkirjaga seotud vastutusandmed ei hõlma editsiooni või seeriaga seotud vastutusandmeid. @et
toolkit label: põhipealkirjaga seotud vastutusandmed @et
toolkit definition: Vastutusandmed, mis on seotud põhipealkirjaga. @et
scope note: Darunter fallen keine Verantwortlichkeitsangaben, die sich auf eine Ausgabe oder eine Reihe beziehen. @de
scope note: Egy főcímmel kapcsolatos felelősségi közlés nem foglal magában kiadással vagy sorozattal kapcsolatos felelősségi közlést. @hu
label: ha come formulazione di responsabilità relativa al titolo proprio @it
definition: Correla una manifestazione a una formulazione di responsabilità associata a un titolo proprio. @it
scope note: Una formulazione di responsabilità relativa al titolo proprio non comprende la formulazione di responsabilità relativa a un’edizione o a una serie. @it
toolkit label: formulazione di responsabilità relativa al titolo proprio @it
toolkit definition: Formulazione di responsabilità associata a un titolo proprio. @it
label: pamatnosaukuma atbildības ziņas @lv

is also issued as
status: Published
definition: Relates a manifestation to a manifestation that embodies the same expression of a work in a different format.
type: Property
domain: C10007
sub property of: has equivalent manifestation
lexical alias: alsoIssuedAs.en
toolkit label: also issued as
toolkit definition: A manifestation that embodies the same expression of a work in a different format.
label: est publié également comme @fr
definition: Met une manifestation en relation avec une manifestation qui matérialise la même expression d’une œuvre sur un support différent. @fr
toolkit label: publié également comme @fr
toolkit definition: Manifestation qui matérialise la même expression d’une œuvre sur un support différent. @fr
toolkit label: también expedido como @es
toolkit definition: Una manifestación que materializa la misma expresión de una obra en un formato diferente. @es
instruction number: 24.5
toolkit label: ook uitgevaardigd als @nl
toolkit definition: Een manifestatie die dezelfde expressie van een werk verwezenlijkt in een andere vorm. @nl
label: cũng được công bố như là @vi
definition: Liên kết biểu thị với biểu thị thể hiện cùng biểu hiện của tác phẩm dưới định dạng khác. @vi
toolkit label: cũng được công bố như là @vi
toolkit definition: Biểu thị thể hiện cùng biểu hiện của tác phẩm dưới định dạng khác. @vi
label: er også udgivet som @da
definition: Relaterer en manifestation til en manifestation, som indeholder det samme udtryk af et værk i et andet format. @da
toolkit label: også udgivet som @da
toolkit definition: Manifestation, som indeholder det samme udtryk af et værk i et andet format. @da
label: ist auch erschienen als @de
definition: Setzt eine Manifestation in Beziehung zu einer Manifestation, die dieselbe Expression eines Werks in einem anderen Format verkörpert. @de
toolkit label: Erscheint auch als @de
toolkit definition: Eine Manifestation, die dieselbe Expression eines Werks in einem anderen Format verkörpert. @de
label: és també publicat com @ca
definition: Relaciona una manifestació amb una manifestació que materialitza la mateixa expressió d’una obra en un format diferent. @ca
toolkit label: també publicat com @ca
toolkit definition: Manifestació que materialitza la mateixa expressió d’una obra en un format diferent. @ca
definition: Liittää manifestaation manifestaatioon, joka sisältää saman teoksen ekspression kuin toinen manifestaatio. Manifestaatiot ovat eri julkaisumuodoissa. @fi
toolkit label: muu julkaisumuoto @fi
toolkit definition: Manifestaatio, joka sisältää saman teoksen ekspression kuin toinen manifestaatio. Manifestaatiot ovat eri julkaisumuodoissa. @fi
toolkit label: også utgitt som @no
toolkit definition: En manifestasjon som legemliggjør det samme uttrykket av et verk i et annet format. @no
label: εκδίδεται επίσης ως @el
definition: Συνδέει μια εκδήλωση με μια εκδήλωση που ενσωματώνει την ίδια έκφραση ενός έργου σε ένα διαφορετικό μορφότυπο. @el
toolkit label: εκδίδεται επίσης ως @el
toolkit definition: Μια εκδήλωση που ενσωματώνει την ίδια έκφραση ενός έργου σε ένα διαφορετικό μορφότυπο. @el
has element type: 2
label: szintén kiadva a következőként: @hu
definition: Hozzákapcsol egy megjelenési formát egy megjelenési formához, amely egy mű ugyanazon kifejezési formáját testesíti meg eltérő formátumban. @hu
toolkit label: szintén kiadva: @hu
toolkit definition: Egy megjelenési forma, amely egy mű ugyanazon kifejezési formáját testesíti meg eltérő formátumban. @hu
label: muu julkaisumuoto @fi
label: er også utgitt som @no
definition: Relaterer en manifestasjon til en manifestasjon som legemliggjør det samme uttrykket av et verk i et annet format. @no
label: is ook uitgevaardigd als @nl
definition: Relateert een manifestatie aan een manifestatie die dezelfde expressie van een werk verwezenlijkt in een andere vorm. @nl
label: هو صدر أيضًا كـ @ar
definition: يربط بين تجسيدة وتجسيدة تجسد التعبيرة نفسها لعمل في شكل مختلف. @ar
toolkit label: صدر أيضًا كـ @ar
toolkit definition: تجسيدة تجسد التعبيرة نفسها لعمل في شكل مختلف. @ar
label: ilmunud ka kehastusena @et
definition: Seostab kehastuse kehastusega, mis teostab teose sama väljenduse erinevas vormis. @et
toolkit label: ilmunud ka kehastusena @et
toolkit definition: Kehastus, mis teostab teose sama väljenduse erinevas vormis. @et
label: è pubblicata anche come @it
definition: Correla una manifestazione a una manifestazione che materializza la stessa espressione di un'opera in un formato diverso. @it
toolkit label: pubblicata anche come @it
toolkit definition: Manifestazione che materializza la stessa espressione di un'opera in un formato diverso. @it
label: ir izdots arī kā @lv
definition: Sasaista manifestāciju ar manifestāciju, kura realizē to pašu darba izteiksmi citā formātā. @lv
toolkit label: izdots arī kā @lv
toolkit definition: Manifestācija, kura realizē to pašu darba izteiksmi citā formātā. @lv
label: 也作为……发行 @zh-hans
definition: 将一种载体表现与用另一种格式具体化一种作品同一种内容表达的一种载体表现关联起来。 @zh-hans
toolkit label: 也作为……发行 @zh-hans
toolkit definition: 用另一种格式具体化一种作品同一种内容表达的一种载体表现 @zh-hans
label: olarak da piyasaya çıkarılmaktadır @tr
definition: Bir gösterimi, bir eserin aynı ifadesini farklı bir formatta somutlaştırılan bir gösterimle ilişkilendirir. @tr
toolkit label: Olarak da yayınlanan @tr
toolkit definition: Bir eserin aynı anlatımını farklı bir formatta somutlaştıran bir gösterim. @tr
label: es también expedido como @es
definition: Relaciona una manifestación con una manifestación que materializa la misma expresión de una obra en un formato diferente. @es
has subproperty: P30026

has details of layout
status: Published
type: Property
lexical alias: detailsOfLayout.en
definition: Relates a manifestation to details of an arrangement of text, images, tactile notation, or other content in a manifestation.
domain: C10007
instruction number: 3.11.1.4
toolkit label: details of layout
toolkit definition: Details of an arrangement of text, images, tactile notation, or other content in a manifestation.
toolkit label: detalles de diseño @es
toolkit definition: Detalles de una disposición de texto, imágenes, notación táctil u otro contenido en una manifestación. @es
label: har detaljerad information om layout @sv
toolkit label: detaljerad information om layout @sv
toolkit label: details van lay-out @nl
toolkit definition: Details van een rangschikking van tekst, beeld, tactiele notatievormen of andere content in een manifestatie. @nl
label: có chi tiết của sắp đặt @vi
definition: Liên kết biểu thị với chi tiết của sự sắp xếp của văn bản, hình ảnh, ký hiệu xúc giác, v.v..., trong biểu hiện. @vi
toolkit label: chi tiết của sắp đặt @vi
toolkit definition: Chi tiết của sự sắp xếp của văn bản, hình ảnh, ký hiệu xúc giác, v.v..., trong biểu hiện. @vi
label: har detaljer om layout @da
definition: Relaterer en manifestation til detaljer om opstilling af tekst, billeder, taktil notation etc. i en manifestation. @da
toolkit label: detaljer om layout @da
toolkit definition: Detaljer om opstilling af tekst, billeder, taktil notation etc. i en manifestation. @da
label: hat Details zum Layout @de
definition: Setzt eine Manifestation in Beziehung zu den Details zur Anordnung von Text, Bildern, taktiler Notation oder anderem Inhalt in einer Manifestation. @de
toolkit label: Details zum Layout @de
toolkit definition: Details zur Anordnung von Text, Bildern, taktiler Notation oder anderem Inhalt in einer Manifestation. @de
label: té com a particularitats de disposició @ca
definition: Relaciona una manifestació amb les particularitats d’un arranjament de text, imatges, notació tàctil o un altre contingut d’una manifestació. @ca
toolkit label: particularitats de disposició @ca
toolkit definition: Particularitats d’un arranjament de text, imatges, notació tàctil o un altre contingut d’una manifestació. @ca
definition: Liittää manifestaation tarkempiin tietoihin manifestaatioon sisältyvän tekstin, kuvien, taktiilin nuottikirjoituksen tai muun sisällön sommittelusta. @fi
toolkit label: layoutin tarkemmat tiedot @fi
toolkit definition: Tarkemmat tiedot manifestaatioon sisältyvän tekstin, kuvien, taktiilin nuottikirjoituksen tai muun sisällön sommittelusta. @fi
toolkit label: detaljer vedrørende layout @no
toolkit definition: Detaljer vedrørende hvordan tekst, bilder, berøringsnotasjon etc. er ordnet i en manifestasjon. @no
label: έχει λεπτομέρειες της τυπογραφικής διάταξης @el
definition: Συνδέει μια εκδήλωση με τις λεπτομέρειες μιας οργάνωσης του κειμένου, των εικόνων, της απτικής σημειογραφίας κ.λπ. σε μια εκδήλωση. @el
toolkit label: λεπτομέρειες της τυπογραφικής διάταξης @el
toolkit definition: Λεπτομέρειες μιας οργάνωσης του κειμένου, των εικόνων, της απτικής σημειογραφίας κ.λπ. σε μια εκδήλωση. @el
label: a pour particularités d’une disposition @fr
definition: Met une manifestation en relation avec des particularités d’un agencement du texte, des images, de la notation tactile ou de tout autre contenu dans une manifestation. @fr
toolkit label: particularités d’une disposition @fr
toolkit definition: Particularités d’un agencement du texte, des images, de la notation tactile ou de tout autre contenu dans une manifestation. @fr
has element type: 6
label: tördelés részletei a következők: @hu
definition: Hozzákapcsol egy megjelenési formát szöveg, képek, tapintható lejegyzés vagy egyéb tartalom elrendezésének részleteihez egy megjelenési formában. @hu
toolkit label: tördelés részletei: @hu
toolkit definition: Szöveg, képek, tapintható lejegyzés vagy egyéb tartalom elrendezésének részletei egy megjelenési formában. @hu
label: layoutin tarkemmat tiedot @fi
label: har detaljer vedrørende layout @no
definition: Relaterer en manifestasjon til detaljer vedrørende hvordan tekst, bilder, berøringsnotasjon etc. er ordnet i en manifestasjon. @no
label: heeft details van lay-out @nl
definition: Relateert een manifestatie aan details van een rangschikking van tekst, beeld, tactiele notatievormen of andere content in een manifestatie. @nl
label: له تفاصيل عن تصميم طباعي @ar
definition: يربط بين تجسيدة وتفاصيل ترتيب النص، والصورة، والكتابة البارزة، إلخ. في تجسيدة. @ar
toolkit label: تفاصيل عن تصميم طباعي @ar
toolkit definition: تفاصيل ترتيب النص، والصورة، والكتابة البارزة، إلخ. في تجسيدة. @ar
label: küljenduse täpsustus @et
definition: Seostab kehastuse täpsemate andmetega teksti, piltide, taktiilse notatsiooni jms paigutuse kohta kehastuses. @et
toolkit label: küljenduse täpsustus @et
toolkit definition: Täpsemad andmed teksti, piltide, taktiilse notatsiooni jms paigutuse kohta kehastuses. @et
label: ha come particolari relativi al layout @it
definition: Correla una manifestazione ai particolari relativi a una disposizione del testo, immagini, notazione tattile, etc. in una manifestazione. @it
toolkit label: particolari relativi al layout @it
toolkit definition: Particolari relativi a una disposizione del testo, immagini, notazione tattile, etc. in una manifestazione. @it
label: detalizēti par salikumu @lv
definition: Sasaista manifestāciju ar sīkāku informāciju par teksta, attēlu, u.tml. izkārtojumu manifestācijā. @lv
toolkit label: detalizēti par salikumu @lv
toolkit definition: Sīkāka informācija par teksta, attēlu, u.tml. izkārtojumu manifestācijā. @lv
label: 有版式细节 @zh-hans
definition: 将一种载体表现与载体表现中对文本、图像、触摸标记或其他内容的安排的细节关联起来。 @zh-hans
toolkit label: 版式细节 @zh-hans
toolkit definition: 载体表现中对文本、图像、触摸标记或其他内容的安排的细节 @zh-hans
label: düzen ayrıntıları ile ilişkilidir @tr
definition: Bir gösterimi, bir gösterimdeki metin, resimler, dokunsal notasyon veya diğer içeriğin bir düzenlemesinin ayrıntılarıyla ilişkilendirir. @tr
toolkit label: düzenlemenin ayrıntıları @tr
toolkit definition: Bir gösterimdeki metin, resimler, dokunsal notasyon veya diğer içeriğin düzeninin ayrıntıları. @tr
label: tiene detalles de diseño @es
definition: Relaciona una manifestación con detalles de una disposición de texto, imágenes, notación táctil u otro contenido en una manifestación. @es

has extent of manifestation
status: Published
definition: Relates a manifestation to a number and type of unit or subunit of a manifestation.
type: Property
domain: C10007
lexical alias: extentOfManifestation.en
instruction number: 3.4
toolkit label: extent of manifestation
toolkit definition: A number and type of unit or subunit of a manifestation.
label: a pour étendue d’une manifestation @fr
definition: Met une manifestation en relation avec un nombre et type d’unités ou de sous-unités d’une manifestation. @fr
toolkit label: étendue d’une manifestation @fr
toolkit definition: Nombre et type d’unités ou de sous-unités d’une manifestation. @fr
toolkit label: extensión de manifestación @es
toolkit definition: Un número y tipo de unidad o subunidad de una manifestación. @es
label: har omfång @sv
toolkit label: omfång @sv
toolkit label: omvang van manifestatie @nl
toolkit definition: Een aantal en type eenheid of subeenheid van een manifestatie. @nl
label: có quy mô @vi
definition: Liên kết biểu thị với số lượng và loại của đơn vị hoặc tiểu đơn vị của biểu hiện. @vi
toolkit label: quy mô @vi
toolkit definition: Số lượng và loại của đơn vị hoặc tiểu đơn vị của biểu hiện. @vi
label: har omfang af manifestation @da
definition: Relaterer en manifestation til antal og type af enheder eller underenheder, som udgør en manifestation. @da
toolkit label: omfang af manifestation @da
toolkit definition: Antal og type af enheder eller underenheder, som udgør en manifestation. @da
label: hat Umfang einer Manifestation @de
definition: Setzt eine Manifestation in Beziehung zu einer Anzahl und Art der Einheit oder Untereinheit einer Manifestation. @de
toolkit label: Umfang einer Manifestation @de
toolkit definition: Eine Anzahl und Art der Einheit oder Untereinheit einer Manifestation. @de
label: té com a extensió d’una manifestació @ca
definition: Relaciona una manifestació amb un nombre i tipus d’unitat o subunitat d’una manifestació. @ca
toolkit label: extensió d’una manifestació @ca
toolkit definition: Nombre i tipus d’unitat o subunitat d’una manifestació. @ca
definition: Liittää manifestaation manifestaation yksiköiden ja/tai osayksiköiden määrään ja tyyppiin. @fi
toolkit label: manifestaation laajuus @fi
toolkit definition: Manifestaation yksiköiden ja/tai osayksiköiden määrä ja tyyppi. @fi
toolkit label: omfang for manifestasjon @no
toolkit definition: Antall og type enheter eller underenheter som utgjør en manifestasjon. @no
label: έχει έκταση @el
definition: Συνδέει μια εκδήλωση με έναν αριθμό και έναν τύπο της μονάδας ή της υπομονάδας μιας εκδήλωσης. @el
toolkit label: έκταση @el
toolkit definition: Ένας αριθμός και ένας τύπος της μονάδας ή/και της υπομονάδας μιας εκδήλωσης. @el
has element type: 6
label: megjelenési forma terjedelme a következő: @hu
definition: Hozzákapcsol egy megjelenési formát egy megjelenési forma egységének vagy alegységének a számáért és típusáért. @hu
toolkit label: terjedelem @hu
toolkit definition: Egy megjelenési forma egységének vagy alegységének a száma és típusa. @hu
alternative label: extent
label: manifestaation laajuus @fi
label: har omfang for manifestasjon @no
definition: Relaterer en manifestasjon til antall og type enheter eller underenheter som utgjør en manifestasjon. @no
label: heeft omvang van manifestatie @nl
definition: Relateert een manifestatie aan een aantal en type eenheid of subeenheid van een manifestatie. @nl
alternative label: laajuus @fi
label: له امتداد لتجسيدة @ar
definition: يربط بين تجسيدة ورقم ونوع وحدة أو وحدة فرعية لتجسيدة. @ar
toolkit label: امتداد لتجسيدة @ar
toolkit definition: رقم ونوع وحدة أو وحدة فرعية لتجسيدة. @ar
label: kehastuse maht @et
definition: Seostab kehastuse kehastust moodustavate üksuste või alamüksuste arvu ja tüübiga. @et
toolkit label: kehastuse maht @et
toolkit definition: Kehastust moodustavate üksuste või alamüksuste arv ja tüüp. @et
label: ha come estensione della manifestazione @it
definition: Correla una manifestazione a un numero e tipo di unità o sottounità di una manifestazione. @it
toolkit label: estensione della manifestazione @it
toolkit definition: Numero e tipo di unità o sottounità di una manifestazione. @it
label: manifestācijas apjoms @lv
definition: Sasaista manifestāciju ar manifestācijas vienību vai apakšvienību skaitu un veidu. @lv
toolkit label: manifestācijas apjoms @lv
toolkit definition: Manifestācijas vienību vai apakšvienību skaits un veids. @lv
alternative label: امتداد @ar
alternative label: omfang @da
alternative label: Umfang @de
alternative label: extensió @ca
alternative label: 数量 @zh-hans
label: 有载体表现的数量 @zh-hans
definition: 将一种载体表现与一种载体表现的单元或子单元的数量和类型关联起来。 @zh-hans
toolkit label: 载体表现的数量 @zh-hans

has place of distribution
status: Published
definition: Relates a manifestation to a place that is associated with the distribution of a published manifestation.
type: Property
domain: C10007
lexical alias: placeOfDistribution.en
instruction number: 2.9.2
toolkit label: place of distribution
toolkit definition: A place that is associated with the distribution of a published manifestation.
label: a pour lieu de diffusion ou de distribution @fr
definition: Met une manifestation en relation avec un lieu qui est associé à la diffusion ou à la distribution d’une manifestation publiée. @fr
toolkit label: lieu de diffusion ou de distribution @fr
toolkit definition: Lieu qui est associé à la diffusion ou à la distribution d’une manifestation publiée. @fr
toolkit label: lugar de distribución @es
toolkit definition: Un lugar que está asociado con la distribución de una manifestación publicada. @es
label: har distributionsort @sv
toolkit label: distributionsort @sv
toolkit label: plaats van distributie @nl
toolkit definition: Een plaats die geassocieerd is met de distributie van een gepubliceerde manifestatie. @nl
label: có địa điểm phân phối @vi
definition: Liên kết biểu thị với địa điểm liên quan tới phân phối biểu thị dưới hình thái xuất bản. @vi
toolkit label: địa điểm phân phối @vi
toolkit definition: Địa điểm liên quan tới phân phối biểu thị dưới hình thái xuất bản. @vi
label: har distributionssted @da
definition: Relaterer en manifestation til et sted forbundet med distributionen af en publiceret manifestation. @da
toolkit label: distributionssted @da
toolkit definition: Sted forbundet med distributionen af en publiceret manifestation. @da
label: hat Vertriebsort @de
definition: Setzt eine Manifestation in Beziehung zu einem Geografikum, das mit dem Vertrieb einer veröffentlichten Manifestation in Verbindung steht. @de
toolkit label: Vertriebsort @de
toolkit definition: Ein Geografikum, das mit dem Vertrieb einer veröffentlichten Manifestation in Verbindung steht. @de
label: té com a lloc de distribució @ca
definition: Relaciona una manifestació amb un lloc que s’associa amb la distribució d’una manifestació publicada. @ca
toolkit label: lloc de distribució @ca
toolkit definition: Lloc que s’associa amb la distribució d’una manifestació publicada. @ca
definition: Liittää manifestaation paikkaan, joka liittyy julkaistun manifestaation jakeluun. @fi
toolkit label: jakelupaikka @fi
toolkit definition: Paikka, joka liittyy julkaistun manifestaation jakeluun. @fi
toolkit label: distribusjonssted @no
toolkit definition: Et sted som forbindes med distribusjonen av en utgitt manifestasjon. @no
label: έχει τόπο διάθεσης @el
definition: Συνδέει μια εκδήλωση με έναν τόπο που συνδέεται με τη διάθεση μιας εκδήλωσης σε μια δημοσιευμένη μορφή. @el
toolkit label: τόπος διάθεσης @el
toolkit definition: Ένας τόπος που συνδέεται με τη διάθεση μιας εκδήλωσης σε μια δημοσιευμένη μορφή. @el
sub property of: has place of manifestation
has element type: 3
label: terjesztés helye a következő: @hu
definition: Hozzákapcsol egy megjelenési formát egy helyhez, amely egy publikált megjelenési forma terjesztéséhez kapcsolódik. @hu
toolkit label: terjesztés helye: @hu
toolkit definition: Egy hely, amely egy publikált megjelenési forma terjesztéséhez kapcsolódik. @hu
label: jakelupaikka @fi
label: har distribusjonssted @no
definition: Relaterer en manifestasjon til et sted som forbindes med distribusjonen av en utgitt manifestasjon. @no
label: heeft plaats van distributie @nl
definition: Relateert een manifestatie aan een plaats die geassocieerd is met de distributie van een gepubliceerde manifestatie. @nl
label: له مكان توزيع @ar
definition: يربط بين تجسيدة ومكان توزيع تجسيدة منشورة. @ar
toolkit label: مكان توزيع @ar
toolkit definition: مكان توزيع تجسيدة منشورة. @ar
label: levitamiskoht @et
definition: Seostab kehastuse kohaga, mis on seotud avaldatud kehastuse levitamisega. @et
toolkit label: levitamiskoht @et
toolkit definition: Koht, mis on seotud avaldatud kehastuse levitamisega. @et
label: ha come luogo di distribuzione @it
definition: Correla una manifestazione a un luogo associato alla distribuzione di una manifestazione pubblicata. @it
toolkit label: luogo di distribuzione @it
toolkit definition: Luogo associato alla distribuzione di una manifestazione pubblicata. @it
label: izplatīšanas vieta @lv
definition: Sasaista manifestāciju ar vietu, kas saistīta ar publicētās manifestācijas izplatīšanu. @lv
toolkit label: izplatīšanas vieta @lv
toolkit definition: Vieta, kas saistīta ar publicētās manifestācijas izplatīšanu. @lv
label: 有发行地 @zh-hans
definition: 将一种载体表现与和一个出版资源的发行有关的一个地点关联起来。 @zh-hans
toolkit label: 发行地 @zh-hans
toolkit definition: 和一个出版资源的发行有关的一个地点 @zh-hans
label: dağıtım yeri ile ilişkilidir @tr
definition: Bir gösterimi, yayınlanmış bir gösterimin dağıtımıyla ilişkili bir yerle ilişkilendirir. @tr
toolkit label: dağıtım yeri @tr
toolkit definition: Yayımlanmış bir gösterimin dağıtımıyla bağlantılı olan bir yer. @tr
label: tiene lugar de distribución @es

has date of distribution
status: Published
definition: Relates a manifestation to a timespan during which a published manifestation is distributed.
type: Property
domain: C10007
lexical alias: dateOfDistribution.en
instruction number: 2.9.6
toolkit label: date of distribution
toolkit definition: A timespan during which a published manifestation is distributed.
label: a pour date de diffusion ou de distribution @fr
definition: Met une manifestation en relation avec un laps de temps pendant lequel une manifestation publiée est diffusée ou distribuée. @fr
toolkit label: date de diffusion ou de distribution @fr
toolkit definition: Laps de temps pendant lequel une manifestation publiée est diffusée ou distribuée. @fr
toolkit label: fecha de distribución @es
toolkit definition: Un espacio de tiempo durante el cual una manifestación publicada es distribuida. @es
label: har distributionstid @sv
toolkit label: distributionstid @sv
toolkit label: datum van distributie @nl
toolkit definition: Een tijdspanne gedurende waarvan een gepubliceerde manifestatie is gedistribueerd. @nl
label: có ngày phân phối @vi
definition: Liên kết biểu thị với ngày liên quan tới phân phối của biểu thị dưới hình thái xuất bản. @vi
toolkit label: ngày phân phối @vi
toolkit definition: Ngày liên quan tới phân phối của biểu thị dưới hình thái xuất bản. @vi
label: har dato for distribution @da
definition: Relaterer en manifestation til en tidsperiode, hvorunder en publiceret manifestation er distribueret. @da
toolkit label: dato for distribution @da
toolkit definition: Tidsperiode, hvorunder en publiceret manifestation er distribueret. @da
label: hat Vertriebsdatum @de
definition: Setzt eine Manifestation in Beziehung zu einem Zeitraum, in dem eine veröffentlichte Manifestation vertrieben wird. @de
toolkit label: Vertriebsdatum @de
toolkit definition: Ein Zeitraum, in dem eine veröffentlichte Manifestation vertrieben wird. @de
label: té com a data de distribució @ca
definition: Relaciona una manifestació amb un interval de temps durant el qual una manifestació publicada es distribueix. @ca
toolkit label: data de distribució @ca
toolkit definition: Interval de temps durant el qual una manifestació publicada es distribueix. @ca
definition: Liittää manifestaation julkaistun manifestaation jakeluun liittyvään ajanjaksoon. @fi
toolkit label: jakeluaika @fi
toolkit definition: Julkaistun manifestaation jakeluun liittyvä ajanjakso. @fi
toolkit label: tidsrom for distribusjon @no
toolkit definition: Et tidsrom hvor en publisert manifestasjon blir distribuert. @no
label: έχει χρονολογία της διάθεσης @el
definition: Συνδέει μια εκδήλωση με μια χρονολογία που συνδέεται με τη διάθεση μιας εκδήλωσης σε μια δημοσιευμένη μορφή. @el
toolkit label: χρονολογία της διάθεσης @el
toolkit definition: Μια χρονολογία που συνδέεται με τη διάθεση μιας εκδήλωσης σε μια δημοσιευμένη μορφή. @el
sub property of: has date of manifestation
has element type: 3
label: terjesztés időpontja a következő: @hu
definition: Hozzákapcsol egy megjelenési formát egy időtartamhoz, amely alatt egy kiadott megjelenési formát terjesztenek. @hu
toolkit label: terjesztés időpontja: @hu
toolkit definition: Egy időtartam, amely alatt egy kiadott megjelenési formát terjesztenek. @hu
label: jakeluaika @fi
label: har tidsrom for distribusjon @no
definition: Relaterer en manifestasjon til et tidsrom hvor en publisert manifestasjon blir distribuert. @no
label: heeft datum van distributie @nl
definition: Relateert een manifestatie aan een tijdspanne gedurende waarvan een gepubliceerde manifestatie is gedistribueerd. @nl
label: له تاريخ توزيع @ar
definition: يربط بين تجسيدة وفترة زمنية يتم خلالها توزيع تجسيدة منشورة. @ar
toolkit label: تاريخ توزيع @ar
toolkit definition: فترة زمنية يتم خلالها توزيع تجسيدة منشورة. @ar
label: levitamisaeg @et
definition: Seostab kehastuse ajavahemikuga, mille jooksul avaldatud kehastust on levitatud. @et
toolkit label: levitamisaeg @et
toolkit definition: Ajavahemik, mille jooksul avaldatud kehastust on levitatud. @et
label: ha come data di distribuzione @it
definition: Correla una manifestazione a un arco di tempo nel quale una manifestazione pubblicata è distribuita. @it
toolkit label: data di distribuzione @it
toolkit definition: Arco di tempo nel quale una manifestazione pubblicata è distribuita. @it
label: izplatīšanas datējums @lv
definition: Sasaista manifestāciju ar laikposmu, kurā manifestācija tikusi izplatīta publicētā formā. @lv
toolkit label: izplatīšanas datējums @lv
toolkit definition: Laikposms, kurā manifestācija tikusi izplatīta publicētā formā. @lv
label: 有发行日期 @zh-hans
definition: 将一种载体表现与出版的载体表现被发行的时间段关联起来。 @zh-hans
toolkit label: 发行日期 @zh-hans
toolkit definition: 出版的载体表现被发行的时间段 @zh-hans
label: dağıtım tarihi ile ilişkilidir @tr
definition: Bir gösterimi, yayınlanan bir gösterimin dağıtıldığı bir zaman aralığıyla ilişkilendirir. @tr
toolkit label: dağıtım tarihi @tr
toolkit definition: Yayınlanan bir gösterimin dağıtıldığı zaman aralığı. @tr
label: tiene fecha de distribución @es

has distribution statement
status: Published
definition: Relates a manifestation to a statement that identifies a place of distribution, a distributor, or a date of distribution of a published manifestation.
type: Property
domain: C10007
lexical alias: distributionStatement.en
instruction number: 2.9
toolkit label: distribution statement
toolkit definition: A statement that identifies a place of distribution, a distributor, or a date of distribution of a published manifestation.
label: a pour mention de diffusion ou de distribution @fr
definition: Met une manifestation en relation avec une mention qui identifie un lieu de diffusion ou de distribution, un diffuseur ou un distributeur, ou une date de diffusion ou de distribution d’une manifestation publiée. @fr
toolkit label: mention de diffusion ou de distribution @fr
toolkit definition: Mention qui identifie un lieu de diffusion ou de distribution, un diffuseur ou un distributeur, ou une date de diffusion ou de distribution d’une manifestation publiée. @fr
toolkit label: declaración de distribución @es
toolkit definition: Una declaración que identifica un lugar de distribución, un distribuidor o una fecha de distribución de una manifestación publicada. @es
label: har distributionsuppgift @sv
toolkit label: distributionsuppgift @sv
toolkit label: distributievermelding @nl
toolkit definition: Een vermelding die een plaats van distributie, een distributeur of een datum van distributie identificeert van een gepubliceerde manifestatie. @nl
label: có thông tin phân phối @vi
definition: Liên kết biểu thị với thông tin nhận dạng địa điểm hoặc các địa điểm phân phối, nhà phân phối hoặc các nhà phân phối, và ngày hoặc các ngày phân phối của biểu thị dưới hình thái xuất bản. @vi
toolkit label: thông tin phân phối @vi
toolkit definition: Thông tin nhận dạng địa điểm hoặc các địa điểm phân phối, nhà phân phối hoặc các nhà phân phối, và ngày hoặc các ngày phân phối của biểu thị dưới hình thái xuất bản. @vi
label: har distributionsoplysning @da
definition: Relaterer en manifestation til en oplysning, som identificerer distributionssted, distributør og dato for distribution af en publiceret manifestation. @da
toolkit label: distributionsoplysning @da
toolkit definition: Oplysning, som identificerer distributionssted, distributør og dato for distribution af en publiceret manifestation. @da
label: hat Vertriebsangabe @de
definition: Setzt eine Manifestation in Beziehung zu einer Angabe, die einen Vertriebsort, einen Vertrieb oder ein Vertriebsdatum einer veröffentlichten Manifestation identifiziert. @de
toolkit label: Vertriebsangabe @de
toolkit definition: Eine Angabe, die einen Vertriebsort, einen Vertrieb oder ein Vertriebsdatum einer veröffentlichten Manifestation identifiziert. @de
label: té com a menció de distribució @ca
definition: Relaciona una manifestació amb una menció que identifica un lloc de distribució, un distribuïdor o una data de distribució d’una manifestació publicada. @ca
toolkit label: menció de distribució @ca
toolkit definition: Menció que identifica un lloc de distribució, un distribuïdor o una data de distribució d’una manifestació publicada. @ca
definition: Liittää manifestaation merkintöön, joka identifioi julkaistun manifestaation jakelupaikan, jakelijan tai jakeluajan. @fi
toolkit label: jakelumerkintö @fi
toolkit definition: Merkintö, joka identifioi julkaistun manifestaation jakelupaikan, jakelijan tai jakeluajan. @fi
toolkit label: distribusjonsopplysninger @no
toolkit definition: En angivelse som identifiserer et sted for distribusjon, en distributør og en dato for distribusjon av en publisert manifestasjon. @no
label: έχει μνεία διάθεσης @el
definition: Συνδέει μια εκδήλωση με μια μνεία που ταυτίζει έναν τόπο ή τόπους διάθεσης, έναν διαθέτη ή διαθέτες και μια χρονολογία ή χρονολογίες διάθεσης μιας εκδήλωσης σε μια δημοσιευμένη μορφή. @el
toolkit label: μνεία διάθεσης @el
toolkit definition: Μια μνεία που ταυτίζει έναν τόπο ή τόπους διάθεσης, έναν διαθέτη ή διαθέτες και μια χρονολογία ή χρονολογίες διάθεσης μιας εκδήλωσης σε μια δημοσιευμένη μορφή. @el
has element type: 6
label: terjesztési közlése a következő: @hu
definition: Hozzákapcsol egy megjelenési formát egy közléshez, amely azonosítja egy kiadott megjelenési forma terjesztési helyét, terjesztőjét, terjesztési időpontját. @hu
toolkit label: terjesztési közlése: @hu
toolkit definition: Egy közlés, amely azonosítja egy kiadott megjelenési forma terjesztési helyét, terjesztőjét, terjesztési időpontját. @hu
label: jakelumerkintö @fi
label: har distribusjonsopplysninger @no
definition: Relaterer en manifestasjon til en angivelse som identifiserer et sted for distribusjon, en distributør og en dato for distribusjon av en publisert manifestasjon. @no
label: heeft distributievermelding @nl
definition: Relateert een manifestatie aan een vermelding die een plaats van distributie, een distributeur of een datum van distributie identificeert van een gepubliceerde manifestatie. @nl
label: له بيان توزيع @ar
definition: يربط بين تجسيدة وبيان يحدد مكان توزيع، وموزع، وتاريخ توزيع خاص بتجسيدة منشورة. @ar
toolkit label: بيان توزيع @ar
toolkit definition: بيان يحدد مكان توزيع، وموزع، وتاريخ توزيع خاص بتجسيدة منشورة. @ar
label: levitamisandmed @et
definition: Seostab kehastuse andmetega, mis identifitseerivad avaldatud kehastuse levitamiskoha, levitaja ja levitamisaja. @et
toolkit label: levitamisandmed @et
toolkit definition: Andmed, mis identifitseerivad avaldatud kehastuse levitamiskoha, levitaja ja levitamisaja. @et
label: ha come formulazione di distribuzione @it
definition: Correla una manifestazione a una formulazione che identifica il luogo o i luoghi di distribuzione, il distributore o i distributori e la data o le date di distribuzione di una manifestazione pubblicata. @it
toolkit label: formulazione di distribuzione @it
toolkit definition: Formulazione che identifica il luogo o i luoghi di distribuzione, il distributore o i distributori e la data o le date di distribuzione di una manifestazione pubblicata. @it
label: izplatīšanas ziņas @lv
definition: Sasaista manifestāciju ar ziņām, kas norāda manifestācijas publicētās formas izplatīšanas vietu, izplatītāju un izplatīšanas datējumu. @lv
toolkit label: izplatīšanas ziņas @lv
toolkit definition: Ziņas norāda manifestācijas publicētās formas izplatīšanas vietu, izplatītāju un izplatīšanas datējumu. @lv
label: 有发行说明 @zh-hans
definition: 将一种载体表现与标识一种出版载体表现的发行地、发行者或发行日期的一个说明关联起来。 @zh-hans
toolkit label: 发行说明 @zh-hans
toolkit definition: 标识一种出版载体表现的发行地、发行者或发行日期的一个说明 @zh-hans
label: dağıtım bildirimi ile ilişkilidir @tr
definition: Bir gösterimi, yayımlanmış bir gösterimin dağıtım yerini, dağıtıcısını veya dağıtım tarihini tanımlayan bir bildirimle ilişkilendirir. @tr
toolkit label: dağıtım bildirimi @tr
toolkit definition: Yayınlanmış bir gösterimin dağıtım yerini, dağıtıcısını veya dağıtım tarihini tanımlayan bir bildirim. @tr
label: tiene declaración de distribución @es
definition: Relaciona una manifestación con una declaración que identifica un lugar de distribución, un distribuidor o una fecha de distribución de una manifestación publicada. @es

has parallel place of distribution
status: Published
definition: Relates a manifestation to a place of distribution in another language or script.
type: Property
domain: C10007
lexical alias: parallelPlaceOfDistribution.en
instruction number: 2.9.3
toolkit label: parallel place of distribution
toolkit definition: A place of distribution in another language or script.
label: a pour forme parallèle d’un lieu de diffusion ou de distribution @fr
definition: Met une manifestation en relation avec un lieu de diffusion ou de distribution dans une autre langue ou écriture. @fr
toolkit label: forme parallèle d’un lieu de diffusion ou de distribution @fr
toolkit definition: Lieu de diffusion ou de distribution dans une autre langue ou écriture. @fr
toolkit label: lugar de distribución paralelo @es
toolkit definition: Un lugar de distribución en otra lengua o escritura. @es
label: har parallell distributionsort @sv
toolkit label: parallell distributionsort @sv
toolkit label: parallelle plaats van distributie @nl
toolkit definition: Een plaats van distributie in een andere taal of schrift. @nl
label: có địa điểm phân phối song song @vi
definition: Liên kết biểu thị với địa điểm phân phối trong ngôn ngữ hoặc hệ thống viết khác với được ghi trong yếu tố địa điểm phân phối. @vi
toolkit label: địa điểm phân phối song song @vi
toolkit definition: Địa điểm phân phối trong ngôn ngữ hoặc hệ thống viết khác với được ghi trong yếu tố địa điểm phân phối. @vi
label: har parallelt distributionssted @da
definition: Relaterer en manifestation til et distributionssted på et andet sprog eller skriftsystem. @da
toolkit label: parallelt distributionssted @da
toolkit definition: Distributionssted på et andet sprog eller skriftsystem. @da
label: hat parallelen Vertriebsort @de
definition: Setzt eine Manifestation in Beziehung zu einem Vertriebsort in einer anderen Sprache oder einer anderen Schrift. @de
toolkit label: Paralleler Vertriebsort @de
toolkit definition: Ein Vertriebsort in einer anderen Sprache oder einer anderen Schrift. @de
label: té com a lloc paral·lel de distribució @ca
definition: Relaciona una manifestació amb un lloc de distribució en una altra llengua o escriptura. @ca
toolkit label: lloc paral·lel de distribució @ca
toolkit definition: Lloc de distribució en una altra llengua o escriptura. @ca
definition: Liittää manifestaation jakelupaikkaan toisella kielellä ja/tai kirjoitusjärjestelmällä. @fi
toolkit label: rinnakkainen jakelupaikka @fi
toolkit definition: Jakelupaikka toisella kielellä ja/tai kirjoitusjärjestelmällä. @fi
toolkit label: parallelt distribusjonssted @no
toolkit definition: Et distribusjonssted på et annet språk eller i et annet skriftsystem. @no
label: έχει παράλληλο τόπο διάθεσης @el
definition: Συνδέει μια εκδήλωση με έναν τόπο διάθεσης σε μια γλώσσα ή γραφή που διαφέρει από εκείνη με την οποία καταχωρίστηκε στο στοιχείο του τόπου διάθεσης. @el
toolkit label: παράλληλος τόπος διάθεσης @el
toolkit definition: Ένας τόπος διάθεσης σε μια γλώσσα ή γραφή που διαφέρει από εκείνη με την οποία καταχωρίστηκε στο στοιχείο του τόπου διάθεσης. @el
sub property of: has place of distribution
has element type: 3
label: párhuzamos terjesztési helye a következő: @hu
definition: Hozzákapcsol egy megjelenési formát egy kiadási helyhez más nyelven vagy írásrendszerben. @hu
toolkit label: párhuzamos terjesztési helye: @hu
toolkit definition: Kiadási hely más nyelven vagy írásrendszerben. @hu
label: rinnakkainen jakelupaikka @fi
label: har parallelt distribusjonssted @no
definition: Relaterer en manifestasjon til et distribusjonssted på et annet språk eller i et annet skriftsystem. @no
label: heeft parallelle plaats van distributie @nl
definition: Relateert een manifestatie aan een plaats van distributie in een andere taal of schrift. @nl
label: له مكان توزيع موازي @ar
definition: يربط بين تجسيدة ومكان توزيع في لغة أخرى أو نظام آخر للحروف. @ar
toolkit label: مكان توزيع موازي @ar
toolkit definition: مكان توزيع في لغة أخرى أو نظام آخر للحروف. @ar
label: levitamiskoha rööpandmed @et
definition: Seostab kehastuse levitamiskohaga teises keeles või kirjasüsteemis. @et
toolkit label: levitamiskoha rööpandmed @et
toolkit definition: Levitamiskoht teises keeles või kirjasüsteemis. @et
label: ha come luogo di distribuzione parallelo @it
definition: Correla una manifestazione a un luogo di distribuzione, in una lingua o scrittura diversa. @it
toolkit label: luogo di distribuzione parallelo @it
toolkit definition: Luogo di distribuzione in una lingua o scrittura diversa. @it
label: paralēlā izplatīšanas vieta @lv
definition: Sasaista manifestāciju ar izplatīšanas vietu citā valodā vai rakstībā. @lv
toolkit label: paralēlā izplatīšanas vieta @lv
toolkit definition: Izplatīšanas vieta citā valodā vai rakstībā. @lv
label: 有并列发行地 @zh-hans
definition: 将一种载体表现与用另一种语言或文字的出版地关联起来。 @zh-hans
toolkit label: 并列发行地 @zh-hans
toolkit definition: 用另一种语言或文字的出版地 @zh-hans
label: paralel dağıtım yeri ile ilişkilidir @tr
definition: Bir gösterimi, başka bir dil veya alfabedeki dağıtım yeri ile ilişkilendirir. @tr
toolkit label: paralel dağıtım yeri @tr
toolkit definition: Başka bir dil veya yazıda dağıtım yeri. @tr
label: tiene un lugar de distribución paralelo @es

has name of distributor
status: Published
definition: Relates a manifestation to a nomen that is a name of an agent who is responsible for distributing a published manifestation.
type: Property
domain: C10007
lexical alias: nameOfDistributor.en
instruction number: 2.9.4
toolkit label: name of distributor
toolkit definition: A nomen that is a name of an agent who is responsible for distributing a published manifestation.
label: a pour nom de diffuseur ou de distributeur @fr
definition: Met une manifestation en relation avec un nomen qui est un nom d’un agent responsable de la diffusion ou de la distribution d’une manifestation publiée. @fr
toolkit label: nom de diffuseur ou de distributeur @fr
toolkit definition: Nomen qui est un nom d’un agent responsable de la diffusion ou de la distribution d’une manifestation publiée. @fr
toolkit label: nombre de distribuidor @es
toolkit definition: Un nomen que es el nombre de un agente que es responsable de distribuir una manifestación publicada. @es
label: har distributörsnamn @sv
toolkit label: distributörsnamn @sv
toolkit label: naam van distributeur @nl
toolkit definition: Een nomen dat is een naam van een actor die verantwoordelijk is voor de distributie van een gepubliceerde manifestatie. @nl
label: có tên nhà phân phối @vi
definition: Liên kết biểu thị với tên của tác nhân có trách nhiệm về phân phối biểu thị dưới hình thái xuất bản. @vi
toolkit label: tên nhà phân phối @vi
toolkit definition: Tên của tác nhân có trách nhiệm về phân phối biểu thị dưới hình thái xuất bản. @vi
label: har navn på distributør @da
definition: Relaterer en manifestation til et navn på en agent, som er ansvarlig for distribution af en publiceret manifestation. @da
toolkit label: navn på distributør @da
toolkit definition: Navn på en agent, som er ansvarlig for distribution af en publiceret manifestation. @da
label: hat Vertriebsnamen @de
definition: Setzt eine Manifestation in Beziehung zum Namen eines Akteurs, der für den Vertrieb einer veröffentlichten Manifestation verantwortlich ist. @de
toolkit label: Vertriebsname @de
toolkit definition: Ein Name eines Akteurs, der für den Vertrieb einer veröffentlichten Manifestation verantwortlich ist. @de
label: té com a nom de distribuïdor @ca
definition: Relaciona una manifestació amb un nomen que és un nom d’un agent que és responsable de la distribució d’una manifestació publicada. @ca
toolkit label: nom de distribuïdor @ca
toolkit definition: Nomen que és un nom d’un agent que és responsable de la distribució d’una manifestació publicada. @ca
definition: Liittää manifestaation nomeniin, joka on julkaistun aineiston jakelemisesta vastuussa olevan toimijan nimi. @fi
toolkit label: jakelijan nimi @fi
toolkit definition: Nomen, joka on julkaistun aineiston jakelemisesta vastuussa olevan toimijan nimi. @fi
toolkit definition: Et navn på en agent som er ansvarlig for distribusjon av en publisert manifestasjon. @no
label: έχει όνομα διαθέτη @el
definition: Συνδέει μια εκδήλωση με ένα όνομα ενός φορέα υπεύθυνου για τη διάθεση μιας εκδήλωσης σε μια δημοσιευμένη μορφή. @el
toolkit label: όνομα διαθέτη @el
toolkit definition: Ένα όνομα ενός φορέα υπεύθυνου για τη διάθεση μιας εκδήλωσης σε μια δημοσιευμένη μορφή. @el
sub property of: has name of agent of manifestation
alternative label: distributor's name
has element type: 3
label: terjesztő neve a következő: @hu
definition: Hozzákapcsol egy megjelenési formát egy nomenhez, egy ágens nevéhez, amely felelős egy kiadott megjelenési forma terjesztéséért. @hu
toolkit label: terjesztő neve: @hu
toolkit definition: Egy nomen, egy ágens neve, amely felelős egy kiadott megjelenési forma terjesztéséért. @hu
label: jakelijan nimi @fi
definition: Relaterer en manifestasjon til et navn på en agent som er ansvarlig for distribusjon av en publisert manifestasjon. @no
alternative label: distributørens navn @no
label: heeft naam van distributeur @nl
definition: Relateert een manifestatie aan een nomen dat is een naam van een actor die verantwoordelijk is voor de distributie van een gepubliceerde manifestatie. @nl
label: له اسم موزع @ar
definition: يربط بين تجسيدة واسم وكيل مسئول عن توزيع تجسيدة منشورة. @ar
alternative label: اسم موزع @ar
toolkit label: اسم موزع @ar
toolkit definition: اسم وكيل مسئول عن توزيع تجسيدة منشورة. @ar
alternative label: distributørs navn @da
label: levitaja nimi @et
definition: Seostab kehastuse avaldatud kehastuse levitamise eest vastutava tegija nimega. @et
toolkit label: levitaja nimi @et
toolkit definition: Avaldatud kehastuse levitamise eest vastutava tegija nimi. @et
alternative label: terjesztője neve: @hu
label: ha come nome del distributore @it
definition: Correla una manifestazione a un nome di un agente responsabile della distribuzione di una manifestazione pubblicata. @it
toolkit label: nome del distributore @it
toolkit definition: Nome di un agente responsabile della distribuzione di una manifestazione pubblicata. @it
label: izplatītāja vārds/nosaukums @lv
definition: Sasaista manifestāciju ar nomenu, kas ir vārds/nosaukums aģentam, kurš ir atbildīgs par publicētas manifestācijas izplatīšanu. @lv
toolkit label: izplatītāja vārds/nosaukums @lv
toolkit definition: Vārds/nosaukums aģentam, kurš ir atbildīgs par publicētas manifestācijas izplatīšanu. @lv
alternative label: 发行者名称 @zh-hans
label: 有发行者名称 @zh-hans
definition: 将一种载体表现与作为负责一种出版载体表现的发行的一个行为者的名称的一个命名关联起来。 @zh-hans
toolkit label: 发行者名称 @zh-hans
toolkit definition: 作为负责一种出版载体表现的发行的一个行为者的名称的一个命名 @zh-hans
alternative label: dağıtıcının adı @tr

has cartographic data type
status: Published
type: Property
lexical alias: cartographicDataType.en
definition: Relates a manifestation to a machine-readable representation of geospatial features.
domain: C10007
toolkit label: cartographic data type
toolkit definition: A machine-readable representation of geospatial features.
instruction number: 3.19.8.5
toolkit label: cartografisch datatype @nl
toolkit definition: Een machine-leesbare weergave van geospatiale kenmerken. @nl
label: có loại dữ liệu bản đồ @vi
definition: Liên kết biểu thị với trình bày máy đọc được của địa vật địa không gian. @vi
toolkit label: loại dữ liệu bản đồ @vi
toolkit definition: Trình bày máy đọc được của địa vật địa không gian. @vi
label: har kartografisk datatype @da
definition: Relaterer en manifestation til en maskinlæsbar repræsentation af geoobjekter. @da
toolkit label: kartografisk datatype @da
toolkit definition: Maskinlæsbar repræsentation af geoobjekter. @da
label: hat kartografischen Datentyp @de
definition: Setzt eine Manifestation in Beziehung zu einer maschinenlesbaren Darstellung von Geodaten. @de
toolkit label: Kartografischer Datentyp @de
toolkit definition: Eine maschinenlesbare Darstellung von Geodaten. @de
label: té com a tipus de dades cartogràfiques @ca
definition: Relaciona una manifestació amb una representació llegible per màquina de les característiques geoespacials. @ca
toolkit label: tipus de dades cartogràfiques @ca
toolkit definition: Representació llegible per màquina de les característiques geoespacials. @ca
definition: Liittää manifestaation maantieteellisten ominaisuuksien konelukuiseen esitykseen. @fi
toolkit label: kartografinen tietotyyppi @fi
toolkit definition: Maantieteellisten ominaisuuksien konelukuinen esitys. @fi
toolkit label: type kartografiske data @no
toolkit definition: En maskinlesbar framstilling av geospatiale elementer. @no
label: έχει τύπο χαρτογραφικών δεδομένων @el
definition: Συνδέει μια εκδήλωση με μια μηχαναγνώσιμη αναπαράσταση γεωχωρικών χαρακτηριστικών. @el
toolkit label: τύπος χαρτογραφικών δεδομένων @el
toolkit definition: Μια μηχαναγνώσιμη αναπαράσταση γεωχωρικών χαρακτηριστικών. @el
label: a pour type de données cartographiques @fr
definition: Met une manifestation en relation avec une représentation lisible par machine de caractéristiques géospatiales. @fr
toolkit label: type de données cartographiques @fr
toolkit definition: Représentation lisible par machine de caractéristiques géospatiales. @fr
has element type: 4
label: kartográfiai adattípusa a következő: @hu
definition: Hozzákapcsol egy megjelenési formát térinformatikai jellemzők géppel olvasható ábrázolásához. @hu
toolkit label: kartográfiai adattípusa: @hu
toolkit definition: Térinformatikai jellemzők géppel olvasható ábrázolása. @hu
label: kartografinen tietotyyppi @fi
label: har type kartografiske data @no
definition: Relaterer en manifestasjon til en maskinlesbar framstilling av geospatiale elementer. @no
label: heeft cartografisch datatype @nl
definition: Relateert een manifestatie aan een machine-leesbare weergave van geospatiale kenmerken. @nl
label: له نوع بيانات خرائطية @ar
definition: يربط بين تجسيدة وتمثيل مقروء آليًا لملامح جغرافية مكانية. @ar
toolkit label: نوع بيانات خرائطية @ar
toolkit definition: تمثيل مقروء آليًا لملامح جغرافية مكانية. @ar
label: kartograafiaandmete tüüp @et
definition: Seostab kehastuse georuumiliste andmete masinloetava esitusega. @et
toolkit label: kartograafiaandmete tüüp @et
toolkit definition: Georuumiliste andmete masinloetav esitus. @et
label: ha come tipo di dati cartografici @it
definition: Correla una manifestazione a una rappresentazione delle caratteristiche geospaziali in formato leggibile dalla macchina. @it
toolkit label: tipo di dati cartografici @it
toolkit definition: Rappresentazione delle caratteristiche geospaziali in formato leggibile dalla macchina. @it
label: kartogrāfisko datu veids @lv
definition: Sasaista manifestāciju ar ģeotelpisko funkciju mašīnlasāmu attēlojumu. @lv
toolkit label: kartogrāfisko datu veids @lv
toolkit definition: Ģeotelpisko funkciju mašīnlasāms attēlojums. @lv
sub property of: has digital representation of cartographic content
label: 有地图数据类型 @zh-hans
definition: 将一种载体表现与地理空间特征的机器可读表现关联起来。 @zh-hans
toolkit label: 地图数据类型 @zh-hans
toolkit definition: 地理空间特征的机器可读表现 @zh-hans
label: kartografik veri türü ile ilişkilidir @tr
definition: Bir gösterimi jeo-uzamsal özelliklerin makine tarafından okunabilen bir temsiliyle ilişkilendirir. @tr
toolkit label: kartografik veri türü @tr
toolkit definition: Jeo-uzamsal özelliklerin makine tarafından okunabilir bir temsili. @tr
label: tiene tipo de datos cartográficos @es
definition: Relaciona una manifestación con una representación legible por máquina de características geoespaciales. @es
toolkit label: tipo de datos cartográficos @es
toolkit definition: Una representación legible por máquina de características geoespaciales. @es
has subproperty: P30261

has details of cartographic data type
status: Published
type: Property
lexical alias: detailsOfCartographicDataType.en
definition: Relates a manifestation to details of a machine-readable representation of geospatial features.
domain: C10007
toolkit label: details of cartographic data type
toolkit definition: Details of a machine-readable representation of geospatial features.
instruction number: 3.19.8.5.4
toolkit label: details van cartografisch datatype @nl
toolkit definition: Details van een machine-leesbare weergave van geospatiale kenmerken. @nl
label: có chi tiết của loại dữ liệu bản đồ @vi
definition: Liên kết biểu thị với chi tiết của trình bày máy đọc được của địa vật địa không gian. @vi
toolkit label: chi tiết của loại dữ liệu bản đồ @vi
toolkit definition: Chi tiết của trình bày máy đọc được của địa vật địa không gian. @vi
label: har detaljer om kartografisk datatype @da
definition: Relaterer en manifestation til detaljer om en maskinlæsbar repræsentation af geoobjekter. @da
toolkit label: detaljer om kartografisk datatype @da
toolkit definition: Detaljer om en maskinlæsbar repræsentation af geoobjekter. @da
label: hat Details zum kartografischen Datentyp @de
definition: Setzt eine Manifestation in Beziehung zu den Details zu einer maschinenlesbaren Darstellung von Geodaten. @de
toolkit label: Details zum kartografischen Datentyp @de
toolkit definition: Details zu einer maschinenlesbaren Darstellung von Geodaten. @de
label: té com a particularitats de tipus de dades cartogràfiques @ca
definition: Relaciona una manifestació amb les particularitats d’una representació llegible per màquina de les característiques geoespacials. @ca
toolkit label: particularitats de tipus de dades cartogràfiques @ca
toolkit definition: Particularitats d’una representació llegible per màquina de les característiques geoespacials. @ca
definition: Liittää manifestaation tarkempiin tietoihin maantieteellisten ominaisuuksien konelukuisesta esityksestä. @fi
toolkit label: kartografisen tietotyypin tarkemmat tiedot @fi
toolkit definition: Tarkemmat tiedot maantieteellisten ominaisuuksien konelukuisesta esityksestä. @fi
toolkit label: detaljer vedrørende type kartografiske data @no
toolkit definition: Detaljer vedrørende en maskinlesbar framstilling av geospatiale elementer. @no
label: έχει λεπτομέρειες του τύπου χαρτογραφικών δεδομένων @el
definition: Συνδέει μια εκδήλωση με τις λεπτομέρειες μιας μηχαναγνώσιμης αναπαράστασης γεωχωρικών χαρακτηριστικών. @el
toolkit label: λεπτομέρειες του τύπου των χαρτογραφικών δεδομένων @el
toolkit definition: Λεπτομέρειες μιας μηχαναγνώσιμης αναπαράστασης γεωχωρικών χαρακτηριστικών. @el
label: a pour particularités d’un type de données cartographiques @fr
definition: Met une manifestation en relation avec des particularités d’une représentation lisible par machine de caractéristiques géospatiales. @fr
toolkit label: particularités d’un type de données cartographiques @fr
toolkit definition: Particularités d’une représentation lisible par machine de caractéristiques géospatiales. @fr
has element type: 6
label: kartográfiai adattípus részletei következők: @hu
definition: Hozzákapcsol egy megjelenési formát térinformatikai jellemzők géppel olvasható ábrázolásának részleteihez. @hu
toolkit label: kartográfiai adattípus részletei: @hu
toolkit definition: Térinformatikai jellemzők géppel olvasható ábrázolásának részletei. @hu
label: kartografisen tietotyypin tarkemmat tiedot @fi
label: har detaljer vedrørende type kartografiske data @no
definition: Relaterer en manifestasjon til detaljer vedrørende en maskinlesbar framstilling av geospatiale elementer. @no
label: heeft details van cartografisch datatype @nl
definition: Relateert een manifestatie aan details van een machine-leesbare weergave van geospatiale kenmerken. @nl
label: له تفاصيل نوع بيانات خرائطية @ar
definition: يربط بين تجسيدة وتفاصيل تمثيل مقروء آليًا لملامح جغرافية مكانية. @ar
toolkit label: تفاصيل نوع بيانات خرائطية @ar
toolkit definition: تفاصيل تمثيل مقروء آليًا لملامح جغرافية مكانية. @ar
label: kartograafiaandmete tüübi täpsustus @et
definition: Seostab kehastuse täpsemate andmetega georuumiliste andmete masinloetava esituse kohta. @et
toolkit label: kartograafiaandmete tüübi täpsustus @et
toolkit definition: Täpsemad andmed georuumiliste andmete masinloetava esituse kohta. @et
label: ha come particolari relativi al tipo di dati cartografici @it
definition: Correla una manifestazione ai particolari relativi a una rappresentazione di caratteristiche geospaziali in formato leggibile dalla macchina. @it
toolkit label: particolari relativi al tipo di dati cartografici @it
toolkit definition: Particolari relativi a una rappresentazione di caratteristiche geospaziali in formato leggibile dalla macchina. @it
label: detalizēti par kartogrāfisko datu veidu @lv
definition: Sasaista manifestāciju ar sīkāku informāciju par mašīnlasāmu ģeotelpisko parametru attēlošanu. @lv
toolkit label: detalizēti par kartogrāfisko datu veidu @lv
toolkit definition: Sīkāka informācija par mašīnlasāmu ģeotelpisko parametru attēlošanu. @lv
label: 有地理数据类型的细节 @zh-hans
definition: 将一种载体表现与地理空间特征的机器可读表现的细节关联起来。 @zh-hans
toolkit label: 地理数据类型的细节 @zh-hans
toolkit definition: 地理空间特征的机器可读表现的细节 @zh-hans
label: kartografik veri türünün ayrıntıları ile ilişkilidir @tr
definition: Bir gösterimi, jeo-uzamsal özelliklerin makine tarafından okunabilen bir temsilinin ayrıntılarıyla ilişkilendirir. @tr
toolkit label: kartografik veri türünün ayrıntıları @tr
toolkit definition: Jeo-uzamsal özelliklerin makine tarafından okunabilir temsilinin ayrıntıları. @tr
label: tiene detalles del tipo de datos cartográficos @es
definition: Relaciona una manifestación con detalles de una representación legible por máquina de características geoespaciales. @es
toolkit label: detalles del tipo de datos cartográficos @es
toolkit definition: Detalles de una representación legible por máquina de características geoespaciales. @es
has subproperty: P30262

has digital representation of cartographic content
status: Published
definition: Relates a manifestation to a set of technical details relating to the encoding of geospatial information in a manifestation.
type: Property
domain: C10007
sub property of: has digital file characteristic
lexical alias: digitalRepresentationOfCartographicContent.en
instruction number: 3.19.8
toolkit label: digital representation of cartographic content
toolkit definition: A set of technical details relating to the encoding of geospatial information in a manifestation.
label: a pour représentation numérique de contenu cartographique @fr
definition: Met une manifestation en relation avec un ensemble de détails techniques relatif à l’encodage de l’information géospatiale dans une manifestation. @fr
toolkit label: représentation numérique de contenu cartographique @fr
toolkit definition: Ensemble de détails techniques relatif à l’encodage de l’information géospatiale dans une manifestation. @fr
toolkit label: representación digital del contenido cartográfico @es
toolkit definition: Un conjunto de detalles técnicos relacionados con la codificación de información geoespacial en una manifestación. @es
toolkit label: digitale representatie van cartografische content @nl
toolkit definition: Een verzameling technische details gerelateerd aan de codering van geospatiale informatie in een manifestatie. @nl
label: có biểu diễn số của nội dung bản đồ @vi
definition: Liên kết biểu thị với chuỗi chi tiết kỹ thuật liên quan tới ghi mã của thông tin địa không gian trong biểu thị. @vi
toolkit label: biểu diễn số của nội dung bản đồ @vi
toolkit definition: Chuỗi chi tiết kỹ thuật liên quan tới ghi mã của thông tin địa không gian trong biểu thị. @vi
label: har digital repræsentation af kartografisk indhold @da
definition: Relaterer en manifestation til et sæt af tekniske detaljer, som relaterer til kodning af geoinformation i en kartografisk manifestation. @da
toolkit label: digital repræsentation af kartografisk indhold @da
toolkit definition: Sæt af tekniske detaljer, som relaterer til kodning af geoinformation i en kartografisk manifestation. @da
label: hat digitale Darstellung von kartografischem Inhalt @de
definition: Setzt eine Manifestation in Beziehung zu einem Satz von technischen Angaben, die sich auf die Kodierung von Geoinformationen in einer Manifestation beziehen. @de
toolkit label: Digitale Darstellung von kartografischem Inhalt @de
toolkit definition: Ein Satz von technischen Angaben, die sich auf die Kodierung von Geoinformationen in einer Manifestation beziehen. @de
label: té com a representació digital de contingut cartogràfic @ca
definition: Relaciona una manifestació amb un conjunt de dades tècniques relatives a la codificació de la informació geoespacial d’una manifestació. @ca
toolkit label: representació digital de contingut cartogràfic @ca
toolkit definition: Conjunt de dades tècniques relatives a la codificació de la informació geoespacial d’una manifestació. @ca
definition: Liittää manifestaation manifestaation maantieteellisen paikkatiedon koodaamisen tekniseen tietoon. @fi
toolkit label: kartografisen sisällön digitaalinen esitysmuoto @fi
toolkit definition: Manifestaation maantieteellisen paikkatiedon koodaamisen tekninen tieto. @fi
toolkit label: digital representasjon av kartografisk innhold @no
toolkit definition: Et sett tekniske detaljer knyttet til kodingen av geospatial informasjon i en manifestasjon. @no
label: έχει ψηφιακή αναπαράσταση του χαρτογραφικού περιεχομένου @el
definition: Συνδέει μια εκδήλωση με ένα σύνολο από τεχνικές λεπτομέρειες που σχετίζονται με την κωδικοποίηση των γεωχωρικών πληροφοριών σε μια εκδήλωση. @el
toolkit label: ψηφιακή αναπαράσταση του χαρτογραφικού περιεχομένου @el
toolkit definition: Ένα σύνολο από τεχνικές λεπτομέρειες που σχετίζονται με την κωδικοποίηση των γεωχωρικών πληροφοριών σε μια εκδήλωση. @el
has element type: 4
label: kartográfiai tartalom digitális ábrázolása a következő: @hu
definition: Hozzákapcsol egy megjelenési formát technikai részletek egy halmazához, amely kapcsolódik a térinformatikai információk kódolásához egy megjelenési formában. @hu
toolkit label: kartográfiai tartalom digitális ábrázolása: @hu
toolkit definition: Technikai részletek egy halmaza, amely kapcsolódik a térinformatikai információk kódolásához egy megjelenési formában @hu
label: kartografisen sisällön digitaalinen esitysmuoto @fi
label: har digital representasjon av kartografisk innhold @no
definition: Relaterer en manifestasjon til et sett tekniske detaljer knyttet til kodingen av geospatial informasjon i en manifestasjon. @no
label: heeft digitale representatie van cartografische content @nl
definition: Relateert een manifestatie aan een verzameling technische details gerelateerd aan de codering van geospatiale informatie in een manifestatie. @nl
label: له تمثيل رقمي للمحتوى الجغرافي @ar
definition: يربط بين تجسيدة ومجموعة تفاصيل فنية مرتبطة بمعلومات التكويد الجغرافي في تجسيدة. @ar
toolkit label: تمثيل رقمي للمحتوى الجغرافي @ar
toolkit definition: مجموعة تفاصيل فنية مرتبطة بمعلومات التكويد الجغرافي في تجسيدة. @ar
label: kartograafilise sisu digitaalne esitusviis @et
definition: Seostab kehastuse kehastuses sisalduva georuumilise info kodeeringu tehniliste andmetega. @et
toolkit label: kartograafilise sisu digitaalne esitusviis @et
toolkit definition: Kehastuses sisalduva georuumilise info kodeeringu tehnilised andmed. @et
label: ha come rappresentazione digitale del contenuto cartografico @it
definition: Correla una manifestazione a un insieme di particolari tecnici relativi alla codifica delle informazioni geospaziali in una manifestazione cartografica. @it
toolkit label: rappresentazione digitale del contenuto cartografico @it
toolkit definition: Insieme di particolari tecnici relativi alla codifica delle informazioni geospaziali in una manifestazione cartografica. @it
label: kartogrāfiskā satura digitālais attēlojums @lv
definition: Sasaista manifestāciju ar tehnisku detaļu kopumu, kas saistītas ar ģeotelpiskās informācijas kodējumu manifestācijā. @lv
toolkit label: kartogrāfiskā satura digitālais attēlojums @lv
toolkit definition: Ar ģeotelpiskās informācijas kodējumu saistītu tehnisku detaļu kopums manifestācijā. @lv
label: 有地图内容的数字表现 @zh-hans
definition: 将一种载体表现与和载体表现中地理空间信息编码相关的技术细节的集合关联起来。 @zh-hans
toolkit label: 地图内容的数字表现 @zh-hans
toolkit definition: 和载体表现中地理空间信息编码相关的技术细节的集合 @zh-hans
label: kartografik içeriğin dijital temsili ile ilişkilidir @tr
definition: Bir gösterimi, bir gösterimdeki coğrafi bilginin kodlanmasına ilişkin bir dizi teknik ayrıntıyla ilişkilendirir. @tr
toolkit label: kartografik içeriğin dijital temsili @tr
toolkit definition: Bir gösterimde coğrafi bilginin kodlanmasına ilişkin teknik ayrıntıların kümesi. @tr
label: tiene representación digital del contenido cartográfico @es
definition: Relaciona una manifestación con un conjunto de detalles técnicos relacionados con la codificación de información geoespacial en una manifestación. @es
has subproperty: has cartographic data type

has title of series
status: Published
definition: Relates a manifestation to a nomen that is a title that identifies a series to which a manifestation belongs.
type: Property
domain: C10007
lexical alias: titleOfSeries.en
instruction number: 2.12.2
toolkit label: title of series
toolkit definition: A nomen that is a title that identifies a series to which a manifestation belongs.
label: a pour titre de collection @fr
definition: Met une manifestation en relation avec un nomen qui est un titre qui identifie une collection à laquelle appartient une manifestation. @fr
toolkit label: titre de collection @fr
toolkit definition: Nomen qui est un titre qui identifie une collection à laquelle appartient une manifestation. @fr
toolkit label: título de serie @es
toolkit definition: Un nomen que es un título que identifica una serie a la que pertenece una manifestación. @es
label: har huvudtitel till serie @sv
toolkit label: huvudtitel till serie @sv
toolkit label: hoofdtitel van reeks @nl
toolkit definition: Een nomen dat is een titel die een reeks identificeert waartoe een manifestatie behoort. @nl
label: có nhan đề hợp thức của tùng thư @vi
definition: Liên kết biểu thị với tên của tùng thư xuất hiện trên biểu thị của phần của tùng thư. @vi
toolkit label: nhan đề hợp thức của tùng thư @vi
toolkit definition: Tên của tùng thư xuất hiện trên biểu thị của phần của tùng thư. @vi
label: har titel på serie @da
definition: Relaterer en manifestation til en titel, som identificerer en serie, hvortil en manifestation tilhører. @da
toolkit label: titel på serie @da
toolkit definition: Titel, som identificerer en serie, hvortil en manifestation tilhører. @da
label: hat Titel einer Reihe @de
definition: Setzt eine Manifestation in Beziehung zu einem Titel, der eine Reihe/Unterreihe identifiziert, zu der eine Manifestation gehört. @de
toolkit label: Titel einer Reihe @de
toolkit definition: Ein Titel, der eine Reihe identifiziert, zu der eine Manifestation gehört. @de
label: té com a títol de col·lecció @ca
definition: Relaciona una manifestació amb un nomen que és un títol que identifica una col·lecció a la qual pertany una manifestació. @ca
toolkit label: títol de col·lecció @ca
toolkit definition: Nomen que és un títol que identifica una col·lecció a la qual pertany una manifestació. @ca
definition: Liittää manifestaation nomeniin, joka on nimeke, joka ilmaisee, mihin sarjaan manifestaatio kuuluu. @fi
toolkit label: sarjan nimeke @fi
toolkit definition: Nomen, joka on nimeke, joka ilmaisee, mihin sarjaan manifestaatio kuuluu. @fi
toolkit label: serietittel @no
toolkit definition: En tittel som identifiserer en serie som manifestasjonen tilhører. @no
label: έχει κύριο τίτλο σειράς @el
definition: Συνδέει μια εκδήλωση με ένα όνομα μιας σειράς που εμφανίζεται σε μια εκδήλωση ενός μέρους μιας σειράς. @el
toolkit label: κύριος τίτλος σειράς @el
toolkit definition: Ένα όνομα μιας σειράς που εμφανίζεται σε μια εκδήλωση ενός μέρους μιας σειράς. @el
sub property of: has title of manifestation
has element type: 3
label: sorozatcíme a következő: @hu
definition: Hozzákapcsol egy megjelenési formát egy cím nomenhez, amely azonosítja azt a sorozatot, amelyhez a megjelenési forma tartozik. @hu
toolkit label: sorozatcíme: @hu
toolkit definition: Egy cím nomen, amely azonosítja azt a sorozatot, amelyhez a megjelenési forma tartozik. @hu
alternative label: title proper of subseries
alternative label: title proper of series
label: sarjan nimeke @fi
label: har serietittel @no
definition: Relaterer en manifestasjon til en tittel som identifiserer en serie som manifestasjonen tilhører. @no
alternative label: hovedtittel for underserie @no
alternative label: hovedtittel for serie @no
alternative label: titre propre de sous-collection @fr
alternative label: titre propre de collection @fr
label: heeft titel van reeks @nl
definition: Relateert een manifestatie aan een nomen dat is een titel die een reeks identificeert waartoe een manifestatie behoort. @nl
label: له عنوان سلسلة @ar
definition: يربط بين تجسيدة وعنوان يحدد سلسلة تنتمي إليها تجسيدة @ar
alternative label: العنوان الفعلي لسلسلة @ar
toolkit label: عنوان سلسلة @ar
toolkit definition: عنوان يحدد سلسلة تنتمي إليها تجسيدة @ar
alternative label: hovedtitel på serie @da
label: seeriapealkiri @et
definition: Seostab kehastuse pealkirjaga, mis identifitseerib seeria, millesse kehastus kuulub. @et
alternative label: allseeria põhipealkiri @et
alternative label: seeria põhipealkiri @et
alternative label: allseeria pealkiri @et
toolkit label: seeriapealkiri @et
toolkit definition: Pealkiri, mis identifitseerib seeria, millesse kehastus kuulub. @et
alternative label: Haupttitel einer Reihe @de
label: ha come titolo della serie @it
definition: Correla una manifestazione a un titolo che identifica una serie a cui appartiene una manifestazione. @it
toolkit label: titolo della serie @it
toolkit definition: Titolo che identifica una serie a cui appartiene una manifestazione. @it
toolkit label: sērijas nosaukums @lv
toolkit definition: Nosaukums, kas identificē sēriju, kurai pieder manifestācija. @lv

has layout
status: Published
definition: Relates a manifestation to an arrangement of text, images, tactile notation, or other content in a manifestation.
type: Property
domain: C10007
lexical alias: layout.en
instruction number: 3.11
toolkit label: layout
toolkit definition: An arrangement of text, images, tactile notation, or other content in a manifestation.
label: a pour disposition @fr
definition: Met une manifestation en relation avec un agencement du texte, des images, de la notation tactile ou de tout autre contenu dans une manifestation. @fr
toolkit label: disposition @fr
toolkit definition: Agencement du texte, des images, de la notation tactile ou de tout autre contenu dans une manifestation. @fr
toolkit label: diseño @es
toolkit definition: Una disposición de texto, imágenes, notación táctil u otro contenido en una manifestación. @es
label: har layout @sv
toolkit label: opmaak @nl
toolkit definition: Een rangschikking van tekst, beeld, tactiele notatievormen of andere content in een manifestatie. @nl
label: có sắp đặt @vi
definition: Liên kết biểu thị với sự sắp xếp của văn bản, hình ảnh, ký hiệu xúc giác, v.v..., trong biểu hiện. @vi
toolkit label: sắp đặt @vi
toolkit definition: Sự sắp xếp của văn bản, hình ảnh, ký hiệu xúc giác, v.v..., trong biểu hiện. @vi
definition: Relaterer en manifestation til opstilling af tekst, billeder, taktil notation etc. i en manifestation. @da
toolkit definition: Opstilling af tekst, billeder, taktil notation etc. i en manifestation. @da
label: hat Layout @de
definition: Setzt eine Manifestation in Beziehung zu einer Anordnung von Text, Bildern, taktiler Notation oder anderem Inhalt in einer Manifestation. @de
toolkit label: Layout @de
toolkit definition: Eine Anordnung von Text, Bildern, taktiler Notation oder anderem Inhalt in einer Manifestation. @de
label: té com a disposició @ca
definition: Relaciona una manifestació amb un arranjament del text, les imatges, la notació tàctil o un altre contingut d’una manifestació. @ca
toolkit label: disposició @ca
toolkit definition: Arranjament del text, les imatges, la notació tàctil o un altre contingut d’una manifestació. @ca
definition: Liittää manifestaation manifestaatioon sisältyvän tekstin, kuvien, taktiilin nuottikirjoituksen tai muun sisällön sommitteluun. @fi
toolkit definition: Manifestaatioon sisältyvien tekstin, kuvien, taktiilin nuottikirjoituksen tai muun sisällön sommittelu. @fi
toolkit definition: En ordning av tekst, bilder, berøringsnotasjon etc. i en manifestasjon. @no
label: έχει τυπογραφική διάταξη @el
definition: Συνδέει μια εκδήλωση με μια οργάνωση κειμένου, εικόνων, απτικής σημειογραφίας κ.λπ. σε μια εκδήλωση. @el
toolkit label: τυπογραφική διάταξη @el
toolkit definition: Μια οργάνωση κειμένου, εικόνων, απτικής σημειογραφίας κ.λπ. σε μια εκδήλωση. @el
has element type: 4
label: tördelése a következő: @hu
definition: Hozzákapcsol egy megjelenési formát szöveg, képek, tapintható lejegyzés vagy egyéb tartalom elrendezéséhez egy megjelenési formában. @hu
toolkit label: tördelése: @hu
toolkit definition: Szöveg, képek, tapintható lejegyzés vagy egyéb tartalom elrendezése egy megjelenési formában. @hu
label: layout @fi
definition: Relaterer en manifestasjon til en ordning av tekst, bilder, berøringsnotasjon etc. i en manifestasjon. @no
label: heeft opmaak @nl
definition: Relateert een manifestatie aan een rangschikking van tekst, beeld, tactiele notatievormen of andere content in een manifestatie. @nl
label: له تصميم طباعي @ar
definition: يربط بين تجسيدة وترتيب النص، والصور، والكتابة البارزة، إلخ. في تجسيدة. @ar
toolkit label: تصميم طباعي @ar
toolkit definition: ترتيب النص، والصور، والكتابة البارزة، إلخ. في تجسيدة. @ar
label: küljendus @et
definition: Seostab kehastuse teksti, piltide, taktiilse notatsiooni jms paigutusega kehastuses. @et
toolkit label: küljendus @et
toolkit definition: Teksti, piltide, taktiilse notatsiooni jms paigutus kehastuses. @et
label: ha come layout @it
definition: Correla una manifestazione a una disposizione del testo, immagini, notazione tattile, etc. in una manifestazione. @it
toolkit definition: Disposizione del testo, immagini, notazione tattile, etc. in una manifestazione. @it
label: salikums @lv
definition: Sasaista manifestāciju ar teksta, attēla, u.tml. izkārtojumu manifestācijā. @lv
toolkit label: salikums @lv
toolkit definition: Teksta, attēla, u.tml. izkārtojums manifestācijā. @lv
label: 有版式 @zh-hans
definition: 将一种载体表现与载体表现中对文本、图像、触摸标记或其他内容的安排关联起来。 @zh-hans
toolkit label: 版式 @zh-hans
toolkit definition: 载体表现中对文本、图像、触摸标记或其他内容的安排 @zh-hans
label: düzen ile ilişkilidir @tr
definition: Bir gösterimi, bir gösterimdeki metin, resimler, dokunsal notasyon veya diğer içeriğin bir düzenlemesiyle ilişkilendirir. @tr
toolkit label: düzenleme @tr
toolkit definition: Bir gösterimde metin, resim, dokunsal notasyon veya diğer içeriğin düzenlenmesi. @tr
label: tiene diseño @es
definition: Relaciona una manifestación con una disposición de texto, imágenes, notación táctil u otro contenido en una manifestación. @es
has subproperty: P30155

has mirror site
status: Published
definition: Relates a manifestation to a manifestation that is an exact copy of a website that is used to reduce network traffic or improve the availability of the content of the original site.
type: Property
domain: C10007
sub property of: has equivalent manifestation
lexical alias: mirrorSite.en
toolkit label: mirror site
toolkit definition: A manifestation that is an exact copy of a website that is used to reduce network traffic or improve the availability of the content of the original site.
label: a pour site miroir @fr
definition: Met une manifestation en relation avec une manifestation qui consiste en une copie exacte d’un site Web et qui est utilisée pour réduire le trafic sur le réseau ou augmenter la disponibilité du contenu du site d’origine. @fr
toolkit label: site miroir @fr
toolkit definition: Manifestation qui consiste en une copie exacte d’un site Web et qui est utilisée pour réduire le trafic sur le réseau ou augmenter la disponibilité du contenu du site d’origine. @fr
toolkit label: sitio espejo @es
toolkit definition: Una manifestación que es una copia exacta de un sitio web que se utiliza para reducir el tráfico de la red o mejorar la disponibilidad del contenido del sitio original. @es
instruction number: 24.5
toolkit definition: Een manifestatie die een exacte kopie is van een website, die gebruikt is om netwerkverkeer te reduceren of om de beschikbaarheid van de inhoud van de originele site te verbeteren. @nl
label: là trang thông tin thứ yếu @vi
definition: Liên kết biểu thị với biểu thị là bản sao chính xác của trang thông tin được dùng để làm giản tắc nghẽn mạng hoặc cải thiện tính có sẵn của nội dung của trang thông tin nguyên gốc. @vi
toolkit label: trang thông tin thứ yếu @vi
toolkit definition: Biểu thị là bản sao chính xác của trang thông tin được dùng để làm giản tắc nghẽn mạng hoặc cải thiện tính có sẵn của nội dung của trang thông tin nguyên gốc. @vi
label: har spejlside @da
definition: Relaterer en manifestation til en manifestation, som er en nøjagtig kopi af en hjemmeside, som er anvendt til at reducere netværkstrafik eller forbedre tilgængeligheden af originalsidens indhold. @da
toolkit label: spejlside @da
toolkit definition: Manifestation, som er en nøjagtig kopi af en hjemmeside, som er anvendt til at reducere netværkstrafik eller forbedre tilgængeligheden af originalsidens indhold. @da
label: hat Mirror-Site @de
definition: Setzt eine Manifestation in Beziehung zu einer Manifestation, die eine exakte Kopie einer Website ist und verwendet wird, um den Datenverkehr in einem Netzwerk zu reduzieren oder die Verfügbarkeit des Inhalts der Originalseite zu verbessern. @de
toolkit label: Mirror-Site @de
toolkit definition: Eine Manifestation, die eine exakte Kopie einer Website ist, und verwendet wird, um den Datenverkehr in einem Netzwerk zu reduzieren oder die Verfügbarkeit des Inhalts der Originalseite zu verbessern. @de
label: té com a rèplica de lloc web @ca
definition: Relaciona una manifestació amb una manifestació que és una còpia exacta d’un lloc web que s’usa per reduir el trànsit a la xarxa o per millorar la disponibilitat del contingut del lloc original. @ca
toolkit label: rèplica de lloc web @ca
toolkit definition: Manifestació que és una còpia exacta d’un lloc web que s’usa per reduir el trànsit a la xarxa o per millorar la disponibilitat del contingut del lloc original. @ca
definition: Liittää manifestaation manifestaatioon, joka on verkkosivuston tarkka kopio ja jota käytetään parantamaan alkuperäisen sivuston saavutettavuutta vähentämällä verkkoliikenteen kuormitusta. @fi
toolkit label: peilisivusto @fi
toolkit definition: Manifestaatio, joka on verkkosivuston tarkka kopio ja jota käytetään parantamaan alkuperäisen sivuston saavutettavuutta vähentämällä verkkoliikenteen kuormitusta. @fi
toolkit label: speilside @no
toolkit definition: En manifestasjon som er en tro kopi av en nettside, brukt for å redusere nettverkstrafikk eller gi bedre tilgang til innholdet på originalsiden. @no
label: είναι είδωλο ιστοχώρου @el
definition: Συνδέει μια εκδήλωση με μια εκδήλωση η οποία είναι ακριβές αντίγραφο ενός ιστοτόπου που χρησιμοποιείται για να μειώσει τη δικτυακή κίνηση ή για να βελτιώσει τη διαθεσιμότητα του περιεχομένου της αρχικής τοποθεσίας. @el
toolkit label: είδωλο ιστοχώρου @el
toolkit definition: Μια εκδήλωση η οποία είναι ακριβές αντίγραφο ενός ιστοτόπου που χρησιμοποιείται για να μειώσει τη δικτυακή κίνηση ή για να βελτιώσει τη διαθεσιμότητα του περιεχομένου της αρχικής τοποθεσίας. @el
has element type: 2
label: tükörszájtja a következő: @hu
definition: Hozzákapcsol egy megjelenési formát egy megjelenési formához, amely pontos másolata egy weboldalnak, amelyet a hálózati forgalom csökkentésére vagy az eredeti szájt elérésének a javítására használnak. @hu
toolkit label: tükörszájtja: @hu
toolkit definition: Egy megjelenési forma, amely pontos másolata egy weboldalnak, amelyet a hálózati forgalom csökkentésére vagy az eredeti szájt elérésének a javítására használnak. @hu
label: peilisivusto @fi
label: har speilside @no
definition: Relaterer en manifestasjon til en manifestasjon som er en tro kopi av en nettside, brukt for å redusere nettverkstrafikk eller gi bedre tilgang til innholdet på originalsiden. @no
label: heeft mirror site @nl
definition: Relateert een manifestatie aan een manifestatie die een exacte kopie is van een website, die gebruikt is om netwerkverkeer te reduceren of om de beschikbaarheid van de inhoud van de originele site te verbeteren. @nl
label: له موقع مُستنسخ @ar
definition: يربط بين تجسيدة وتجسيدة هي نسخة طبق الأصل من موقع إلكتروني مستخدم لتقليل الدخول على الشبكة أو لتحسين الإتاحة لمحتوى الموقع الأصلي. @ar
toolkit label: موقع مُستنسخ @ar
toolkit definition: تجسيدة هي نسخة طبق الأصل من موقع إلكتروني مستخدم لتقليل الدخول على الشبكة أو لتحسين الإتاحة لمحتوى الموقع الأصلي. @ar
label: peegelsait @et
definition: Seostab kehastuse kehastusega, mis on veebisaidi täpne koopia, mida kasutatakse võrguliikluse koormuse vähendamiseks ja originaalsaidi sisule ligipääsu parandamiseks. @et
toolkit label: peegelsait @et
toolkit definition: Kehastus, mis on veebisaidi täpne koopia, mida kasutatakse võrguliikluse koormuse vähendamiseks ja originaalsaidi sisule ligipääsu parandamiseks. @et
label: ha come sito mirror @it
definition: Correla una manifestazione a una manifestazione che è la copia esatta di un sito web, utilizzata per ridurre il traffico sulla rete o per aumentare la disponibilità dei contenuti del sito originale. @it
toolkit label: sito mirror @it
toolkit definition: Manifestazione che è la copia esatta di un sito web, utilizzata per ridurre il traffico sulla rete o per aumentare la disponibilità dei contenuti del sito originale. @it
label: spoguļvietne @lv
definition: Sasaista manifestāciju ar manifestāciju, kas ir precīza vietnes kopija, ko izmanto, lai samazinātu tīkla slodzi vai uzlabotu sākotnējās vietnes satura pieejamību. @lv
toolkit label: spoguļvietne @lv
toolkit definition: Manifestācija, kas ir precīza vietnes kopija, ko izmanto, lai samazinātu tīkla slodzi vai uzlabotu sākotnējās vietnes satura pieejamību. @lv
label: 有镜像站点 @zh-hans
definition: 将一种载体表现与作为一个网站精确复本、用于减少网络流量或提高原站点内容获取能力的载体表现关联起来。 @zh-hans
toolkit label: 镜像站点 @zh-hans
toolkit definition: 作为一个网站精确复本、用于减少网络流量或提高原站点内容获取能力的载体表现 @zh-hans
label: ayna site ile ilişkilidir @tr
definition: Bir gösterimi, ağ trafiğini azaltmak veya orijinal sitenin içeriğinin kullanılabilirliğini iyileştirmek için kullanılan bir web sitesinin aslının aynısı olan bir gösterim ile ilişkilendirir. @tr
toolkit label: İkiz site @tr
toolkit definition: Ağ trafiğini azaltmak veya orijinal sitenin içeriğinin kullanılabilirliğini iyileştirmek için kullanılan bir web sitesinin aslının aynısı olan bir gösterim. @tr
label: tiene sitio espejo @es
definition: Relaciona una manifestación con una manifestación que es una copia exacta de un sitio web que se utiliza para reducir el tráfico de la red o mejorar la disponibilidad del contenido del sitio original. @es
has subproperty: P30028

has type of binding
status: Published
lexical alias: typeOfBinding.en
definition: Relates a manifestation to a method used to bind a published or unpublished manifestation.
toolkit label: type of binding
toolkit definition: A method used to bind a published or unpublished manifestation.
type: Property
domain: C10007
has element type: 4
label: sidostyyppi @fi
definition: Liittää manifestaatioon menetelmään, jolla julkaistu tai julkaisematon manifestaatio on sidottu. @fi
toolkit label: sidostyyppi @fi
toolkit definition: Menetelmä, jolla julkaistu tai julkaisematon manifestaatio on sidottu. @fi
label: har innbindingstype @no
definition: Relaterer en manifestasjon til en metode som er brukt til å binde inn en publisert eller upublisert manifestasjon. @no
toolkit label: innbindingstype @no
toolkit definition: En metode som er brukt til å binde inn en publisert eller upublisert manifestasjon. @no
label: a pour type de reliure @fr
definition: Met une manifestation en relation avec une méthode utilisée pour relier une manifestation publiée ou non publiée. @fr
toolkit label: type de reliure @fr
toolkit definition: Méthode utilisée pour relier une manifestation publiée ou non publiée. @fr
label: heeft bindwijze @nl
definition: Relateert een manifestatie aan een methode gebruikt om een gepubliceerde of ongepubliceerde manifestatie te binden. @nl
toolkit label: bindwijze @nl
toolkit definition: Een methode gebruikt om een gepubliceerde of ongepubliceerde manifestatie te binden. @nl
label: له نوع تجيلد @ar
definition: يربط بين تجسيدة وطريقة مستخدمة لتجليد تجسيدة منشورة أو غير منشورة. @ar
toolkit label: نوع تجيلد @ar
toolkit definition: طريقة مستخدمة لتجليد تجسيدة منشورة أو غير منشورة. @ar
label: té com a tipus d’enquadernació @ca
definition: Relaciona una manifestació amb un mètode usat per enquadernar una manifestació publicada o no publicada. @ca
toolkit label: tipus d’enquadernació @ca
toolkit definition: Mètode usat per enquadernar una manifestació publicada o no publicada. @ca
label: har type af indbinding @da
definition: Relaterer en manifestation til en metode, som bruges til at indbinde en publiceret eller upubliceret manifestation. @da
toolkit label: type af indbinding @da
toolkit definition: Metode, som bruges til at indbinde en publiceret eller upubliceret manifestation. @da
label: köite liik @et
definition: Seostab kehastuse meetodiga, mida on kasutatud avaldatud või avaldamata kehastuse köitmiseks. @et
toolkit label: köite liik @et
toolkit definition: Meetod, mida on kasutatud avaldatud või avaldamata kehastuse köitmiseks. @et
label: hat Bindeart @de
definition: Setzt eine Manifestation in Beziehung zu einer Methode, die verwendet wird, um eine veröffentlichte oder unveröffentlichte Manifestation zu binden. @de
toolkit label: Bindeart @de
toolkit definition: Eine Methode, die verwendet wird, um eine veröffentlichte oder unveröffentlichte Manifestation zu binden. @de
label: kötéstípusa a következő: @hu
definition: Hozzákapcsol egy megjelenési formát egy módszerhez, amelyet kiadott vagy kiadatlan megjelenési forma kötéséhez használnak. @hu
toolkit label: kötéstípusa: @hu
toolkit definition: Egy módszer, amelyet kiadott vagy kiadatlan megjelenési forma kötéséhez használnak. @hu
label: ha come tipo di legatura @it
definition: Correla una manifestazione a un metodo utilizzato per rilegare una manifestazione pubblicata o non pubblicata. @it
toolkit label: tipo di legatura @it
toolkit definition: Metodo utilizzato per rilegare una manifestazione pubblicata o non pubblicata. @it
label: iesējuma veids @lv
definition: Sasaista manifestāciju ar metodi, kas izmantota publicētas vai nepublicētas manifestācijas iesiešanai. @lv
toolkit label: iesējuma veids @lv
toolkit definition: Metode, kas izmantota publicētas vai nepublicētas manifestācijas iesiešanai. @lv
alternative label: Art des Einbands @de
label: 有装订类型 @zh-hans
definition: 将一种载体表现与用于装订一种出版或非出版载体表现的方法关联起来。 @zh-hans
toolkit label: 装订类型 @zh-hans
toolkit definition: 用于装订一种出版或非出版载体表现的方法 @zh-hans
label: ciltleme türü ile ilişkilidir @tr
definition: Bir gösterimi, yayınlanmış veya yayınlanmamış bir öğeyle bağlamak için kullanılan bir yöntemle ilişkilendirir. @tr
toolkit label: bağlayıcının türü @tr
toolkit definition: Yayınlanmış veya yayınlanmamış bir kopyayı ciltlemek çin kullanılan bir yöntem. @tr
label: tiene tipo de encuadernación @es
definition: Relaciona una manifestación con un método utilizado para encuadernar una manifestación publicada o no publicada. @es
toolkit label: tipo de encuadernación @es
toolkit definition: Un método utilizado para encuadernar r una manifestación publicada o no publicada. @es
has subproperty: P30309

has title proper
status: Published
definition: Relates a manifestation to a nomen that is a title of manifestation that is selected for preference in a specific application or context.
type: Property
domain: C10007
sub property of: has title of manifestation
lexical alias: titleProper.en
instruction number: 2.3.2
toolkit label: title proper
toolkit definition: A nomen that is a title of manifestation that is selected for preference in a specific application or context.
label: a pour titre propre @fr
definition: Met une manifestation en relation avec un nomen qui est un titre de manifestation faisant l’objet d’un choix privilégié dans une application ou un contexte spécifiques. @fr
toolkit label: titre propre @fr
toolkit definition: Nomen qui est un titre de manifestation faisant l’objet d’un choix privilégié dans une application ou un contexte spécifiques. @fr
toolkit label: título propiamente dicho @es
toolkit definition: Un nomen que es un título de manifestación que se selecciona de preferencia en una aplicación o contexto específico. @es
scope note: An alternative title is treated as part of a title proper.
label: har huvudtitel @sv
toolkit label: huvudtitel @sv
toolkit label: hoofdtitel @nl
toolkit definition: Een nomen dat is een titel van manifestatie die als voorkeursterm geselecteerd is in een specifieke toepassing of context. @nl
label: có nhan đề hợp thức @vi
definition: Liên kết biểu thị với tên chính của biểu thị, đó là, nhan đề được sử dụng thông thường khi gọi tên biểu thị. @vi
scope note: Nhan đề lựa chọn được xử lý như là phần của nhan đề hợp thức. @vi
toolkit label: nhan đề hợp thức @vi
toolkit definition: Tên chính của biểu thị, đó là, nhan đề được sử dụng thông thường khi gọi tên biểu thị. @vi
scope note: Een alternatieve titel wordt behandeld als onderdeel van de hoofdtitel. @nl
label: har hovedtitel @da
definition: Relaterer en manifestation til en titel på manifestation, som er valgt som præference i en specifik anvendelse eller kontekst. @da
scope note: Alternativ titel behandles som del af en hovedtitel. @da
toolkit label: hovedtitel @da
toolkit definition: Titel på manifestation, som er valgt som præference i en specifik anvendelse eller kontekst. @da
label: hat Haupttitel @de
definition: Setzt eine Manifestation in Beziehung zu einem Titel einer Manifestation, der in einer bestimmten Anwendung oder in einem bestimmten Kontext als Vorzugsform bestimmt wird. @de
scope note: Ein Alternativtitel wird als Teil eines Haupttitels behandelt. @de
toolkit label: Haupttitel @de
toolkit definition: Ein Titel einer Manifestation, der in einer bestimmten Anwendung oder in einem bestimmten Kontext als Vorzugsform bestimmt wird. @de
label: té com a títol propi @ca
definition: Relaciona una manifestació amb un nomen que és un títol de manifestació que se selecciona com a preferent en una aplicació o un context específic. @ca
scope note: Un títol alternatiu es tracta com a part d’un títol propi. @ca
toolkit label: títol propi @ca
toolkit definition: Nomen que és un títol de manifestació que se selecciona com a preferent en una aplicació o un context específic. @ca
definition: Liittää manifestaation nomeniin, joka on manifestaation nimeke, joka on valittu ensisijaiseksi tietyssä sovelluksessa tai kontekstissa. @fi
toolkit label: päänimeke @fi
toolkit definition: Nomen, joka on manifestaation nimeke, joka on valittu ensisijaiseksi tietyssä sovelluksessa tai kontekstissa. @fi
toolkit label: hovedtittel @no
toolkit definition: En tittel for manifestasjon som er valgt som foretrukket tittel i en spesifikk applikasjon eller kontekst. @no
label: έχει κύριο τίτλο @el
definition: Συνδέει μια εκδήλωση με ένα κύριο όνομα μιας εκδήλωσης δηλαδή ένας τίτλος που συνήθως χρησιμοποιείται όταν κατονομάζεται μια εκδήλωση. @el
scope note: Ένας εναλλακτικός τίτλος υποβάλλεται σε διαχείριση ως μέρος του κύριου τίτλου. @el
toolkit label: κύριος τίτλος @el
toolkit definition: Ένα κύριο όνομα μιας εκδήλωσης δηλαδή ένας τίτλος που συνήθως χρησιμοποιείται όταν κατονομάζεται μια εκδήλωση. @el
scope note: Un titre alternatif est traité comme faisant partie d’un titre propre. @fr
has element type: 3
label: főcíme a következő: @hu
definition: Hozzákapcsol egy megjelenési formát egy cím nomenhez, amelyet egy adott alkalmazásban vagy kontextusban előnyben részesítenek. @hu
scope note: Az alternatív címet a főcím részeként kezelik. @hu
toolkit label: főcíme: @hu
toolkit definition: Egy cím nomen, amelyet egy adott alkalmazásban vagy kontextusban előnyben részesítenek. @hu
alternative label: preferred title of manifestation
alternative label: earlier title proper
alternative label: later title proper
sub property of: P00021
scope note: Vaihtoehtoista nimekettä pidetään päänimekkeen osana. @fi
label: päänimeke @fi
label: har hovedtittel @no
definition: Relaterer en manifestasjon til en tittel for manifestasjon som er valgt som foretrukket tittel i en spesifikk applikasjon eller kontekst. @no
scope note: En alternativ tittel behandles som en del av hovedtittel @no
alternative label: foretrukket tittel for manifestasjon @no
alternative label: tidligere hovedtittel @no
alternative label: senere hovedtittel @no
alternative label: titre privilégié d’une manifestation @fr
alternative label: titre propre antérieur @fr
alternative label: titre propre ultérieur @fr
label: heeft hoofdtitel @nl
definition: Relateert een manifestatie aan een nomen dat is een titel van manifestatie die als voorkeursterm geselecteerd is in een specifieke toepassing of context. @nl
label: له العنوان نفسه @ar
definition: يربط بين تجسيدة وعنوان تجسيدة التي اختيرت للتفضيل ضمن تطبيق او سياق محدد. @ar
scope note: العنوان البديل يتم التعامل معه كجزء من العنوان نفسه. @ar
alternative label: العنوان الفعلي لاحقًا @ar

has variant access point for manifestation
status: Published
type: Property
lexical alias: variantAccessPointForManifestation.en
definition: Relates a manifestation to a nomen that is an access point of manifestation that is not selected for preference in a specific vocabulary encoding scheme.
domain: C10007
toolkit label: variant access point for manifestation
toolkit definition: A nomen that is an access point of manifestation that is not selected for preference in a specific vocabulary encoding scheme.
sub property of: has access point for manifestation
has element type: 3
sub property of: P00022
label: manifestaation varianttihakutieto @fi
definition: Liittää manifestaation nomeniin, joka on manifestaation hakutieto, jota ei ole valittu ensisijaiseksi tietyssä sanaston merkintäjärjestelmässä. @fi
toolkit label: manifestaation varianttihakutieto @fi
toolkit definition: Nomen, joka on manifestaation hakutieto, jota ei ole valittu ensisijaiseksi tietyssä sanaston merkintäjärjestelmässä. @fi
label: har alternativ søkeinngang for manifestasjon @no
definition: Relaterer en manifestasjon til en søkeinngang for manifestasjon som ikke er en foretrukket søkeinngang i et bestemt kodeskjema for vokabular. @no
toolkit label: alternativ søkeinngang for manifestasjon @no
toolkit definition: En søkeinngang for manifestasjon som ikke er en foretrukket søkeinngang i et bestemt kodeskjema for vokabular. @no
label: a pour variante de point d’accès d’une manifestation @fr
definition: Met une manifestation en relation avec un nomen qui est un point d’accès d’une manifestation ne faisant pas l’objet d’un choix privilégié dans un schéma d’encodage de vocabulaire spécifique. @fr
toolkit label: variante de point d’accès d’une manifestation @fr
toolkit definition: Nomen qui est un point d’accès d’une manifestation ne faisant pas l’objet d’un choix privilégié dans un schéma d’encodage de vocabulaire spécifique. @fr
label: heeft variant ingang voor manifestatie @nl
definition: Relateert een manifestatie aan een nomen dat is een ingang van manifestatie die niet als voorkeursterm geselecteerd is in een specifiek vocabulair coderingssysteem. @nl
toolkit label: variant ingang voor manifestatie @nl
toolkit definition: Een nomen dat is een ingang van manifestatie die niet als voorkeursterm geselecteerd is in een specifiek vocabulair coderingssysteem. @nl
label: له نقطة إتاحة مختلفة لتجسيدة @ar
definition: يربط بين تجسيدة ونقطة إتاحة لتجسيدة التي لم يتم اختيارها من خطة ترميز مفردات. @ar
toolkit label: نقطة إتاحة مختلفة لتجسيدة @ar
toolkit definition: نقطة إتاحة لتجسيدة التي لم يتم اختيارها من خطة ترميز مفردات. @ar
label: té com a variant de punt d’accés de manifestació @ca
definition: Relaciona una manifestació amb un nomen que és un punt d’accés de manifestació que no se selecciona com a preferent en un esquema de codificació de vocabulari específic. @ca
toolkit label: variant de punt d’accés de manifestació @ca
toolkit definition: Nomen que és un punt d’accés de manifestació que no se selecciona com a preferent en un esquema de codificació de vocabulari específic. @ca
label: har variant af søgeindgang for manifestation @da
definition: Relaterer en manifestation til en søgeindgang for manifestation, som ikke er valgt som præference i et specifikt vokabularkodningsskema. @da
toolkit label: variant af søgeindgang for manifestation @da
toolkit definition: Søgeindgang for manifestation, som ikke er valgt som præference i et specifikt vokabularkodningsskema. @da
label: kehastuse otsielemendi variant @et
definition: Seostab kehastuse kehastuse otsielemendiga, mis ei ole valitud eelistatuks vastavas leksikaalses märkimissüsteemis. @et
toolkit label: kehastuse otsielemendi variant @et
toolkit definition: Kehastuse otsielement, mis ei ole valitud eelistatuks vastavas leksikaalses märkimissüsteemis. @et
label: hat zusätzlichen Sucheinstieg für eine Manifestation @de
definition: Setzt eine Manifestation in Beziehung zu einem Sucheinstieg für eine Manifestation, der in einem bestimmten Vocabulary Encoding Scheme nicht als Vorzugsform bestimmt wird. @de
toolkit label: Zusätzlicher Sucheinstieg für eine Manifestation @de
toolkit definition: Ein Sucheinstieg für eine Manifestation, der in einem bestimmten Vocabulary Encoding Scheme nicht als Vorzugsform bestimmt wird. @de
label: hozzáférésipont-variánsa megjelenési forma számára a következő: @hu
definition: Hozzákapcsol egy megjelenési formához egy noment, amely egy olyan hozzáférési pont időtartam számára, amelyet egy adott szótárkódolási sémában nem részesítenek előnyben. @hu
toolkit label: hozzáférésipont-variáns megjelenési forma számára @hu
toolkit definition: Megjelenési forma olyan hozzáférési pontja, amelynek kiválasztásához nem egy speciális szótárkódolási sémát részesítenek előnyben. @hu
label: ha come punto d'accesso variante per manifestazione @it
definition: Correla una manifestazione a un punto d'accesso di manifestazione non scelto come preferito in uno specifico schema di codifica del vocabolario. @it
toolkit label: punto d'accesso variante per manifestazione @it
toolkit definition: Punto d'accesso di manifestazione non scelto come preferito in uno specifico schema di codifica del vocabolario. @it
label: manifestācijas papildforma @lv
definition: Sasaista manifestāciju ar nomenu, kas ir piekļuves punkts manifestācijai, kas nav izvēlēta kā prioritāra noteiktai kontrolētas vārdnīcas shēmai. @lv
toolkit label: manifestācijas papildforma @lv
toolkit definition: Piekļuves punkts manifestācijai, kas nav izvēlēta kā prioritāra noteiktai kontrolētas vārdnīcas shēmai. @lv
label: 有载体表现的变异检索点 @zh-hans
definition: 将一种载体表现与作为一种载体表现的检索点、并没有在一个特定的词表编码体系中被首选的一个命名关联起来。 @zh-hans
toolkit label: 载体表现的变异检索点 @zh-hans
toolkit definition: 作为一种载体表现的检索点、并没有在一个特定的词表编码体系中被首选的一个命名 @zh-hans
label: gösterim için alternatif erişim noktası ile ilişkilidir @tr
definition: Bir gösterimi, belirli bir kelime kodlama şemasında tercih için seçilmeyen bir örneğine erişim noktası olan bir isimle ilişkilendirir. @tr
toolkit label: gösterim için alternatif erişim noktası @tr
toolkit definition: Belirli bir kelime kodlama şemasında tercih için seçilmemiş bir gösterimin erişim noktası olan bir isim. @tr
label: tiene un punto de acceso variante para la manifestación @es
definition: Relaciona una manifestación con un nomen que es un punto de acceso a la manifestación que no está seleccionado de preferencia en un esquema de codificación de vocabulario específico. @es
toolkit label: punto de acceso variante para la manifestación @es
toolkit definition: Un nomen que es un punto de acceso a la manifestación que no está seleccionado de preferencia en un esquema de codificación de vocabulario específico. @es
has subproperty: P30295

has projection speed
status: Published
definition: Relates a manifestation to a speed at which a projected carrier must be operated to produce the moving image intended.
type: Property
domain: C10007
sub property of: has projection characteristic of motion picture film
lexical alias: projectionSpeed.en
instruction number: 3.17.3
toolkit label: projection speed
toolkit definition: A speed at which a projected carrier must be operated to produce the moving image intended.
label: a pour vitesse de projection @fr
definition: Met une manifestation en relation avec une vitesse à laquelle un support matériel projeté doit être utilisé pour produire l’image animée prévue. @fr
toolkit label: vitesse de projection @fr
toolkit definition: Vitesse à laquelle un support matériel projeté doit être utilisé pour produire l’image animée prévue. @fr
toolkit label: velocidad de proyección @es
toolkit definition: Una velocidad a la que se debe operar un soporte proyectado para producir la imagen en movimiento pretendida. @es
label: har projektionshastighet @sv
toolkit label: projektionshastighet @sv
toolkit label: projectiesnelheid @nl
toolkit definition: Een snelheid waarmee een projectiedrager moet worden afgespeeld om het bedoelde bewegende beeld te produceren. @nl
label: có tốc độ chiếu @vi
definition: Liên kết biểu thị với tốc độ mà vật mang tin chiếu phải hoạt động để tạo ta hình ảnh động như dự kiến. @vi
toolkit label: tốc độ chiếu @vi
toolkit definition: Tốc độ mà vật mang tin chiếu phải hoạt động để tạo ta hình ảnh động như dự kiến. @vi
label: har projiceringshastighed @da
definition: Relaterer en manifestation til en hastighed, ved hvilken en projiceret bærer skal betjenes for at producere det ønskede levende billede. @da
toolkit label: projiceringshastighed @da
toolkit definition: Hastighed, ved hvilken en projiceret bærer skal betjenes for at producere det ønskede levende billede. @da
label: hat Projektionsgeschwindigkeit @de
definition: Setzt eine Manifestation in Beziehung zu einer Geschwindigkeit, mit der ein projizierbarer Datenträger betrieben werden muss, um das beabsichtigte Bewegtbild zu erzeugen. @de
toolkit label: Projektionsgeschwindigkeit @de
toolkit definition: Eine Geschwindigkeit, mit der ein projizierbarer Datenträger betrieben werden muss, um das beabsichtigte Bewegtbild zu erzeugen. @de
label: té com a velocitat de projecció @ca
definition: Relaciona una manifestació amb una velocitat a la qual ha de funcionar un suport físic projectat per produir el moviment d’imatges previst. @ca
toolkit label: velocitat de projecció @ca
toolkit definition: Velocitat a la qual ha de funcionar un suport físic projectat per produir el moviment d’imatges previst. @ca
definition: Liittää manifestaation nopeuteen, jolla projisoitava tallenne tulee esittää liikkuvan kuvan näyttämiseksi tarkoitetulla tavalla. @fi
toolkit label: projisointinopeus @fi
toolkit definition: Nopeus, jolla projisoitava tallenne tulee esittää liikkuvan kuvan näyttämiseksi tarkoitetulla tavalla. @fi
toolkit label: projeksjonshastighet @no
toolkit definition: En hastighet som kreves for at et projeksjonsmedium skal produsere levende bilder slik de var ment. @no
label: έχει ταχύτητα προβολής @el
definition: Συνδέει μια εκδήλωση με μια ταχύτητα στην οποία ο προβαλλόμενος φορέας αποθήκευσης πρέπει να λειτουργεί για την παραγωγή της σκοπούμενης κινητής εικόνας. @el
toolkit label: ταχύτητα προβολής @el
toolkit definition: Μια ταχύτητα στην οποία ο προβαλλόμενος φορέας αποθήκευσης πρέπει να λειτουργεί για την παραγωγή της σκοπούμενης κινητής εικόνας. @el
has element type: 6
label: vetítési sebessége a következő: @hu
definition: Hozzákapcsol egy megjelenési formát egy sebességhez, amelyen egy kivetített hordozónak működnie kell, hogy a kívánt mozgóképet elő tudják állítani. @hu
toolkit label: vetítési sebessége: @hu
toolkit definition: Egy sebesség, amelyen egy kivetített hordozónak működnie kell, hogy a kívánt mozgóképet elő tudják állítani. @hu
label: projisointinopeus @fi
label: har projeksjonshastighet @no
definition: Relaterer en manifestasjon til en hastighet som kreves for at et projeksjonsmedium skal produsere levende bilder slik de var ment. @no
label: heeft projectiesnelheid @nl
definition: Relateert een manifestatie aan een snelheid waarmee een projectiedrager moet worden afgespeeld om het bedoelde bewegende beeld te produceren. @nl
label: له سرعة عرض @ar
definition: يربط بين تجسيدة وسرعة يجب أن يشغل بها حامل العرض لكي ينتج عنه الصور المتحركة المطلوبة. @ar
toolkit label: سرعة عرض @ar
toolkit definition: سرعة يجب أن يشغل بها حامل العرض لكي ينتج عنه الصور المتحركة المطلوبة. @ar
label: projitseerimiskiirus @et
definition: Seostab kehastuse kiirusega, millega tuleb projitseeritavat kandjat käitada, et tekiks ettenähtud liikuv pilt. @et
toolkit label: projitseerimiskiirus @et
toolkit definition: Kiirus, millega tuleb projitseeritavat kandjat käitada, et tekiks ettenähtud liikuv pilt. @et
label: ha come velocità di proiezione @it
definition: Correla una manifestazione a una velocità a cui un supporto proiettato deve essere utilizzato per produrre l'immagine in movimento desiderata. @it
toolkit label: velocità di proiezione @it
toolkit definition: Velocità a cui un supporto proiettato deve essere utilizzato per produrre l'immagine in movimento desiderata. @it
label: demonstrēšanas ātrums @lv
definition: Sasaista manifestāciju ar ātrumu, ar kādu projektoram jādarbojas, lai demonstrētu kustīgu attēlu. @lv
toolkit label: demonstrēšanas ātrums @lv
toolkit definition: Ātrums, ar kādu projektoram jādarbojas, lai demonstrētu kustīgu attēlu. @lv
label: 有投影速度 @zh-hans
definition: 将一种载体表现与一种投影载体要产生所期望的动态图像必须操作的速度关联起来。 @zh-hans
toolkit label: 投影速度 @zh-hans
toolkit definition: 一种投影载体要产生所期望的动态图像必须操作的速度 @zh-hans
label: yansıtma hızı ile ilişkilidir @tr
definition: Bir gösterimi, amaçlanan hareketli görüntüyü üretmek için yansıtılan bir taşıyıcının çalıştırılması gereken bir hızla ilişkilendirir. @tr
toolkit label: projeksi̇yon hizi @tr
toolkit definition: Tasarlanan hareketli görüntüyü üretebilmek için yansıtılan taşıyıcının çalıştırılması gereken hız. @tr
label: tiene velocidad de proyección @es

has details of projection speed
status: Published
type: Property
lexical alias: detailsOfProjectionSpeed.en
definition: Relates a manifestation to details of a speed at which a projected carrier must be operated to produce the moving image intended.
domain: C10007
instruction number: 3.17.3.4
toolkit label: details of projection speed
toolkit definition: Details of a speed at which a projected carrier must be operated to produce the moving image intended.
toolkit label: detalles de la velocidad de proyección @es
toolkit definition: Detalles de la velocidad a la que se debe operar un soporte proyectado para producir la imagen en movimiento deseada. @es
sub property of: has details of projection characteristic of motion picture film
label: har detaljerad information om projektionshastighet @sv
toolkit label: detaljerad information om projektionshastighet @sv
toolkit label: details van projectiesnelheid @nl
toolkit definition: Details van een snelheid waarmee een projectiedrager moet worden afgespeeld om het bedoelde bewegende beeld te produceren. @nl
label: có chi tiết của tốc độ chiếu @vi
definition: Liên kết biểu thị với chi tiết của tốc độ mà vật mang tin chiếu phải hoạt động để tạo ta hình ảnh động như dự kiến. @vi
toolkit label: chi tiết của tốc độ chiếu @vi
toolkit definition: Chi tiết của tốc độ mà vật mang tin chiếu phải hoạt động để tạo ta hình ảnh động như dự kiến. @vi
label: har detaljer om projiceringshastighed @da
definition: Relaterer en manifestation til detaljer om den hastighed, som en projiceret bærer skal betjenes ved for at producere det ønskede levende billede. @da
toolkit label: detaljer om projiceringshastighed @da
toolkit definition: Detaljer om den hastighed, som en projiceret bærer skal betjenes ved for at producere det ønskede levende billede. @da
label: hat Details zur Projektionsgeschwindigkeit @de
definition: Setzt eine Manifestation in Beziehung zu den Details zur Geschwindigkeit, mit der ein projizierbarer Datenträger betrieben werden muss, um das beabsichtigte Bewegtbild zu erzeugen. @de
toolkit label: Details zur Projektionsgeschwindigkeit @de
toolkit definition: Details zur Geschwindigkeit, mit der ein projizierbarer Datenträger betrieben werden muss, um das beabsichtigte Bewegtbild zu erzeugen. @de
label: té com a particularitats de velocitat de projecció @ca
definition: Relaciona una manifestació amb les particularitats d’una velocitat a la qual ha de funcionar un suport físic projectat per produir el moviment d’imatges previst. @ca
toolkit label: particularitats de velocitat de projecció @ca
toolkit definition: Particularitats d’una velocitat a la qual ha de funcionar un suport físic projectat per produir el moviment d’imatges previst. @ca
definition: Liittää manifestaation tarkempiin tietoihin nopeudesta, jolla projisoitava tallenne tulee esittää liikkuvan kuvan näyttämiseksi tarkoitetulla tavalla. @fi
toolkit label: projisointinopeuden tarkemmat tiedot @fi
toolkit definition: Tarkemmat tiedot nopeudesta, jolla projisoitava tallenne tulee esittää liikkuvan kuvan näyttämiseksi tarkoitetulla tavalla. @fi
toolkit label: detaljer vedrørende projeksjonshastighet @no
toolkit definition: Detaljer vedrørende hastigheten som kreves for at et projeksjonsmedium skal produsere levende bilder slik de var ment. @no
label: έχει λεπτομέρειες της ταχύτητας προβολής @el
definition: Συνδέει μια εκδήλωση με τις λεπτομέρειες μιας ταχύτητας στην οποία ο προβαλλόμενος φορέας αποθήκευσης πρέπει να λειτουργεί για την παραγωγή της σκοπούμενης κινητής εικόνας. @el
toolkit label: λεπτομέρειες της ταχύτητας προβολής @el
toolkit definition: Λεπτομέρειες μιας ταχύτητας στην οποία ο προβαλλόμενος φορέας αποθήκευσης πρέπει να λειτουργεί για την παραγωγή της σκοπούμενης κινητής εικόνας. @el
label: a pour particularités d’une vitesse de projection @fr
definition: Met une manifestation en relation avec des particularités d’une vitesse à laquelle un support matériel projeté doit être utilisé pour produire l’image animée prévue. @fr
toolkit label: particularités d’une vitesse de projection @fr
toolkit definition: Particularités d’une vitesse à laquelle un support matériel projeté doit être utilisé pour produire l’image animée prévue. @fr
has element type: 6
label: vetítési sebesség részletei a következők: @hu
definition: Hozzákapcsol egy megjelenési formát azon sebesség részleteihez, amelyen egy kivetített hordozónak működnie kell, hogy a kívánt mozgóképet elő tudják állítani. @hu
toolkit label: vetítési sebesség részletei: @hu
toolkit definition: Azon sebesség részletei, amelyen egy kivetített hordozónak működnie kell, hogy a kívánt mozgóképet elő tudják állítani. @hu
label: projisointinopeuden tarkemmat tiedot @fi
label: har detaljer vedrørende projeksjonshastighet @no
definition: Relaterer en manifestasjon til detaljer vedrørende hastigheten som kreves for at et projeksjonsmedium skal produsere levende bilder slik de var ment. @no
label: heeft details van projectiesnelheid @nl
definition: Relateert een manifestatie aan details van een snelheid waarmee een projectiedrager moet worden afgespeeld om het bedoelde bewegende beeld te produceren. @nl
label: له تفاصيل سرعة عرض @ar
definition: يربط بين تجسيدة وتفاصيل سرعة التي يجب أن يشغل بها حامل العرض لكي ينتج عنه الصورة المتحركة المطلوبة. @ar
toolkit label: تفاصيل سرعة عرض @ar
toolkit definition: تفاصيل سرعة التي يجب أن يشغل بها حامل العرض لكي ينتج عنه الصورة المتحركة المطلوبة. @ar
label: projitseerimiskiiruse täpsustus @et
definition: Seostab kehastuse täpsemate andmetega kiiruse kohta, millega tuleb projitseeritavat kandjat käitada, et tekiks ettenähtud liikuv pilt. @et
toolkit label: projitseerimiskiiruse täpsustus @et
toolkit definition: Täpsemad andmed kiiruse kohta, millega tuleb projitseeritavat kandjat käitada, et tekiks ettenähtud liikuv pilt. @et
label: ha come particolari relativi alla velocità di proiezione @it
definition: Correla una manifestazione ai particolari relativi a un velocità a cui un supporto proiettato deve essere azionato per produrre l'immagine in movimento desiderata. @it
toolkit label: particolari relativi alla velocità di proiezione @it
toolkit definition: Particolari relativi a una velocità a cui un supporto proiettato deve essere azionato per produrre l'immagine in movimento desiderata. @it
label: detalizēti par demonstrēšanas ātrumu @lv
definition: Sasaista manifestāciju ar sīkāku informāciju par ātrumu, ar kādu projekcijas nesējs darbojas, lai demonstrētu kustīgo attēlu. @lv
toolkit label: detalizēti par demonstrēšanas ātrumu @lv
toolkit definition: Sīkāka informācija par ātrumu, ar kādu projekcijas nesējs darbojas, lai demonstrētu kustīgo attēlu. @lv
label: 有投影速度细节 @zh-hans
definition: 将一种载体表现与一种投影载体要产生所期望的动态图像必须操作的速度的细节关联起来。 @zh-hans
toolkit label: 投影速度细节 @zh-hans
toolkit definition: 一种投影载体要产生所期望的动态图像必须操作的速度的细节 @zh-hans
label: projeksiyon hızı ayrıntıları ile ilişkilidir @tr
definition: Bir gösterimi, amaçlanan hareketli görüntüyü üretmek için yansıtılan bir taşıyıcının çalıştırılması gereken hızın ayrıntılarıyla ilişkilendirir. @tr
toolkit label: projeksiyon hızının ayrıntıları @tr
toolkit definition: Hedeflenen hareketli görüntüyü üretmek için bir projeksiyon taşıyıcısının çalıştırılması gereken hızın ayrıntıları. @tr
label: tiene detalles de la velocidad de proyección @es

has video format
status: Published
definition: Relates a manifestation to a schema or standard that is used to encode the analog video content of a manifestation.
type: Property
domain: C10007
sub property of: has video characteristic
lexical alias: videoFormat.en
instruction number: 3.18.2
toolkit label: video format
toolkit definition: A schema or standard that is used to encode the analog video content of a manifestation.
label: a pour format vidéo @fr
definition: Met une manifestation en relation avec une norme ou un schéma qui est utilisé pour encoder le contenu vidéo analogique d’une manifestation. @fr
toolkit label: format vidéo @fr
toolkit definition: Norme ou schéma qui est utilisé pour encoder le contenu vidéo analogique d’une manifestation. @fr
toolkit label: formato de video @es
toolkit definition: Un esquema o estándar que se utiliza para codificar el contenido de vídeo analógico de una manifestación. @es
label: har videoformat @sv
toolkit label: videoformat @sv
toolkit label: videoformaat @nl
toolkit definition: Een schema of standaard dat is gebruikt om de analoge videocontent van een manifestatie te coderen. @nl
label: có định dạng video @vi
definition: Liên kết biểu thị với chuẩn, v.v..., được sử dụng để ghi mã nội dung video tương tự của biểu thị. @vi
toolkit label: định dạng video @vi
toolkit definition: Chuẩn, v.v..., được sử dụng để ghi mã nội dung video tương tự của biểu thị. @vi
definition: Relaterer en manifestation til en standard etc., som anvendes til kodning af en manifestations analoge videoindhold. @da
toolkit definition: Standard etc., som anvendes til kodning af en manifestations analoge videoindhold. @da
label: hat Videoformat @de
definition: Setzt eine Manifestation in Beziehung zu einem Schema oder Standard, das/der zum Kodieren des analogen Videoinhalts einer Manifestation verwendet wird. @de
toolkit label: Videoformat @de
toolkit definition: Ein Schema oder Standard, das/der zum Kodieren des analogen Videoinhalts einer Manifestation verwendet wird. @de
label: té com a format vídeo @ca
definition: Relaciona una manifestació amb un esquema o un estàndard que s’usa per codificar el contingut vídeo analògic d’una manifestació. @ca
toolkit label: format vídeo @ca
toolkit definition: Esquema o estàndard que s’usa per codificar el contingut vídeo analògic d’una manifestació. @ca
definition: Liittää manifestaation standardiin tai skeemaan, jota on käytetty manifestaation analogisen videon sisältöön. @fi
toolkit label: videoformaatti @fi
toolkit definition: Standardi tai skeema, jota on käytetty manifestaation analogisen videon sisältöön. @fi
toolkit definition: En standard etc. brukt til å kode det analoge videoinnholdet til en manifestasjon. @no
label: έχει μορφότυπο βίντεο @el
definition: Συνδέει μια εκδήλωση με ένα πρότυπο κ.λπ. που χρησιμοποιείται για την κωδικοποίηση του περιεχομένου ενός αναλογικού βίντεο μιας εκδήλωσης. @el
toolkit label: μορφότυπο βίντεο @el
toolkit definition: Ένα πρότυπο κ.λπ. που χρησιμοποιείται για την κωδικοποίηση του περιεχομένου ενός αναλογικού βίντεο μιας εκδήλωσης. @el
has element type: 4
label: videóformátuma a következő: @hu
definition: Hozzákapcsol egy megjelenési formát egy sémához vagy szabványhoz, amelyet egy megjelenési forma analóg videótartalmának a kódolására használnak. @hu
toolkit label: videóformátuma: @hu
toolkit definition: Egy séma vagy szabvány, amelyet egy megjelenési forma analóg videótartalmának a kódolására használnak. @hu
label: videoformaatti @fi
definition: Relaterer en manifestasjon til en standard etc. brukt til å kode det analoge videoinnholdet til en manifestasjon. @no
label: heeft videoformaat @nl
definition: Relateert een manifestatie aan een schema of standaard dat is gebruikt om de analoge videocontent van een manifestatie te coderen. @nl
label: له شكل فيديو @ar
definition: يربط بين تجسيدة ومعيار، إلخ. مستخدم في تكويد محتوى الفيديو التناظري لتجسيدة. @ar
toolkit label: شكل فيديو @ar
toolkit definition: معيار، إلخ. مستخدم في تكويد محتوى الفيديو التناظري لتجسيدة. @ar
label: video formaat @et
definition: Seostab kehastuse analoogvideosisu kodeerimiseks kasutatud standardiga vms. @et
toolkit label: video formaat @et
toolkit definition: Analoogvideosisu kodeerimiseks kasutatud standard vms. @et
label: ha come formato video @it
definition: Correla una manifestazione a uno standard utilizzato per la codifica del contenuto video analogico di una manifestazione. @it
toolkit label: formato video @it
toolkit definition: Standard utilizzato per la codifica del contenuto video analogico di una manifestazione. @it
label: video formāts @lv
definition: Sasaista manifestāciju ar standartu, u.tml., manifestācijas analogā video satura kodēšanai. @lv
toolkit label: video formāts @lv
toolkit definition: Standarts, u.tml., manifestācijas analogā video satura kodēšanai. @lv
label: 有视频格式 @zh-hans
definition: 将一种载体表现与用于对一种载体表现的模拟视频内容进行编码的一个方案或标准关联起来。 @zh-hans
toolkit label: 视频格式 @zh-hans
toolkit definition: 用于对一种载体表现的模拟视频内容进行编码的一个方案或标准 @zh-hans
label: video formatı ile ilişkilidir @tr
definition: Bir gösterimi, bir gösterimin analog video içeriğini kodlamak için kullanılan bir şema veya standartla ilişkilendirir. @tr
toolkit label: video formatı @tr
toolkit definition: Bir gösterimin analog video içeriğini kodlamak için kullanılan bir şema veya standart. @tr
label: tiene formato de video @es
definition: Relaciona una manifestación con un esquema o estándar que se utiliza para codificar el contenido de vídeo analógico de una manifestación. @es
has subproperty: P30104

has details of video format
status: Published
type: Property
lexical alias: detailsOfVideoFormat.en
definition: Relates a manifestation to details of a schema or standard that is used to encode the analog video content of a manifestation.
domain: C10007
instruction number: 3.18.2.4
toolkit label: details of video format
toolkit definition: Details of a schema or standard that is used to encode the analog video content of a manifestation.
toolkit label: detalles del formato de video @es
toolkit definition: Detalles de un esquema o estándar que se utiliza para codificar el contenido de vídeo analógico de una manifestación. @es
sub property of: has details of video characteristic
label: har detaljerad information om videoformat @sv
toolkit label: detaljerad information om videoformat @sv
toolkit label: details van videoformaat @nl
toolkit definition: Details van een schema of standaard dat gebruikt is om de analoge videocontent van een manifestatie te coderen. @nl
label: có chi tiết của định dạng video @vi
definition: Liên kết biểu thị với chi tiết của chuẩn, v.v..., được sử dụng để ghi mã nội dung video tương tự của biểu thị. @vi
toolkit label: chi tiết của định dạng video @vi
toolkit definition: Chi tiết của chuẩn, v.v..., được sử dụng để ghi mã nội dung video tương tự của biểu thị. @vi
label: har detaljer om videoformat @da
definition: Relaterer en manifestation til detaljer om en standard etc., som anvendes til kodning af en manifestations analoge videoindhold. @da
toolkit label: detaljer om videoformat @da
toolkit definition: Detaljer om en standard etc., som anvendes til kodning af en manifestations analoge videoindhold. @da
label: hat Details zum Videoformat @de
definition: Setzt eine Manifestation in Beziehung zu den Details zu einem Schema oder Standard, das/der zur Kodierung des analogen Videoinhalts einer Manifestation verwendet wird. @de
toolkit label: Details zum Videoformat @de
toolkit definition: Details zu einem Schema oder Standard, das/der zur Kodierung des analogen Videoinhalts einer Manifestation verwendet wird. @de
label: té com a particularitats de format vídeo @ca
definition: Relaciona una manifestació amb les particularitats d’un esquema o d’un estàndard que s’usa per codificar el contingut vídeo analògic d’una manifestació. @ca
toolkit label: particularitats de format vídeo @ca
toolkit definition: Particularitats d’un esquema o d’un estàndard que s’usa per codificar el contingut vídeo analògic d’una manifestació. @ca
definition: Liittää manifestaation tarkempiin tietoihin analogisen videon koodaukseen käytetystä skeemasta tai standardista. @fi
toolkit label: videoformaatin tarkemmat tiedot @fi
toolkit definition: Tarkemmat tiedot analogisen videon koodaukseen käytetystä skeemasta tai standardista. @fi
toolkit label: detaljer vedrørende videoformat @no
toolkit definition: Detaljer vedrørende en standard etc. som er brukt til å kode det analoge videoinnholdet til en manifestasjon. @no
label: έχει λεπτομέρειες του μορφότυπου του βίντεο @el
definition: Συνδέει μια εκδήλωση με τις λεπτομέρειες ενός προτύπου κ.λπ. που χρησιμοποιείται για την κωδικοποίηση του περιεχομένου ενός αναλογικού βίντεο μιας εκδήλωσης. @el
toolkit label: λεπτομέρειες του μορφότυπου του βίντεο @el
toolkit definition: Λεπτομέρειες ενός προτύπου κ.λπ. που χρησιμοποιείται για την κωδικοποίηση του περιεχομένου ενός αναλογικού βίντεο μιας εκδήλωσης. @el
label: a pour particularités d’un format vidéo @fr
definition: Met une manifestation en relation avec des particularités d’une norme ou d’un schéma qui est utilisé pour encoder le contenu vidéo analogique d’une manifestation. @fr
toolkit label: particularités d’un format vidéo @fr
toolkit definition: Particularités d’une norme ou d’un schéma qui est utilisé pour encoder le contenu vidéo analogique d’une manifestation. @fr
has element type: 6
label: videóformátum részletei a következők: @hu
definition: Hozzákapcsol egy megjelenési formát azon séma vagy szabvány részleteihez, amelyet egy megjelenési forma analóg tartalmának kódolására használnak. @hu
toolkit label: videóformátum részletei: @hu
toolkit definition: Azon séma vagy szabvány részletei, amelyet egy megjelenési forma analóg tartalmának kódolására használnak. @hu
label: videoformaatin tarkemmat tiedot @fi
label: har detaljer vedrørende videoformat @no
definition: Relaterer en manifestasjon til detaljer vedrørende en standard etc. som er brukt til å kode det analoge videoinnholdet til en manifestasjon. @no
label: heeft details van videoformaat @nl
definition: Relateert een manifestatie aan details van een schema of standaard dat gebruikt is om de analoge videocontent van een manifestatie te coderen. @nl
label: له تفاصيل شكل فيديو @ar
definition: يربط بين تجسيدة وتفاصيل معيار، إلخ. مستخدم في تكويد محتوى الفيديو التناظري لتجسيدة. @ar
toolkit label: تفاصيل شكل فيديو @ar
toolkit definition: تفاصيل معيار، إلخ. مستخدم في تكويد محتوى الفيديو التناظري لتجسيدة. @ar
label: video formaadi täpsustus @et
definition: Seostab kehastuse täpsemate andmetega analoogvideosisu kodeerimiseks kasutatud standardi vms kohta. @et
toolkit label: video formaadi täpsustus @et
toolkit definition: Täpsemad andmed analoogvideosisu kodeerimiseks kasutatud standardi vms kohta. @et
label: ha come particolari relativi al formato video @it
definition: Correla una manifestazione ai particolari relativi a uno standard, etc. utilizzato per la codifica del contenuto video analogico di una risorsa. @it
toolkit label: particolari relativi al formato video @it
toolkit definition: Particolari relativi a uno standard, etc. utilizzato per la codifica del contenuto video analogico di una risorsa. @it
label: detalizēti par videoformātu @lv
definition: Sasaista manifestāciju ar sīkāku informāciju par standartu, u.tml., kas izmantots analogā video manifestācijas satura kodēšanai. @lv
toolkit label: detalizēti par videoformātu @lv
toolkit definition: Sīkāka informācija par standartu, u.tml., kas izmantots analogā video manifestācijas satura kodēšanai. @lv
label: 有视频格式的细节 @zh-hans
definition: 将一种载体表现与用于对一种载体表现的模拟视频内容进行编码的一个方案或标准的细节关联起来。 @zh-hans
toolkit label: 视频格式的细节 @zh-hans
toolkit definition: 用于对一种载体表现的模拟视频内容进行编码的一个方案或标准的细节 @zh-hans
label: video formatı ayrıntıları ile ilişkilidir @tr
definition: Bir gösterimi, bir gösterimin analog video içeriğini kodlamak için kullanılan bir şemanın veya standardın ayrıntılarıyla ilişkilendirir. @tr
toolkit label: video formatının ayrıntıları @tr
toolkit definition: Bir gösterimin analog video içeriğini kodlamak için kullanılan bir şema veya standardın ayrıntıları. @tr
label: tiene detalles del formato de video @es

has video characteristic
status: Published
definition: Relates a manifestation to a technical specification relating to the encoding of video images in a manifestation.
type: Property
domain: C10007
lexical alias: videoCharacteristic.en
instruction number: 3.18
toolkit label: video characteristic
toolkit definition: A technical specification relating to the encoding of video images in a manifestation.
label: a pour caractéristique vidéo @fr
definition: Met une manifestation en relation avec une spécification technique relative à l’encodage des images vidéo dans une manifestation. @fr
toolkit label: caractéristique vidéo @fr
toolkit definition: Spécification technique relative à l’encodage des images vidéo dans une manifestation. @fr
toolkit label: característica de vídeo @es
toolkit definition: Una especificación técnica relativa a la codificación de imágenes de vídeo en una manifestación. @es
label: har videokaraktäristika @sv
toolkit label: videokaraktäristika @sv
toolkit label: kenmerken video @nl
toolkit definition: Een technische specificatie gerelateerd aan de codering van videobeelden in een resource. @nl
label: có đặc trưng video @vi
definition: Liên kết biểu thị với đặc tính kỹ thuật liên quan tới ghi mã hình ảnh video trong biểu thị. @vi
toolkit label: đặc trưng video @vi
toolkit definition: Đặc tính kỹ thuật liên quan tới ghi mã hình ảnh video trong biểu thị. @vi
label: har videokarakteristika @da
definition: Relaterer en manifestation til en teknisk specifikation, som relaterer til kodningen af videobilleder i en manifestation. @da
toolkit label: videokarakteristika @da
toolkit definition: Teknisk specifikation, som relaterer til kodningen af videobilleder i en manifestation. @da
label: hat Video-Eigenschaft @de
definition: Setzt eine Manifestation in Beziehung zu einer technischen Spezifikation, die sich auf die Kodierung von Videobildern in einer Manifestation bezieht. @de
toolkit label: Video-Eigenschaft @de
toolkit definition: Eine technische Spezifikation, die sich auf die Kodierung von Videobildern in einer Manifestation bezieht. @de
label: té com a característica vídeo @ca
definition: Relaciona una manifestació amb una especificació tècnica relativa a la codificació d’imatges de vídeo d’una manifestació. @ca
toolkit label: característica vídeo @ca
toolkit definition: Especificació tècnica relativa a la codificació d’imatges de vídeo d’una manifestació. @ca
definition: Liittää manifestaation manifestaation sisältämän videon koodauksen tekniseen määritykseen. @fi
toolkit label: videon ominaisuudet @fi
toolkit definition: Manifestaation sisältämien videon koodauksen tekninen määritys. @fi
toolkit label: videoegenskaper @no
toolkit definition: En teknisk spesifikasjon knyttet til kodingen av videobilder i en manifestasjon. @no
label: έχει χαρακτηριστικό του βίντεο @el
definition: Συνδέει μια εκδήλωση με μια τεχνική προδιαγραφή που σχετίζεται με την κωδικοποίηση των εικόνων βίντεο σε μια εκδήλωση. @el
toolkit label: χαρακτηριστικό βίντεο @el
toolkit definition: Μια τεχνική προδιαγραφή που σχετίζεται με την κωδικοποίηση των εικόνων βίντεο σε μια εκδήλωση. @el
has element type: 4
label: videójellemzője a következő: @hu
definition: Hozzákapcsol egy megjelenési formát egy műszaki specifikációhoz, amely egy megjelenési formában a videóképek kódolásához kapcsolódik. @hu
toolkit label: videójellemzője: @hu
toolkit definition: Egy műszaki specifikáció, amely egy megjelenési formában a videóképek kódolásához kapcsolódik. @hu
label: videon ominaisuudet @fi
label: har videoegenskaper @no
definition: Relaterer en manifestasjon til en teknisk spesifikasjon knyttet til kodingen av videobilder i en manifestasjon. @no
label: heeft kenmerken video @nl
definition: Relateert een manifestatie aan een technische specificatie gerelateerd aan de codering van videobeelden in een manifestatie. @nl
label: له خاصية فيديو @ar
definition: يربط بين تجسيدة وخصائص فنية متعلقة بتكويد الفيديو في تجسيدة. @ar
toolkit label: خاصية فيديو @ar
toolkit definition: خصائص فنية متعلقة بتكويد الفيديو في تجسيدة. @ar
label: video tunnus @et
definition: Seostab kehastuse tehnilise kirjeldusega, mis puudutab kehastuses sisalduvate videokujutiste kodeeringut. @et
toolkit label: video tunnus @et
toolkit definition: Tehniline kirjeldus, mis puudutab kehastuses sisalduvate videokujutiste kodeeringut. @et
label: ha come caratteristica video @it
definition: Correla una manifestazione a una specifica tecnica relativa alla codifica di immagini video di una manifestazione. @it
toolkit label: caratteristica video @it
toolkit definition: Specifica tecnica relativa alla codifica di immagini video di una manifestazione. @it
label: video raksturojums @lv
definition: Sasaista manifestāciju ar tehnisko specifikāciju, kas attiecas uz videoattēlu kodējumu manifestācijā. @lv
toolkit label: video raksturojums @lv
toolkit definition: Tehniska specifikācija, attiecināma uz videoattēlu kodējumu manifestācijā. @lv
label: 有视频特征 @zh-hans
definition: 将一种载体表现与和一种载体表现中的视频的编码有关的一个技术规格关联起来。 @zh-hans
toolkit label: 视频特征 @zh-hans
toolkit definition: 和一种载体表现中的视频的编码有关的一个技术规格 @zh-hans
label: video özelliği ile ilişkilidir @tr
definition: Bir gösterimi, bir gösterimdeki video görüntülerinin kodlanmasıyla ilgili bir teknik şartnameyle ilişkilendirir. @tr
toolkit label: video özelliği @tr
toolkit definition: Bir gösterimde video görüntülerinin kodlanmasıyla ilgili teknik bir şartname. @tr
label: tiene característica de vídeo @es
definition: Relaciona una manifestación con una especificación técnica relativa a la codificación de imágenes de vídeo en una manifestación. @es

has details of video characteristic
status: Published
type: Property
lexical alias: detailsOfVideoCharacteristic.en
definition: Relates a manifestation to details of a technical specification relating to the encoding of video images in a manifestation.
domain: C10007
instruction number: 3.18.1.4
toolkit label: details of video characteristic
toolkit definition: Details of a technical specification relating to the encoding of video images in a manifestation.
toolkit label: detalles de la característica del video @es
toolkit definition: Detalles de una especificación técnica relativa a la codificación de imágenes de vídeo en una manifestación. @es
label: har detaljerad information om videokaraktäristika @sv
toolkit label: detaljerad information om videokaraktäristika @sv
toolkit label: details van videokenmerken @nl
toolkit definition: Details van een technische specificatie gerelateerd aan de codering van videobeelden in een resource. @nl
label: có chi tiết của đặc trưng video @vi
definition: Liên kết biểu thị với chi tiết của đặc tính kỹ thuật liên quan tới ghi mã hình ảnh video trong biểu thị. @vi
toolkit label: chi tiết của đặc trưng video @vi
toolkit definition: Chi tiết của đặc tính kỹ thuật liên quan tới ghi mã hình ảnh video trong biểu thị. @vi
label: har detaljer om videokarakteristika @da
definition: Relaterer en manifestation til detaljer om en teknisk specifikation, som relaterer til kodning af videobilleder i en manifestation. @da
toolkit label: detaljer om videokarakteristika @da
toolkit definition: Detaljer om en teknisk specifikation, som relaterer til kodning af videobilleder i en manifestation. @da
label: hat Details zur Video-Eigenschaft @de
definition: Setzt eine Manifestation in Beziehung zu den Details zu einer technischen Spezifikation, die sich auf die Kodierung von Videobildern in einer Manifestation bezieht. @de
toolkit label: Details zur Video-Eigenschaft @de
toolkit definition: Details zu einer technischen Spezifikation, die sich auf die Kodierung von Videobildern in einer Manifestation bezieht. @de
label: té com a particularitats de característiques vídeo @ca
definition: Relaciona una manifestació amb les particularitats d’una especificació tècnica relativa a la codificació d’imatges de vídeo en una manifestació. @ca
toolkit label: particularitats de característiques vídeo @ca
toolkit definition: Particularitats d’una especificació tècnica relativa a la codificació d’imatges de vídeo en una manifestació. @ca
definition: Liittää manifestaation tarkempiin tietoihin manifestaation sisältämän videon koodauksen teknisestä määrityksestä. @fi
toolkit label: videon ominaisuuksien tarkemmat tiedot @fi
toolkit definition: Tarkemmat tiedot manifestaation sisältämän videon koodauksen teknisestä määrityksestä. @fi
toolkit label: detaljer vedrørende videoegenskaper @no
toolkit definition: Detaljer vedrørende en teknisk spesifikasjon knyttet til kodingen av videobilder i en manifestasjon. @no
label: έχει λεπτομέρειες του χαρακτηριστικού του βίντεο @el
definition: Συνδέει μια εκδήλωση με τις λεπτομέρειες μιας τεχνικής προδιαγραφής που συνδέεται με την κωδικοποίηση εικόνων βίντεο σε μια εκδήλωση. @el
toolkit label: λεπτομέρειες του χαρακτηριστικού του βίντεο @el
toolkit definition: Λεπτομέρειες μιας τεχνικής προδιαγραφής που συνδέεται με την κωδικοποίηση εικόνων βίντεο σε μια εκδήλωση. @el
label: a pour particularités d’une caractéristique vidéo @fr
definition: Met une manifestation en relation avec des particularités d’une spécification technique relative à l’encodage des images vidéo dans une manifestation. @fr
toolkit label: particularités d’une caractéristique vidéo @fr
toolkit definition: Particularités d’une spécification technique relative à l’encodage des images vidéo dans une manifestation. @fr
has element type: 6
label: videójellemző részletei a következők: @hu
definition: Hozzákapcsol egy megjelenési formát azon műszaki specifikáció részleteihez, amely egy megjelenési formában videóképek kódolásához kapcsolódik. @hu
toolkit label: videójellemző részletei: @hu
toolkit definition: Azon műszaki specifikáció részletei, amely egy megjelenési formában videóképek kódolásához kapcsolódik. @hu
label: videon ominaisuuksien tarkemmat tiedot @fi
label: har detaljer vedrørende videoegenskaper @no
definition: Relaterer en manifestasjon til detaljer vedrørende en teknisk spesifikasjon knyttet til kodingen av videobilder i en manifestasjon. @no
label: heeft details van videokenmerken @nl
definition: Relateert een manifestatie aan details van een technische specificatie gerelateerd aan de codering van videobeelden in een resource. @nl
label: له تفاصيل خاصية فيديو @ar
definition: يربط بين تجسيدة وتفاصيل خصائص فنية المتعلقة بتكويد صور الفيديو في تجسيدة. @ar
toolkit label: تفاصيل خاصية فيديو @ar
toolkit definition: تفاصيل خصائص فنية المتعلقة بتكويد صور الفيديو في تجسيدة. @ar
label: video tunnuse täpsustus @et
definition: Seostab kehastuse täpsemate andmetega tehnilises kirjelduses, mis puudutab kehastuses sisalduvate videokujutiste kodeeringut. @et
toolkit label: video tunnuse täpsustus @et
toolkit definition: Täpsemad andmed tehnilises kirjelduses, mis puudutab kehastuses sisalduvate videokujutiste kodeeringut. @et
label: ha come particolari relativi alla caratteristica video @it
definition: Correla una manifestazione ai particolari relativi a una specifica tecnica relativa alla codifica di immagini video in una manifestazione. @it
toolkit label: particolari relativi alla caratteristica video @it
toolkit definition: Particolari relativi a una specifica tecnica relativa alla codifica di immagini video in una manifestazione. @it
label: detalizēti par video raksturojumu @lv
definition: Sasaista manifestāciju ar sīkāku informāciju par tehnisko specifikāciju, kas attiecas uz video attēlu kodējumu manifestācijā. @lv
toolkit label: detalizēti par video raksturojumu @lv
toolkit definition: Sīkāka informācija par tehnisko specifikāciju, kas attiecas uz video attēlu kodējumu manifestācijā. @lv
label: 有视频特征的细节 @zh-hans
definition: 将一种载体表现与和一种载体表现中的视频图像的编码有关的一个技术规格的细节关联起来。 @zh-hans
toolkit label: 视频特征的细节 @zh-hans
toolkit definition: 和一种载体表现中的视频图像的编码有关的一个技术规格的细节 @zh-hans
label: video özelliğinin ayrıntıları ile ilişkilidir @tr
definition: Bir gösterimi, bir gösterimdeki video görüntülerinin kodlanmasıyla ilgili bir teknik spesifikasyonun ayrıntılarıyla ilişkilendirir. @tr
toolkit label: video özelliğinin ayrıntıları @tr
toolkit definition: Bir gösterimdeki video görüntülerinin kodlanmasıyla ilgili teknik bir özelliğin ayrıntıları. @tr
label: tiene detalles de la característica del video @es
definition: Relaciona una manifestación con detalles de una especificación técnica relativa a la codificación de imágenes de vídeo en una manifestación. @es

a pour relation de manifestation tout-partie
status: Deprecated
type: Property
domain: C10007
lexical alias: wholePartManifestationRelationship.en
definition: Met une manifestation en relation avec une manifestation qui contient ou est contenue dans une autre manifestation. @fr
toolkit label: relation de manifestation tout-partie @fr
toolkit definition: Manifestation qui contient ou est contenue dans une autre manifestation. @fr
toolkit label: relación de la manifestación todo-parte @es
toolkit definition: Una manifestación que está incluida en, o contiene la manifestación. @es
sub property of: has related manifestation of manifestation
instruction number: 24.5
toolkit label: geheel-deel manifestatie relatie @nl
toolkit definition: Een manifestatie die in de manifestatie is opgenomen of die deze bevat. @nl
label: có mối quan hệ biểu thị toàn bộ phần @vi
definition: Liên kết biểu thị với biểu thị chứa hoặc được chứa trong biểu thị khác. @vi
toolkit label: mối quan hệ biểu thị toàn bộ-phần @vi
toolkit definition: Biểu thị chứa hoặc được chứa trong biểu thị khác. @vi
label: har helheds-del manifestationsrelation @da
definition: Relaterer en manifestation til en manifestation der er indeholdt i eller indeholder en manifestation. @da
toolkit label: helheds-del manifestationsrelation @da
toolkit definition: Manifestation der er indeholdt i eller indeholder en manifestation. @da
label: hat Teil-Ganzes-Beziehung auf Manifestationsebene @de
definition: Setzt eine Manifestation mit einer Manifestation, die in einer anderen Manifestation enthalten ist oder eine andere Manifestation enthält, in Beziehung. @de
toolkit label: Teil-Ganzes-Beziehung auf Manifestationsebene @de
toolkit definition: Eine Manifestation, die in einer anderen Manifestation enthalten ist oder eine andere Manifestation enthält. @de
label: té com a relació de manifestació tot-part @ca
definition: Relaciona una manifestació amb una manifestació anifestació que és continguda o conté una altra manifestació. @ca
toolkit label: relació de manifestació tot-part @ca
toolkit definition: Manifestació que és continguda o conté una altra manifestació. @ca
label: manifestaation osa-kokonaisuussuhde @fi
definition: Liittää manifestaation manifestaatioon, joka sisältyy toiseen manifestaatioon tai sisältää toisen manifestaation. @fi
toolkit label: manifestaation osa-kokonaisuussuhde @fi
toolkit definition: Manifestaatio, joka sisältyy toiseen manifestaatioon tai sisältää toisen manifestaation. @fi
toolkit label: relasjonstypen hel/del av manifestasjon @no
toolkit definition: En manifestasjon som omfattes av eller selv omfatter en annen manifestasjon. @no
label: έχει σχέση συνόλου-τμήματος εκδήλωσης με @el
definition: Συνδέει μια εκδήλωση με μια εκδήλωση που περιέχεται σε ή περιέχει μια άλλη εκδήλωση. @el
toolkit label: σχέση συνόλου-τμήματος εκδήλωσης @el
toolkit definition: Μια εκδήλωση που περιέχεται σε ή περιέχει μια άλλη εκδήλωση. @el
has subproperty: P30213

has plate number for notated music
status: Published
definition: Relates a manifestation to a nomen that is an identifier for manifestation other than a publisher number for notated music, assigned by a publisher to a manifestation of a notated music expression to indicate the printing plate used in the printing process.
type: Property
scope note: The number normally appears at the bottom of each page, and sometimes on the title page. The number may include initials, abbreviations, or words identifying the publisher, or be followed by a number corresponding to the number of pages or plates or a number corresponding to an individual page or plate.
domain: C10007
sub property of: has identifier for manifestation
lexical alias: plateNumberForNotatedMusic.en
instruction number: 2.15.3
toolkit label: plate number for notated music
toolkit definition: A nomen that is an identifier for manifestation other than a publisher number for notated music, assigned by a publisher to a manifestation of a notated music expression to indicate the printing plate used in the printing process.
label: a pour cotage pour la musique notée @fr
definition: Met une manifestation en relation avec un nomen qui est un identifiant de manifestation, autre qu’un numéro d’éditeur pour la musique notée, attribué par un éditeur à une manifestation d’une expression de musique notée pour identifier la planche utilisée pour l’impression. @fr
scope note: Le numéro figure habituellement au bas de chaque page et parfois sur la page de titre. Le numéro peut comprendre des initiales, des abréviations ou des mots identifiant l’éditeur, ou être suivi d’un numéro correspondant au nombre de pages ou de planches ou d’un numéro correspondant à une page ou une planche individuelle. @fr
toolkit label: cotage pour la musique notée @fr
toolkit definition: Nomen qui est un identifiant de manifestation, autre qu’un numéro d’éditeur pour la musique notée, attribué par un éditeur à une manifestation d’une expression de musique notée pour identifier la planche utilisée pour l’impression. @fr
toolkit label: número de placa para música notada @es
toolkit definition: Un nomen que es un identificador de manifestación distinto de un número de editor para música notada, asignado por un editor a una manifestación de una expresión musical notada para indicar la plancha de impresión utilizada en el proceso de impresión. @es
label: har plåtnummer @sv
toolkit label: plåtnummer @sv
toolkit label: plaatnummer voor bladmuziek @nl
toolkit definition: Een nomen dat is een identificatie voor manifestatie, anders dan een uitgeversnummer voor bladmuziek, door een uitgever toegekend aan een manifestatie van een bladmuziek-expressie om aan te geven welke printplaat gebruikt is bij het drukproces. @nl
label: có chỉ số bản in cho âm nhạc ký hiệu @vi
definition: Liên kết biểu thị với định danh số được nhà xuất bản gán cho biểu thị âm nhạc ký hiệu. @vi
scope note: Chỉ số bản in cho âm nhạc ký hiệu đôi khi bao gồm viết tắt bằng các chữ cái đầu, viết tắt, hoặc các từ nhận dạng nhà xuất bản đó. Nó đôi khi được tiếp sau bởi con số tương ứng với số trang hoặc minh hoạ hoặc số tương ứng với trang hoặc minh hoạ riêng lẻ. @vi
toolkit label: chỉ số bản in cho âm nhạc ký hiệu @vi
toolkit definition: Định danh số được nhà xuất bản gán cho biểu thị âm nhạc ký hiệu. @vi
scope note: Het nummer staat meestal onderaan elke pagina, en soms opde titelpagina. Het nummer kan initialen, afkortingen of woorden die de uitgever identificeren bevatten, of gevolgd worden door een nummer dat het aantal pagina's of platen aangeeft, of een nummer dat een enkele pagina of plaat aangeeft. @nl
label: har pladenummer for noteret musik @da
definition: Relaterer en manifestation til et nomen, som er en identifikator for manifestation, som er en anden end et editionsnummer for noteret musik, tildelt af en udgiver af en manifestation af et noteret musikudtryk for at angive den trykplade, der er brugt i trykprocessen. @da
scope note: Nummeret fremtræder normalt nederst på hver side og sommetider på titelsiden. Nummeret kan sommetider indeholde intialer, forkortelser eller ord, som identificerer udgiveren, eller er efterfulgt af et nummer tilsvarende sideantal eller plader eller et nummer, som tilsvarer en enkeltside eller plade. @da
toolkit label: pladenummer for noteret musik @da
toolkit definition: Nomen, som er en identifikator for manifestation, som er en anden end et editionsnummer for noteret musik, tildelt af en udgiver af en manifestation af et noteret musikudtryk for at angive den trykplade, der er brugt i trykprocessen. @da
label: hat Druckplattennummer für Noten @de
definition: Setzt eine Manifestation in Beziehung zu einem Identifikator für eine Manifestation, der von einem Verlag einer Manifestation einer Noten-Expression zugewiesen wird, um die im Druckprozess verwendete Druckplatte anzugeben, und bei dem es sich nicht um die Noten-Bestellnummer handelt. @de
scope note: Die Nummer erscheint normalerweise am Ende jeder Seite und manchmal auf der Titelseite. Die Nummer kann aus Initialen, Abkürzungen oder Wörtern bestehen, die den Verlag identifizieren; ihr kann eine Zahl, die der Zahl der Seiten oder Platten entspricht oder einer Zahl, die einer einzelnen Seite oder Platte entspricht, folgen. @de
toolkit label: Druckplattennummer für Noten @de
toolkit definition: Ein Identifikator für eine Manifestation, der von einem Verlag einer Manifestation einer Noten-Expression zugewiesen wird, um die im Druckprozess verwendete Druckplatte anzugeben, und bei dem es sich nicht um die Noten-Bestellnummer handelt. @de
label: té com a número de planxa de música notada @ca
definition: Relaciona una manifestació amb un nomen que és un identificador de manifestació diferent d’un número d’editor de música notada, assignat per un editor a una manifestació d’una expressió de música notada per indicar la planxa d’impressió usada en el procés d’impressió. @ca
scope note: Normalment el número figura al peu de cada pàgina i de vegades a la portada. El número pot incloure inicials, abreviacions o paraules que identifiquen l’editor o anar seguit d’un número que correspon al nombre de pàgines o de planxes o a un número que correspon a una pàgina o una planxa individual. @ca
toolkit label: número de planxa de música notada @ca
toolkit definition: Nomen que és un identificador de manifestació diferent d’un número d’editor de música notada, assignat per un editor a una manifestació d’una expressió de música notada per indicar la planxa d’impressió usada en el procés d’impressió. @ca
definition: Liittää manifestaation nomeniin, joka on musiikin kustantajan nuottiaineiston ekspression manifestaatiolle antama tunniste, joka ei ole kustantajan nuottiaineistolle antama numero. Nuottiaineiston laatan numero ilmaisee, mitä painolaattaa on käytetty painamisprosessissa. @fi
toolkit label: nuottiaineiston laatan numero @fi
toolkit definition: Nomen, joka on musiikin kustantajan nuottiaineiston ekspression manifestaatiolle antama tunniste, joka ei ole kustantajan nuottiaineistolle antama numero. Nuottiaineiston laatan numero ilmaiseen, mitä painolaattaa on käytetty painamisprosessissa. @fi
toolkit label: platenummer for nedskrevet musikk @no
toolkit definition: En identifikator for musikk som ikker et et edisjonsnummer for nedskrevet musikk, angitt av en utgiver av en manifestasjon av et uttrykk av nedskrevet musikk for å indikere hvilken trykkplate som er brukt i trykkeprosessen. @no
label: έχει αριθμό της μήτρας για μουσική σημειογραφία @el
definition: Συνδέει μια εκδήλωση με έναν αριθμητικό προσδιορισμό που ανατίθεται σε μια εκδήλωση μουσικής σημειογραφίας από έναν εκδότη. @el
scope note: Ένας αριθμός μήτρας για τη μουσική σημειογραφία κάποιες φορές περιλαμβάνει αρχικά, συντομογραφίες ή λέξεις που ταυτίζουν τον εκδότη. Κάποιες φορές ακολουθείται από έναν αριθμό που αντιστοιχεί στον αριθμό των σελίδων ή των μητρών ή σε έναν αριθμό που αντιστοιχεί σε μια μεμονωμένη σελίδα ή μήτρα. @el
toolkit label: αριθμός μήτρας για μουσική σημειογραφία @el
toolkit definition: Ένας αριθμητικός προσδιορισμός που ανατίθεται σε μια εκδήλωση μουσικής σημειογραφίας από έναν εκδότη. @el
has element type: 3
label: zenei műjegyzéki lemezszáma a következő: @hu
definition: Egy megjelenési formát hozzákapcsol egy számozási jelöléshez, amelyet egy kiadó rendel hozzá egy kottázott zenei megjelenési formához. @hu
scope note: zenei műjegyzéki lemezszáma: @hu
toolkit label: Egy számozási jelölés, amelyet egy kiadó egy kottázott zenei megjelenési formához rendel hozzá. @hu
toolkit definition: Az azonosító általában a lapok alján látható, azonban előfordulhat a címoldalon is. A műjegyzéki lemezszám néha magába foglal kezdőbetűket, rövidítéseket vagy a kiadót megnevező szavakat. Időnként egy szám követi, amely megfelel az oldalak vagy lemezek számának vagy egy szám, amely megfelel egyedi oldalnak vagy lemeznek. @hu
scope note: Numero esiintyy yleensä jokaisen sivun alalaidassa ja joskus nimiösivulla. Numero voi sisältää kustantajaa identifioivia alkukirjainlyhenteitä, sanalyhenteitä tai sanoja. Numeron perässä voi olla vastaavien sivujen tai laattojen numerot tai yksittäisten sivujen ja laattojen numerot. @fi
label: nuottiaineiston laatan numero @fi
label: har platenummer for nedskrevet musikk @no
definition: Relaterer en manifestasjon til en identifikator for musikk som ikker et et edisjonsnummer for nedskrevet musikk, angitt av en utgiver av en manifestasjon av et uttrykk av nedskrevet musikk for å indikere hvilken trykkplate som er brukt i trykkeprosessen. @no
scope note: Nummeret finnes som regel i bunnen av hver side og noen ganger på tittelsiden. Nummeret kan inneholde initialer, forkortelser eller ord som identifiserer utgiveren, eller etterfølges av et nummer som korresponderer med nummereringen av sider eller plater eller et nummer som korresponderer med en enkeltside eller plate. @no
label: heeft plaatnummer voor bladmuziek @nl
definition: Relateert een manifestatie aan een nomen dat is een identificatie voor manifestatie, anders dan een uitgeversnummer voor bladmuziek, door een uitgever toegekend aan een manifestatie van een bladmuziek-expressie om aan te geven welke printplaat gebruikt is bij het drukproces. @nl
label: له رقم لوحة لموسيقى مدونة @ar
definition: يربط بين تجسيدة ومحدد تجسيدة بخلاف رقم ناشر خاص بمدونة موسيقيه، التى يخصصها ناشر لتجسيدة خاصة بتعبيرة مدونة موسيقية لتحديد اللوحات المستخدمة في عملية الطباعة. @ar
scope note: يظهر الرقم عادًة في نهاية كل صفحة، وفي بعض الأحيان في صفحة العنوان. قد يشمل الرقم أحرف استهلالية، أو اختصارات، أو كلمات تحدد الناشر، أو يكون متبوعًا برقم مناظر لعدد الصفحات أو اللوحات، أو رقم مناظر لصفحة أو للوحة بعينها. @ar
toolkit label: رقم لوحة لموسيقى مدونة @ar
toolkit definition: تسمية هي محدد تجسيدة بخلاف رقم ناشر خاص بمدونة موسيقيه، التى يخصصها ناشر لتجسيدة خاصة بتعبيرة مدونة موسيقية لتحديد اللوحات المستخدمة في عملية الطباعة. @ar
label: noodi trükiplaadinumber @et
definition: Seostab kehastuse kehastuse identifikaatoriga, mis ei ole noodi kirjastajanumber ja mille kirjastaja on andnud noodi väljenduse kehastusele, osutamaks trükkimiseks kasutatud trükiplaadile. @et
scope note: Number asub tavaliselt iga lehekülje jaluses ja mõnikord tiitellehel. Number võib sisaldada kirjastajat identifitseerivaid initsiaale, lühendeid või sõnu, sellele võib järgneda arv, mis vastab lehekülgede või trükiplaatide arvule, või arv, mis vastab üksikule leheküljele või trükiplaadile. @et
toolkit label: noodi trükiplaadinumber @et
toolkit definition: Kehastuse identifikaator, mis ei ole noodi kirjastajanumber ja mille kirjastaja on andnud noodi väljenduse kehastusele, osutamaks trükkimiseks kasutatud trükiplaadile. @et
label: ha come numero di lastra per la musica notata @it
definition: Correla una manifestazione a un identificatore per la manifestazione, diverso dal numero dell'editore per la musica notata, assegnato da un editore a una manifestazione di un'espressione di musica notata per identificare la lastra utilizzata nel processo di stampa. @it
scope note: Il numero compare normalmente in calce a ciascuna pagina e talvolta anche sul frontespizio. Il numero può comprendere iniziali, abbreviazioni, o parole che identificano l'editore. È seguito talvolta da un numero che corrisponde al numero di pagina o lastra individuale. @it
toolkit label: numero di lastra per la musica notata @it

Published
type: Concept

Deprecated
type: Concept

has accessibility content
status: Published
definition: Relates a manifestation to an indication of the kinds of expression that provide alternative sensory modes to perceive the main expressions that are embodied by an augmentation aggregate.
type: Property
domain: C10007
lexical alias: accessibilityContent.en
instruction number: 7.14
toolkit label: accessibility content
toolkit definition: An indication of the kinds of expression that provide alternative sensory modes to perceive the main expressions that are embodied by an augmentation aggregate.
scope note: Accessibility content includes accessible labels, an audio description, captioning, image descriptions, sign language, and subtitles. Accessibility content does not include subtitles in a language different from the spoken content.
sub property of: has supplementary content
label: saavutettavuussisältö @fi
definition: Liittää manifestaation ilmaukseen niistä ekspressioista, jotka tarjoavat vaihtoehtoisia aistintatapoja laajennusaggregaatin sisältämien pääekspressioiden vastaanottamiseksi. @fi
toolkit label: saavutettavuussisältö @fi
toolkit definition: Ilmaus niistä ekspressioista, jotka tarjoavat vaihtoehtoisia aistintatapoja laajennusaggregaatin sisältämien pääekspressioiden vastaanottamiseksi. @fi
scope note: Saavutettavuussisältö sisältää saavutettavat nimikkeet, kuunneltavan kuvauksen, otsikoinnin, kuvien kuvauksen, viittomakielen ja tekstityksen. Saavutettavuussisältö ei sisällä tekstitystä, joka eroaa puhutusta sisällöstä. @fi
toolkit definition: Een indicatie van de soorten expressies die alternatieve zintuiglijke modi bieden om de hoofd-expressie waar te nemen die verwezenlijkt zijn door een augmentatie-aggregaat. @nl
toolkit label: toegankelijkheidscontent @nl
label: heeft toegankelijkheidscontent @nl
definition: Relateert een manifestatie aan een indicatie van de soorten expressies die alternatieve zintuiglijke modi bieden om de hoofd-expressie waar te nemen die verwezenlijkt zijn in een augmentatie-aggregaat. @nl
scope note: Toegankelijkheidscontent omvat toegankelijke labels, een audiobeschrijving, bijschriften, beeldbeschrijvingen, gebarentaal en ondertitells. Toegankelijkheidscontent omvat niet ondertitels in een taal anders dan de gesproken content. @nl
label: uztveri atbalstošs saturs @lv
definition: Sasaista manifestāciju ar norādi par saturu, kas nodrošina alternatīvas maņu metodes, lai uztvertu sākotnējo saturu. @lv
toolkit label: uztveri atbalstošs saturs @lv
toolkit definition: Norāde par saturu, kas nodrošina alternatīvas maņu metodes, lai uztvertu sākotnējo saturu. @lv
scope note: Satura pieejamība ietver uzlīmes, audio aprakstu, parakstus (zem ilustrācijām), attēla aprakstu, žestu valodu un titrus. Satura pieejamība neietver titrus, kas atšķiras no runātas valodas. @lv
label: a pour contenu accessible @fr
definition: Met une manifestation en relation avec une indication des genres d’expressions qui fournissent des modes sensoriels de remplacement pour percevoir les expressions principales matérialisées par un agrégat par augmentation. @fr
toolkit label: contenu accessible @fr
toolkit definition: Indication des genres d’expressions qui fournissent des modes sensoriels de remplacement pour percevoir les expressions principales matérialisées par un agrégat par augmentation. @fr
scope note: Un contenu accessible comprend une description audio, les descriptions d’images, les étiquettes accessibles, la langue des signes, le sous-titrage pour malentendants et les sous-titres. Un contenu accessible ne comprend pas les sous-titres dans une langue différente de celle du contenu parlé. @fr
label: له محتوى إتاحة @ar
definition: يربط بين تجسيدة ومؤشر لأنواع التعبير التي توفر بديلًا لإدراك التعبير الأساسي الذي يتم تجسيده بواسطة إضافة تجميعة. @ar
toolkit label: محتوى إتاحة @ar
toolkit definition: مؤشر لأنواع التعبير التي توفر بديلًا لإدراك التعبير الأساسي الذي يتم تجسيده بواسطة إضافة تجميعة. @ar
scope note: يتضمن المحتوى التَسهيلي ملصقات يمكن الوصول إليها، وصف صوتي، تعليق، وصف الصور، لغة إشارة، وترجمات. ولا يتضمن محتوى الإتاحة ترجمات بلغة مختلفة عن المحتوى المنطوق. @ar
label: har tilgængelighedsfremmende indhold @da
definition: Relaterer en manifestation til en indikation af de typer af udtryk der giver alternative sansemåder for at forstå de hovedudtryk der er indholdt i en beriget samling. @da
toolkit label: tilgængelighedsfremmende indhold @da
toolkit definition: Indikation af de typer af udtryk der giver alternative sansemåder for at forstå de hovedudtryk der er indholdt i en beriget samling. @da
scope note: Tilgængelighedsfremmende indhold indeholder tilgængelighedsbetegnelser, lydbeskrivelse, rubrikker, billedbeskrivelser, tegnsprog og undertekster. Tilgængelighedsfremmende indhold indbegriber ikke undertekster i et sprog der ikke er det samme som det talte sprog. @da
label: hat barrierefreien Inhalt @de
definition: Setzt eine Manifestation in Beziehung zu einer Angabe der Expressionsarten, die alternative, sensorische Formen liefern, um die Hauptexpressionen wahrzunehmen, die durch ein Erweiterungsaggregat verkörpert werden. @de
toolkit label: Barrierefreier Inhalt @de
toolkit definition: Eine Angabe der Expressionsarten, die alternative, sensorische Formen liefern, um die Hauptexpressionen wahrzunehmen, die durch ein Erweiterungsaggregat verkörpert werden. @de
scope note: Zum barrierefreien Inhalt gehören barrierefreie Labels, eine Audiodeskription, Untertitel für Hörgeschädigte, Bildbeschreibungen, Gebärdensprache und Untertitel. Zum barrierefreien Inhalt gehören nicht die Untertitel in einer Sprache, die von dem gesprochenen Inhalt abweichen. @de
label: té com a contingut d’accessibilitat @ca
definition: Relaciona una manifestació amb una indicació de les classes d’expressió que proporcionen modes sensorials alternatius per percebre les expressions principals que es materialitzen en un agregat d’augmentació. @ca
toolkit label: contingut d’accessibilitat @ca
toolkit definition: Indicació de les classes d’expressió que proporcionen modes sensorials alternatius per percebre les expressions principals que es materialitzen en un agregat d’augmentació. @ca
scope note: El contingut d’accessibilitat inclou etiquetes accessibles, una descripció àudio, subtitulació per a persones sordes, descripcions d’imatges, llenguatge de signes i subtítols. El contingut d’accessibilitat no inclou subtítols en una llengua diferent a la del contingut parlat. @ca
has element type: 5
label: 有无障碍内容 @zh-hans
definition: 将一种载体表现与提供用于感知被一种附增合集具体化的主要内容表达的交替感官模式的内容表达的类型的指示关联起来。 @zh-hans
toolkit label: 无障碍内容 @zh-hans
toolkit definition: 提供用于感知被一种附增合集具体化的主要内容表达的交替感官模式的内容表达的类型的指示 @zh-hans
scope note: 无障碍内容包括无障碍标签、音频描述、说明文字、图像描述、记号语言和字幕。无障碍内容不包括不同于口语内容的另一种语言的字幕。 @zh-hans
label: akadálymentesített tartalma a következő: @hu
definition: Hozzákapcsol egy megjelenési formát egy kifejezési forma azon típusainak a jelöléséhez, amelyek alternatív érzékelési módokat nyújtanak a bővülésből eredő aggregátumban megtestesülő fő kifejezési forma észleléséhez. @hu
toolkit label: akadálymentesített tartalma: @hu
toolkit definition: Egy kifejezési forma azon típusainak a jelölése, amelyek alternatív érzékelési módokat nyújtanak a bővülésből eredő aggregátumban megtestesülő fő kifejezési forma észleléséhez. @hu
scope note: Az akadálymentesített tartalmak magukban foglalnak akadálymentes címkéket, hangzó leírást, képleírást, jelnyelvet és feliratozást. Az akadálymentesített tartalmakba nem tartoznak bele a beszélt tartalomtól eltérő nyelvű feliratok. @hu
label: erişilebilirlik içeriği ile ilişkilidir @tr
definition: Bir gösterimi, bütün artırım tarafından somutlaştırılmış ana ifadeleri algılamak için alternatif duyusal modlar sağlayan ifadenin türlerinin gösterimiyle ilişkilendirir. @tr
toolkit label: Erişilebilirlik içeriği @tr
toolkit definition: Bir artırılmış bütün tarafından somutlaştırılan ana ifadeleri algılamak için alternatif duyusal modlar sağlayan ifadelerin bir göstergesi. @tr
scope note: Erişilebilirlik içeriği, erişilebilir etiketler, sesli açıklama, resim açıklamaları, işaret dili ve altyazıları içerir. Erişilebilirlik içeriği, konuşulan içerikten farklı bir dilde altyazı içermez. @tr
label: tiene contenido de accesibilidad @es
definition: Relaciona una manifestación con una indicación de los tipos de expresión que proveen modos sensoriales alternativos para percibir la expresión principal que están materializados por un agregado de aumento. @es
toolkit label: contenido de accesibilidad @es
toolkit definition: Una indicación de los tipos de expresión que proveen modos sensoriales alternativos para percibir la expresión principal que están materializados por un agregado de aumento. @es
scope note: El contenido de accesibilidad incluye etiquetas accesibles, una descripción de audio, subtítulos descriptivos, lenguaje de señas y subtítulos. El contenido de accesibilidad no incluye subtítulos en un idioma diferente al del contenido hablado. @es
has subproperty: P30452

has colour content
status: Published
definition: Relates a manifestation to an indication of the presence of colour or tone embodied by a manifestation.
type: Property
domain: C10007
lexical alias: colourContent.en
instruction number: 7.17
has element type: 4
toolkit label: colour content
toolkit definition: An indication of the presence of colour or tone embodied by a manifestation.
alternative label: color content
scope note: Black, white, single colour shades of black, single colour tints of white, and single colour tones of gray are considered to be single colours. Colour content applies to an expression with a value of "cartographic image", "cartographic moving image", "cartographic three-dimensional form", "notated movement", "notated music", "performed movement", "still image", "text", "three-dimensional moving image", "three-dimensional form", or "two-dimensional moving image" for content type.
label: värisisältö @fi
definition: Liittää manifestaation manifestaatioon sisältyvän värin tai sävyn ilmaukseen. @fi
toolkit label: värisisältö @fi
toolkit definition: Manifestaatioon sisältyvän värin tai sävyn ilmaus. @fi
scope note: Musta, valkoinen, yksiväriset mustan sävyt, yksiväriset valkoisen sävyt ja yksiväriset harmaan sävyt lasketaan yksivärisiksi. Kuvasisältöä sovelletaan ekspressioon, jonka sisältötyypin arvo on "kartografinen kuva", "kartografinen liikkuva kuva", "kartografinen kolmiulotteinen muoto", "liikenotaatio", "nuottiaineisto", "esitetty liike", "stillkuva", "teksti", " kolmiulotteinen liikkuva kuva", "kolmiulotteinen muoto" tai "kaksiulotteinen liikkuva kuva". @fi
toolkit definition: Een indicatie van de aanwezigheid van kleur of toon verwezenlijkt door een manifestatie. @nl
toolkit label: kleurcontent @nl
label: heeft kleurcontent @nl
definition: Relateert een manifestatie aan een indicatie van de aanwezigheid van kleur of toon verwezenlijkt door een manifestatie. @nl
scope note: Zwart, wit, éénkleurige schakeringen van zwart, éénkleurige tinten wit, en eenkleurige tonen van grijs worden beschouwd als enkele kleur. Kleurcontent is van toepassing op een expressie met een waarde van "cartografisch beeld", "cartografisch bewegend beeld", "cartografische driedimensionale vorm", "bewegingsnotatie", "muzieknotatie", "uitgevoerde beweging", "niet-bewegend beeld", "tekst", "driedimensionaal bewegend beeld", "driedimensionale vorm", of "tweedimensionaal bewegend beeld" als type content. @nl
label: krāsainība @lv
definition: Sasaista manifestāciju ar norādi par krāsas, toņa u.tml. klātbūtni izteiksmes saturā. @lv
toolkit label: krāsainība @lv
toolkit definition: Krāsas, toņa u.tml. klātbūtne izteiksmes saturā. @lv
scope note: Melns, balts un pelēkie toņi tiek uzskatīti par vienu krāsu.Melns, balts un pelēkie toņi tiek uzskatīti par vienu krāsu. Krāsas saturs ir izteiksmēm, kuru satura veids ir "kartogrāfisks attēls", "kustīgs kartogrāfisks attēls", "kartogrāfiska trīsdimensiju forma", "kustības pieraksts", "notācija", "kustības izpildījums", "attēls", "teksts", "trīsdimensiju kustīgs attēls", "trīsdimensiju forma" vai "divdimensiju kustīgs attēls". @lv
label: a pour contenu de couleur @fr
definition: Met une manifestation en relation avec une indication de la présence de couleur ou de teinte matérialisée par une manifestation. @fr
toolkit label: contenu de couleur @fr
toolkit definition: Indication de la présence de couleur ou de teinte matérialisée par une manifestation. @fr
scope note: Le noir et le blanc sont considérés comme étant des couleurs ; les différents tons d’une même couleur obtenus en ajoutant du noir, du blanc ou du gris sont considérés comme étant une seule couleur. Le contenu de couleur s’applique à une expression ayant une valeur de « forme cartographique tridimensionnelle », « forme tridimensionnelle », « image animée bidimensionnelle », « image animée tridimensionnelle », « image cartographique », « image cartographique animée », « image fixe », « mouvement exécuté », « mouvement noté », « musique notée » ou « texte » pour type de contenu. @fr
label: له محتوى ملون @ar
definition: يربط بين تجسيدة ومؤشر وجود اللون أو درجة اللون في تجسيدة. @ar
toolkit label: محتوى ملون @ar
toolkit definition: مؤشر وجود اللون أو درجة اللون في تجسيدة. @ar
alternative label: محتوى ملون @ar
label: har farveindhold @da
definition: Relaterer en manifestation til en indikation af nærvær af farve wller tone indholdt i en manifestation. @da
toolkit label: farveindhold @da
toolkit definition: Indikation af nærvær af farve eller tone indholdt i en manifestation. @da
alternative label: farveindhold @da
scope note: Sort, hvid, enkelte farvenuancer af sort, enkelte farvenuancer af hvid og enkelte farvetoner af grå betragtes som enkelte farver. Farveindhold bruges for et udtryk med en værdi af "kartografisk billede", "kartografisk levende billede", "kartografisk tredimensional form", "noteret bevægelse", "noteret musik", "fremført bevægelse", "stillbillede", "tekst", "tredimensional levende billede", "tredimensional form" eller "todimensional form" eller todimensional levende billede, som indholdstype. @da
label: hat Farbinhalt @de
definition: Setzt eine Manifestation in Beziehung zu einer Angabe über das Vorhandensein von Farbe oder Tönung, die durch eine Manifestation verkörpert werden. @de
toolkit label: Farbinhalt @de
toolkit definition: Eine Angabe über das Vorhandensein von Farbe oder Tönung, die durch eine Manifestation verkörpert werden. @de
scope note: Schwarz, Weiß, einfarbige Schwarztöne, einfarbige Weißtönungen und einfarbige Grauschattierungen werden als einfarbig angesehen. Farbinhalt gibt es in einer Expression mit dem Wert kartografisches Bild, kartografisches Bewegtbild, kartografische dreidimensionale Form, Bewegtnotation, Noten, aufgeführte Bewegung, unbewegtes Bild, Text, dreidimensionales Bewegtbild, dreidimensionale Form oder zweidimensionales Bewegtbild. @de
label: té com a contingut de color @ca
definition: Relaciona una manifestació amb una indicació de la presència de color o to materialitzat en una manifestació. @ca
toolkit label: contingut de color @ca
toolkit definition: Indicació de la presència de color o to materialitzat en una manifestació. @ca
scope note: Es consideren colors únics el negre, el blanc, els tons de negre, els matisos de blanc i els tons de gris. El contingut de color s’aplica a una expressió amb un valor de "imatge cartogràfica", "imatge cartogràfica en moviment", "forma tridimensional cartogràfica", "moviment notat", "música notada", "moviment executat", "imatge fixa", " text", "imatge en moviment tridimensional", "forma tridimensional" o "imatge en moviment bidimensional" per al tipus de contingut. @ca
alternative label: 颜色内容 @zh-hans
label: 有颜色内容 @zh-hans
definition: 将一种载体表现与一种载体表现所具体化的颜色或色调出现的指示关联起来。 @zh-hans
toolkit label: 颜色内容 @zh-hans
toolkit definition: 一种载体表现所具体化的颜色或色调出现的指示 @zh-hans
scope note: 黑色、白色、单色黑阴影、单色白色调、单色灰色调都被认为是单色。颜色内容适用于有如下内容类型值的内容表达：“地图图像”、“地图动态图像”、“地图三维形式”、“动作谱”、“乐谱”、“表演动作”、“静止图像”、“文本”、“三维动态图像”、“三维形式”、或“二维动态图像”。 @zh-hans
alternative label: színtartalom: @hu
label: színtartalma a következő: @hu
definition: Hozzákapcsol egy megjelenési formát egy megjelenési formában megtestesülő, szín vagy színárnyalat jelenlétét mutató jelöléshez. @hu
toolkit label: színtartalma: @hu
toolkit definition: Egy megjelenési formában megtestesülő, szín vagy színárnyalat jelenlétét mutató jelölés. @hu
scope note: Alapszíneknek tekinthetők a fekete, a fehér, valamint az alapszínek feketével, fehérrel és szürkével kevert árnyalatai. A színtartalom azon kifejezési formákra vonatkozik, amelyeknek a tartalomtípusa "kartográfiai kép", "kartográfiai mozgókép", "háromdimenziós kartográfiai forma", "lejegyzett mozgás"; "lejegyzett zene", "előadott mozgás", "állókép", "szöveg", "háromdimenziós mozgókép", "háromdimenziós forma" vagy "kétdimenziós mozgókép". @hu
alternative label: renk içeriği @tr
label: renk içeriği ile ilişkilidir @tr
definition: Bir gösterimi, bir gösterim tarafından somutlaştırılmış rengin veya tonun varlığının göstergesiyle ilişkilendirir. @tr
toolkit label: renk içeriği @tr
toolkit definition: Bir gösterim tarafından somutlaştırılmış rengin veya tonun varlığının bir göstergesi. @tr
scope note: Siyah, beyaz, siyahın tek renk tonları, beyazın tek renk tonları, ve grinin tek renk tonları; tekli tonlar olarak görülür. Renk içeriği, içerik türü için "kartografik görüntü", "kartografik hareketli görüntü", "kartografik üç boyutlu form", "notalı hareket", "notalı müzik", "icra edilen hareket", "sabit görüntü", "metin", "üç boyutlu hareketli görüntü", "üç boyutlu form" veya "iki boyutlu hareketli görüntü" değerine sahip bir anlatım için geçerlidir. @tr
alternative label: contenido de color @es
label: tiene contenido de color @es
definition: Relaciona una manifestación con una indicación de la presencia de color o tono materializada por una manifestación. @es
toolkit label: contenido de color @es
toolkit definition: Una indicación de la presencia de color o tono materializada por una manifestación. @es
scope note: Negro, blanco, matices de negro de un solo color, tintes de blanco de un solo color y tonos de gris de un solo color se consideran colores solos. El contenido de color aplica a una expresión con un valor de "imagen cartográfica", imagen cartográfica en movimiento", "forma cartográfica tridimensional", "movimiento notado", "música notada", "movimiento interpretado", "imagen fija", "texto", "imagen tridimensional en movimiento", "forma tridimensional" o "imagen bidimensional en movimiento" para tipo de contenido. @es
has subproperty: P30456
alternative label: kleurcontent @nl

has illustrative content
status: Published
definition: Relates a manifestation to an indication of the kinds of expression of image content that supplement the main expressions that are embodied by an augmentation aggregate.
type: Property
domain: C10007
lexical alias: illustrativeContent.en
instruction number: 7.15
has element type: 4
toolkit label: illustrative content
toolkit definition: An indication of the kinds of expression of image content that supplement the main expressions that are embodied by an augmentation aggregate.
scope note: Illustrative content applies to an aggregate that embodies an expression with a value of "cartographic image", "cartographic moving image", "cartographic tactile image", "cartographic tactile three-dimensional form", "cartographic three-dimensional form", "three-dimensional moving image", "two-dimensional moving image", "tactile three-dimensional form", "three-dimensional form", "still image", or "tactile image" for content type. Tables containing only words or numerical data are excluded.
sub property of: has supplementary content
label: kuvasisältö @fi
definition: Liittää manifestaation ilmaukseen niistä kuvasisällön ekspressioista, jotka täydentävät laajennusaggregaatin sisältämiä pääekspressioita. @fi
toolkit label: kuvasisältö @fi
toolkit definition: Ilmaus niistä kuvasisällön ekspressioista, jotka täydentävät laajennusaggregaatin sisältämiä pääekspressioita. @fi
scope note: Kuvasisältöä sovelletaan aggregaatteihin, jotka sisältävät ekspression, jonka sisältötyypin arvo on "kartografinen kuva", "kartografinen liikkuva kuva", "kartografinen taktiili kuva", "kartografinen taktiili kolmiulotteinen muoto", "kartografinen kolmiulotteinen muoto", "kolmiulotteinen liikkuva kuva", "kaksiulotteinen liikkuva kuva", "taktiili kolmiulotteinen muoto", "kolmiulotteinen muoto", "stillkuva" tai "taktiili kuva". Vain tekstiä ja numeerisia tietoja sisältävät taulukot eivät sisälly kuvasisältöön. @fi
toolkit definition: Een indicatie van de soorten expressies van beeldcontent die de hoofd-expressies aanvullen die verwezenlijkt zijn door een augmentatie-aggregaat. @nl
toolkit label: illustratieve content @nl
label: heeft illustratieve content @nl
definition: Relateert een manifestatie aan een indicatie van de soorten expressies van beeldcontent die de hoofd-expressies aanvullen die verwezenlijkt zijn door een augmentatie-aggregaat. @nl
scope note: illustratieve content heeft betrekking op een aggregaat dat een expressie verwezenlijkt met een waarde van "cartografisch beeld", "cartografisch bewegend beeld", "cartografisch tactiel beeld", "cartografische tactiele driedimensionale vorm", "cartografische driedimensionale vorm", "driedimensionaal bewegend beeld", "tweedimensionaal bewegend beeld", "tactiele driedimensionale vorm", "niet-bewegend beeld" of "tactiel beeld" als type content. Tabellen die alleen woorden en numerieke data bevatten zijn uitgesloten. @nl
label: ilustratīvs saturs @lv
definition: Sasaista manifestāciju ar norādi par saturu, kas paredzēts izteiksmes pamatsatura ilustrācijai. @lv
toolkit label: ilustratīvs saturs @lv
toolkit definition: Saturs, kas paredzēts izteiksmes pamatsatura ilustrācijai. @lv
scope note: Neietver tabulas, kurās ir tikai vārdi un/vai skaitļi. @lv
label: a pour contenu illustratif @fr
definition: Met une manifestation en relation avec une indication des genres d’expressions de contenu visuel qui complètent les expressions principales matérialisées par un agrégat par augmentation. @fr
toolkit label: contenu illustratif @fr
toolkit definition: Indication des genres d’expressions de contenu visuel qui complètent les expressions principales matérialisées par un agrégat par augmentation. @fr
scope note: Le contenu illustratif s’applique à un agrégat matérialisant une expression ayant une valeur de « forme cartographique tridimensionnelle », « forme cartographique tridimensionnelle tactile », « forme tridimensionnelle », « forme tridimensionnelle tactile », « image animée bidimensionnelle », « image animée tridimensionnelle », « image cartographique », « image cartographique animée », « image cartographique tactile », « image fixe » ou « image tactile » pour type de contenu. Les tableaux ne contenant que des mots ou des données numériques sont exclus. @fr
label: له محتوى توضيحي @ar
definition: يربط بين تجسيدة ومؤشر لأنواع محتوى الصورة التي تُكمل التعبيرات الأساسية التي يتم تجسيدها بواسطة إضافة تجميعة. @ar
toolkit label: محتوى توضيحي @ar
toolkit definition: مؤشر لأنواع محتوى الصورة التي تُكمل التعبيرات الأساسية التي يتم تجسيدها بواسطة إضافة تجميعة. @ar
scope note: ينطبق المحتوي التوضيحي على الإضافة التي تتضمن تعبيرة لها نوع محتوى من "صورة خرائطية"، "صورة متحركة خرائطية"، "صورة لمسية خرائطية"، "شكل خرائطي ثلاثي الأبعاد"، "صورة متحركة ثلاثية الأبعاد"، "صورة متحركة ثنائية الأبعاد"، "شكل ملموس ثلاثي الأبعاد"، "شكل ثلاثي الأبعاد"، "صورة ثابتة"، أو "صورة ملموسة". تُستبعد الجداول التي تحتوي فقط على كلمات وبيانات رقمية. @ar
label: har illustrativt indhold @da
definition: Relaterer en manifestation til en indikation af de typer af udtryk af billedindhold der supplerer det hovedudtryk som er indholdt i en beriget samling. @da
toolkit label: illustrativt indhold @da
toolkit definition: Indikation af de typer af udtryk af billedindhold der supplerer det hovedudtryk som er indholdt i en beriget samling. @da
scope note: Illustrativt indhold gælder for en samling der er indholdt i et udtryk med værdien "karotgrafisk billede", "kartografisk levende billede", "kartografisk taktil billede", "kartografisk taktil tredimensional billede", "tredimensional levende billede", "todimensional levende billede", "taktil tredimensional form", "tredimensional form", "stillbillede", eller "taktilt billede" som indholdstype. Tabeller der ikke indholder ord eller numeriske data udelades. @da
label: hat illustrierenden Inhalt @de
definition: Setzt eine Manifestation in Beziehung zu einer Angabe der Expressionsarten von Bildinhalt, die die Hauptexpressionen ergänzt, welche durch ein Erweiterungsaggregat verkörpert werden. @de
toolkit label: Illustrierender Inhalt @de
toolkit definition: Eine Angabe der Expressionsarten von Bildinhalt, die die Hauptexpressionen ergänzt, welche durch ein Erweiterungsaggregat verkörpert werden. @de
scope note: Illustrierender Inhalt bezieht sich auf ein Aggregat, das eine Expression mit dem Wert kartografisches Bild, kartografisches Bewegtbild, kartografisches taktiles Bild, kartografische taktile dreidimensionale Form, kartografische dreidimensionale Form, dreidimensionales Bewegtbild, zweidimensionales Bewegtbild, taktile dreidimensionale Form, dreidimensionale Form, unbewegtes Bild oder taktiles Bild für den Inhaltstyp verkörpert. Darunter fallen keine Tabellen, die nur Wörter oder numerische Daten enthalten. @de
label: té com a contingut il·lustratiu @ca
definition: Relaciona una manifestació amb una indicació de les classes d’expressió de contingut d’imatge que complementen les expressions principals que es materialitzen en un agregat d’augmentació. @ca
toolkit label: contingut il·lustratiu @ca
toolkit definition: Indicació de les classes d’expressió de contingut d’imatge que complementen les expressions principals que es materialitzen en un agregat d’augmentació. @ca
scope note: El contingut il·lustratiu s’aplica a un agregat que materialitza una expressió amb un valor de "imatge cartogràfica", " imatge cartogràfica en moviment", "imatge cartogràfica tàctil", " forma cartogràfica tàctil tridimensional", " forma cartogràfica tridimensional", "imatge en moviment tridimensional", "imatge en moviment bidimensional", "forma tridimensional tàctil", "forma tridimensional", "imatge fixa" o "imatge tàctil" per al tipus de contingut. S’exclouen les taules que només contenen paraules o dades numèriques. @ca
label: 有插图内容 @zh-hans
definition: 将一种载体表现与补充被一种附增合集具体化的主要内容表达的图像内容的内容表达的类型的指示关联起来。 @zh-hans
toolkit label: 插图内容 @zh-hans
toolkit definition: 补充被一种附增合集具体化的主要内容表达的图像内容的内容表达的类型的指示 @zh-hans
scope note: 插图内容适用于具体化如下内容类型值的载体表现的合集：“地图图像”、“地图动态图像”、“地图触摸图像”、“地图触摸三维形式”、“地图三维形式”、“三维动态图像”、“二维动态图像”、“触摸三维形式”、“三维形式”、“静态图像”、或“触摸图像”。不包括只有文字或数字数据的表格。 @zh-hans
label: illusztratív tartalma a következő: @hu
definition: Hozzákapcsol egy megjelenési formát egy képi tartalom azon kifejezésiforma-típusainak a jelöléséhez, amelyek kiegészítik az aggregátumban megtestesülő fő kifejezési formákat. @hu
toolkit label: illusztratív tartalma: @hu
toolkit definition: Egy képi tartalom azon kifejezésiforma-típusainak a jelölése, amelyek kiegészítik az aggregátumban megtestesülő fő kifejezési formákat. @hu
scope note: Illusztrációul szolgáló tartalom azon aggregátumra vonatkozik, amelyben megtestesülhet egy kifejezési forma a következő tartalomtípusokra vonatkozó értékekkel: „kartográfiai kép”, „kartográfiai mozgókép”, „tapintható térkép”, „háromdimenziós tapintható kartográfiai forma”, „háromdimenziós kartográfiai forma”, „háromdimenziós mozgókép”, „kétdimenziós mozgókép”, „tapintható háromdimenziós forma”, „háromdimenziós forma”, „állókép” és „tapintható kép”. A csak szavakat vagy számadatokat tartalmazó táblázatok nem tartoznak ide. @hu
label: resimleyici içerik ile ilişkilidir @tr
definition: Bir gösterimi, bütün artırım tarafından somutlaştırılmış ana ifadeleri destekleyen resim içeriğinin ifadesinin türlerinin gösterimiyle ilişkilendirir. @tr
toolkit label: resimleyici içerik ile ilişkilidir @tr
toolkit definition: Bir artırılmış bütün tarafından somutlaştırılan ana ifadeleri tamamlayan görsel içerik ifadelerinin bir göstergesi. @tr
scope note: resimleyici içerik ile ilişkilidir @tr
label: tiene contenido ilustrativo @es
definition: Relaciona una manifestación con una indicación de los tipos de expresión que proveen modos sensoriales alternativos para percibir la expresión principal que están materializados por un agregado de aumento. @es
toolkit label: contenido ilustrativo @es
toolkit definition: Una indicación de los tipos de expresión que proveen modos sensoriales alternativos para percibir la expresión principal que están materializados por un agregado de aumento. @es
scope note: El contenido ilustrativo aplica a un agregado que materializa una expresión con un valor de "imagen cartográfica", "imagen cartográfica en movimiento", "imagen cartográfica táctil", "forma cartográfica táctil tridimensional", "forma cartográfica tridimensional", "imagen tridimensional en movimiento", "imagen bidimensional en movimiento", "forma táctil tridimensional", "imagen fija" o "imagen táctil" para tipo de contenido. Las tablas que solo contienen palabras o datos numéricos se excluyen. @es
has subproperty: P30453

has sound content
status: Published
definition: Relates a manifestation to an indication of the presence or absence of sound embodied by a manifestation.
type: Property
domain: C10007
lexical alias: soundContent.en
instruction number: 7.18
has element type: 4
toolkit label: sound content
toolkit definition: An indication of the presence or absence of sound embodied by a manifestation.
scope note: Sound content is present in an expression with a value of "performed music", "sounds", or "spoken word" for content type.
label: äänisisältö @fi
definition: Liittää manifestaation ilmaukseen manifestaation sisältämän äänen mukanaolosta tai puuttumisesta. @fi
toolkit label: äänisisältö @fi
toolkit definition: Ilmaus manifestaation sisältämän äänen mukanaolosta tai puuttumisesta. @fi
scope note: Äänisisältö ilmaistaa ekspressiossa sisältötyypin arvolla "esitetty musiikki", "ääni" tai "puhe". @fi
toolkit definition: Een indicatie van de aanwezigheid of afwezigheid van geluid verwezenlijkt door een manifestatie. @nl
toolkit label: geluidscontent @nl
label: heeft geluidscontent @nl
definition: Relateert een manifestatie aan een indicatie van de aanwezigheid of afwezigheid van geluid verwezenlijkt door een manifestatie. @nl
scope note: Geluidscontent is aanwezig in een expressie met een waarde van “uitgevoerde muziek”, “geluiden” of “gesproken woord” als type content. @nl
label: skaņas saturs @lv
definition: Sasaista manifestāciju ar skaņas esamību vai tās trūkumu izteiksmē. @lv
toolkit label: skaņas saturs @lv
toolkit definition: Skaņas esamība vai tās trūkums izteiksmē. @lv
scope note: Skaņas saturs ir izteiksmēm, kuru satura veids ir "mūzikas izpildījums", "skaņas" vai "mutvārdi". @lv
label: a pour contenu sonore @fr
definition: Met une manifestation en relation avec une indication de la présence ou de l’absence de son matérialisé par une manifestation. @fr
toolkit label: contenu sonore @fr
toolkit definition: Indication de la présence ou de l’absence de son matérialisé par une manifestation. @fr
scope note: Du contenu sonore est présent dans une expression ayant une valeur de « musique exécutée », « parole énoncée » ou « sons » pour type de contenu. @fr
label: له محتوى صوت @ar
definition: يربط بين تعبيرة ومؤشر لوجود أو عدم وجود صوت في تجسيدة. @ar
toolkit label: محتوى صوت @ar
toolkit definition: مؤشر إلى وجود أو عدم وجود صوت في تجسيدة. @ar
scope note: محتوى صوت متواجد في تعبيرة لها نوع محتوى من "موسيقى مُسجلة"، " أصوات"، أو "كلمة منطوقة". @ar
label: lydindhold @da
definition: Relaterer en manifestation til en indikation af nærvær eller fravær af lyd indholdt i en manifestation. @da
toolkit label: lydindhold @da
toolkit definition: Indikation af nærvær eller fravær af lyd indholdt i en manifestation. @da
scope note: Lydhindhold findes i et udtryk med værdi som "fremført musik", "lyd", "talet ord" som indholdstype. @da
label: hat Toninhalt @de
definition: Setzt eine Manifestation in Beziehung zu einer Angabe über das Vorhandensein beziehungsweise nicht Vorhandensein von Ton, der durch eine Manifestation verkörpert wird. @de
toolkit label: Toninhalt @de
toolkit definition: Eine Angabe über das Vorhandensein beziehungsweise nicht Vorhandensein von Ton, der durch eine Manifestation verkörpert wird. @de
scope note: Toninhalt kommt in einer Expression mit dem Wert aufgeführte Musik, Töne oder gesprochene Worte für den Inhaltstyp vor. @de
label: té com a contingut sonor @ca
definition: Relaciona una manifestació amb una indicació de la presència o absència de so materialitzada en una manifestació. @ca
toolkit label: contingut sonor @ca
toolkit definition: Indicació de la presència o absència de so materialitzada en una manifestació. @ca
scope note: El contingut sonor és present en una expressió amb un valor de "música executada", "sons" o "paraula parlada" per al tipus de contingut. @ca
label: 有声音内容 @zh-hans
definition: 将一种载体表现与一种载体表现所具体化的声音出现或不出现的指示关联起来。 @zh-hans
toolkit label: 声音内容 @zh-hans
toolkit definition: 一种载体表现所具体化的声音出现或不出现的指示 @zh-hans
scope note: 声音内容出现于有如下内容类型值的一种内容表达：“表演音乐”、“声音”、或“口语” @zh-hans
label: hangtartalma a következő: @hu
definition: Hozzákapcsol egy megjelenési formát egy megjelenési formában megtestesülő, a hang jelenlétét vagy hiányát mutató jelöléshez. @hu
toolkit label: hangtartalma: @hu
toolkit definition: Egy megjelenési formában megtestesülő, a hang jelenlétét vagy hiányát mutató jelölés. @hu
scope note: Hangtartalmat tartalmazó kifejezési forma a következő tartalomtípusokra vonatkozó értékekkel: „előadott zene”, „hangok” és „beszéd”. @hu
label: ses içeriği ile ilişkilidir @tr
definition: Bir gösterimi, gösterim tarafından somutlaştırılmış sesin varlığının veya yokluğunun göstergesiyle ilişkilendirir. @tr
toolkit label: sesli içeriği @tr
toolkit definition: Bir gösterim tarafından somutlaştırılmış sesin varlığının veya yokluğunun bir göstergesi. @tr
scope note: Ses içeriği, içerik türü için "uygulanmış müzik", "sesler" veya "söz" değeriyle bir anlamda bulunur. @tr
label: tiene contenido sonoro @es
definition: Relaciona una manifestación con una indicación de la presencia o ausencia de sonido materializado por una manifestación. @es
toolkit label: contenido sonoro @es
toolkit definition: Una indicación de la presencia o ausencia de sonido materializado por una manifestación. @es
scope note: El contenido sonoro está presente en una expresión con un valor de "música interpretada", "sonidos" o "palabra hablada" para tipo de contenido. @es
has subproperty: P30454

has supplementary content
status: Published
definition: Relates a manifestation to an indication of the kinds of expression that supplement the main expressions that are embodied by an augmentation aggregate.
type: Property
domain: C10007
lexical alias: supplementaryContent.en
instruction number: 7.16
toolkit label: supplementary content
toolkit definition: An indication of the kinds of expression that supplement the main expressions that are embodied by an augmentation aggregate.
label: lisätty sisältö @fi
definition: Liittää manifestaation ilmaukseen niistä ekspressioista, jotka täydentävät laajennusaggregaatin sisältämiä pääekspressioita. @fi
toolkit label: lisätty sisältö @fi
toolkit definition: Ilmaus niistä ekspressioista, jotka täydentävät laajennusaggregaatin sisältämiä pääekspressioita. @fi
toolkit definition: Een indicatie van de soorten expressies die de hoofd-expressies aanvullen die verwezenlijkt zijn door een augmentatie-aggregaat. @nl
toolkit label: aanvullende content @nl
label: heeft aanvullende content @nl
definition: Relateert een manifestatie aan een indicatie van de soorten expressies die de hoofd-expressies aanvullen die verwezenlijkt zijn door een augmentatie-aggregaat. @nl
label: papildu saturs @lv
definition: Sasaista manifestāciju ar norādi par saturu, kas atjaunina vai papildina izteiksmes pamata saturu. Papildu saturs var ietvert, piemēram, bibliogrāfiju, rādītāju vai pielikumu. @lv
toolkit label: papildu saturs @lv
toolkit definition: Norāde par saturu, kas atjaunina vai papildina izteiksmes pamata saturu. Papildu saturs var ietvert, piemēram, bibliogrāfiju, rādītāju vai pielikumu. @lv
label: a pour contenu supplémentaire @fr
definition: Met une manifestation en relation avec une indication des genres d’expressions qui complètent les expressions principales matérialisées par un agrégat par augmentation. @fr
toolkit label: contenu supplémentaire @fr
toolkit definition: Indication des genres d’expressions qui complètent les expressions principales matérialisées par un agrégat par augmentation. @fr
label: له محتوى تكميلي @ar
definition: يربط بين تجسيدة ومؤشر لأنواع التعبير التي تُكمل التعبيرات الأساسية التي يتم تجسيدها بواسطة إضافة تجميعة. @ar
toolkit label: محتوى تكميلي @ar
toolkit definition: مؤشر لأنواع التعبير التي تُكمل التعبيرات الأساسية التي يتم تجسيدها بواسطة إضافة تجميعة. @ar
label: har supplerende indhold @da
definition: Relaterer en manifestation til en indikation af de typer af udtryk der supplerer de hovedudtryk der er inholdt i en beriget samling. @da
toolkit label: supplerende indhold @da
toolkit definition: Indikation af de typer af udtryk der supplerer de hovedudtryk der er indholdt i en beriget samling. @da
label: hat ergänzenden Inhalt @de
definition: Setzt eine Manifestation in Beziehung zu einer Angabe der Expressionsarten, die die Hauptexpressionen ergänzen, welche durch ein Erweiterungsaggregat verkörpert werden. @de
toolkit label: Ergänzender Inhalt @de
toolkit definition: Eine Angabe der Expressionsarten, die die Hauptexpressionen ergänzen, welche durch ein Erweiterungsaggregat verkörpert werden. @de
label: té com a contingut suplementari @ca
definition: Relaciona una manifestació amb una indicació de les classes d’expressió que suplementen les expressions principals que es materialitzen en un agregat d’augmentació. @ca
toolkit label: contingut suplementari @ca
toolkit definition: Indicació de les classes d’expressió que suplementen les expressions principals que es materialitzen en un agregat d’augmentació. @ca
has element type: 5
label: 有补充内容 @zh-hans
definition: 将一种载体表现与补充被一种附增合集具体化的主要内容表达的内容表达的类型的指示关联起来。 @zh-hans
toolkit label: 补充内容 @zh-hans
toolkit definition: 补充被一种附增合集具体化的主要内容表达的内容表达的类型的指示 @zh-hans
label: kiegészítő tartalma a következő: @hu
definition: Hozzákapcsol egy megjelenési formát egy kifejezési forma azon típusainak a jelöléséhez, amelyek kiegészítik az aggregátumban megtestesülő fő kifejezési formákat. @hu
toolkit label: kiegészítő tartalma: @hu
toolkit definition: Egy kifejezési forma azon típusainak a jelölése, amelyek kiegészítik az aggregátumban megtestesülő fő kifejezési formákat. @hu
label: tamamlayıcı içerik ile ilişkilidir @tr
definition: Bir gösterimi, bütün artış tarafından somutlaştırılmış ana ifadeleri tamamlayan ifadenin türlerinin göstergesiyle ilişkilendirir. @tr
toolkit label: tamamlayıcı içerik @tr
toolkit definition: Bir artırılmış bütün tarafından somutlaştırılan ana ifadeleri tamamlayan ifadelerin bir göstergesi. @tr
label: tiene contenido suplementario @es
definition: Relaciona una manifestación con una indicación de los tipos de expresión que suplementan las expresiones principales que están materializadas por un agregado de aumento. @es
toolkit label: contenido suplementario @es
toolkit definition: Una indicación de los tipos de expresión que suplementan las expresiones principales que están materializadas por un agregado de aumento. @es
has subproperty: has accessibility content
has subproperty: has illustrative content
has subproperty: P30455

is reference source of
status: Published
definition: Relates a manifestation to a nomen for which evidence of use is provided by a manifestation.
type: Property
domain: C10007
lexical alias: referenceSourceOf.en
has element type: 2
toolkit label: reference source of
toolkit definition: A nomen for which evidence of use is provided by a manifestation.
sub property of: has related nomen of manifestation
label: tietolähde nomenille @fi
definition: Liittää manifestaation nomeniin, jonka käytöstä manifestaatio on todiste. @fi
toolkit label: tietolähde nomenille @fi
toolkit definition: Nomen, jonka käytöstä manifestaatio on todiste. @fi
toolkit definition: Relateert een manifestatie aan een nomen waarvoor bewijs van gebruik is geleverd door een manifestatie. @nl
toolkit label: naslagwerk van @nl
label: is naslagwerk van @nl
definition: Een nomen waarvoor bewijs van gebruik is geleverd door een manifestatie. @nl
label: ir uzziņu avots @lv
definition: Sasaista manifestāciju ar nomenu, par kura izmantošanas faktu ir ziņas manifestācijā. @lv
toolkit label: ir uzziņu avots @lv
toolkit definition: Nomens, par kura izmantošanas faktu ir ziņas manifestācijā. @lv
label: est une source de référence de @fr
definition: Met une manifestation en relation avec un nomen dont l’utilisation est attestée par une manifestation. @fr
toolkit label: source de référence de @fr
toolkit definition: Nomen dont l’utilisation est attestée par une manifestation. @fr
label: هو مصدر مرجعي لـ @ar
definition: يربط بين تجسيدة وتسمية يتم تقديم دليل على استخدامها بواسطة تجسيدة. @ar
toolkit label: مصدر مرجعي لـ @ar
toolkit definition: تسمية يتم تقديم دليل على استخدامها بواسطة تجسيدة. @ar
label: er referencekilde af @da
definition: Relaterer en manifestation til et nomen for hvilket evidens af brug gives af en manifestation. @da
toolkit label: referencekilde af @da
toolkit definition: Nomen for hvilket evidens af brug gives af en manifestation. @da
label: ist Nachschlagewerk von @de
definition: Setzt eine Manifestation in Beziehung zu einem Nomen, dessen Verwendung durch eine Manifestation belegt wird. @de
toolkit label: Nachschlagewerk von @de
toolkit definition: Ein Nomen, dessen Verwendung durch eine Manifestation belegt wird. @de
label: és font de referència de @ca
definition: Relaciona una manifestació amb un nomen l’evidència d’ús del qual es proporciona en una manifestació. @ca
toolkit label: font de referència de @ca
toolkit definition: Nomen l’evidència d’ús del qual es proporciona en una manifestació. @ca
label: 是……的参考信息源 @zh-hans
definition: 将一种载体表现与由一种载体表现提供其使用证据的一个命名关联起来。 @zh-hans
toolkit label: ……的参考信息源 @zh-hans
toolkit definition: 由一种载体表现提供其使用证据的一个命名 @zh-hans
label: hivatkozási forrása a következőnek: @hu
definition: Hozzákapcsol egy megjelenési formát egy nomenhez, amelynek használatát egy megjelenési forma bizonyítja. @hu
toolkit label: hivatkozási forrása: @hu
toolkit definition: Egy nomen, amelynek használatát egy megjelenési forma bizonyítja. @hu
label: referans kaynağıdır @tr
definition: Bir gösterimi, kullanımının kanıtı gösterim tarafından sağlanmış isimle ilişkilendirir. @tr
toolkit label: referans kaynağı @tr
toolkit definition: Kullanımına dair kanıtın bir gösterim tarafından sağlandığı bir isim. @tr
label: es fuente de referencia de @es
definition: Relaciona una manifestación con un nomen para el cual la evidencia de uso es provista por una manifestación. @es
toolkit label: fuente de referencia de @es
toolkit definition: Un nomen para el cual la evidencia de uso es provista por una manifestación. @es
has subproperty: P30457

has subcollection
status: Published
definition: Relates a manifestation to a manifestation of a collection work that is a discrete component of a manifestation of another collection work.
type: Property
domain: C10007
lexical alias: subcollection.en
has element type: 2
toolkit label: subcollection
toolkit definition: A manifestation of a collection work that is a discrete component of a manifestation of another collection work.
sub property of: has part manifestation
toolkit definition: Kokoelmateoksen manifestaatio, joka on toisen kokoelmateoksen manifestaation erillinen osa. @fi
toolkit label: alakokoelma @fi
definition: Liittää manifestaation kokoelmateoksen manifestaatioon, joka on toisen kokoelmateoksen manifestaation erillinen osa. @fi
label: alakokoelma @fi
label: 有分收藏 @zh-hans
definition: 将一种载体表现与作为另一种收藏作品的一种载体表现的一个独立组成部分的一种收藏作品的一种载体表现关联起来。 @zh-hans
toolkit label: 分收藏 @zh-hans
toolkit definition: 作为另一种收藏作品的一种载体表现的一个独立组成部分的一种收藏作品的一种载体表现 @zh-hans
label: té subcol·lecció de recursos @ca
definition: Relaciona una manifestació amb una manifestació d’una obra de col·lecció de recursos que és un component discret d’una manifestació d’una altra obra de col·lecció de recursos. @ca
toolkit label: subcol·lecció de recursos @ca
toolkit definition: Manifestació d’una obra de col·lecció de recursos que és un component discret d’una manifestació d’una altra obra de col·lecció de recursos. @ca
label: a pour sous-collection de ressources @fr
definition: Met une manifestation en relation avec une manifestation d’une œuvre de collection de ressources qui est une composante distincte d’une manifestation d’une autre œuvre de collection de ressources. @fr
toolkit label: sous-collection de ressources @fr
toolkit definition: Manifestation d’une œuvre de collection de ressources qui est une composante distincte d’une manifestation d’une autre œuvre de collection de ressources. @fr
label: alt koleksiyon ile ilişkilidir @tr
definition: Bir gösterimi, başka bir koleksiyon eserinin gösteriminin ayrık bileşeni olan koleksiyon eserinin gösterimiyle ilişkilendirir. @tr
toolkit label: alt koleksiyon @tr
toolkit definition: Başka bir koleksiyon eserinin gösteriminin ayrık bileşeni olan koleksiyon eserinin gösterimi. @tr
label: tiene subcolección @es
definition: Relaciona una manifestación con una manifestación de una obra de colección que es un componente discreto de una manifestación de otra obra de colección. @es
toolkit label: subcolección @es
toolkit definition: Una manifestación de una manifestación con una obra de colección que es un componente discreto de una manifestación de otra obra de colección. @es
has subproperty: P30458
label: heeft subcollectie @nl
definition: Relateert een manifestatie aan een manifestatie van een collectiewerk dat is een afzonderlijk onderdeel van een manifestatie van een ander collectiewerk. @nl
toolkit label: subcollectie @nl
toolkit definition: Een manifestatie van een collectiewerk dat is een afzonderlijk onderdeel van een manifestatie van een ander collectiewerk. @nl

is subcollection of
status: Published
definition: Relates a manifestation to a manifestation of a collection work that has a manifestation of another collection work as a discrete component.
type: Property
domain: C10007
lexical alias: subcollectionOf.en
has element type: 2
toolkit label: subcollection of
toolkit definition: A manifestation of a collection work that has a manifestation of another collection work as a discrete component.
sub property of: is part of manifestation
toolkit definition: Kokoelmateoksen manifestaatio, joka sisältyy toisen kokoelmateoksen manifestaatioon erillisenä osana. @fi
toolkit label: alakokoelma kokoelmassa @fi
definition: Liittää manifestaation kokoelmateoksen manifestaatio, joka sisältyy toisen kokoelmateoksen manifestaatioon erillisenä osana. @fi
label: alakokoelma kokoelmassa @fi
label: 是……的分收藏 @zh-hans
definition: 将一种载体表现与有另一种收藏作品的一种载体表现作为其独立组成部分的一种收藏作品的一种载体表现关联起来。 @zh-hans
toolkit label: ……的分收藏 @zh-hans
toolkit definition: 有另一种收藏作品的一种载体表现作为其独立组成部分的一种收藏作品的一种载体表现 @zh-hans
label: és subcol·lecció de recursos de @ca
definition: Relaciona una manifestació amb una manifestació d’una obra de col·lecció de recursos que té una manifestació d’una altra obra de col·lecció de recursos com un component discret. @ca
toolkit label: subcol·lecció de recursos de @ca
toolkit definition: Manifestació d’una obra de col·lecció de recursos que té una manifestació d’una altra obra de col·lecció de recursos com un component discret. @ca
label: est une sous-collection de ressources de @fr
definition: Met une manifestation en relation avec une manifestation d’une œuvre de collection de ressources qui a pour composante distincte une manifestation d’une autre œuvre de collection de ressources. @fr
toolkit label: sous-collection de ressources de @fr
toolkit definition: Manifestation d’une œuvre de collection de ressources qui a pour composante distincte une manifestation d’une autre œuvre de collection de ressources. @fr
label: (…) alt koleksiyonudur @tr
definition: Bir gösterimi, ayrık bileşen olarak başka bir eserin gösterimine sahip koleksiyon eserinin gösterimiyle ilişkilendirir. @tr
toolkit label: alt koleksiyonu @tr
toolkit definition: Ayrık bileşen olarak başka bir eserin gösterimine sahip koleksiyon eserinin gösterimi. @tr
label: es subcolección de @es
definition: Relaciona una manifestación con una manifestación de una obra de colección que tiene una manifestación de otra obra de colección como un componente discreto. @es
toolkit label: subcolección de @es
toolkit definition: Una manifestación de una obra de colección que tiene una manifestación de otra obra de colección como un componente discreto. @es
has subproperty: P30459
label: is subcollectie van @nl
definition: Relateert een manifestie aan een manifestatie van een collectiewerk dat heeft een manifestatie van een ander collectiewerk als afzonderlijk onderdeel. @nl
toolkit label: subcollectie van @nl
toolkit definition: Een manifestatie van een collectiewerk dat heeft een manifestatie van een ander collectiewerk als afzonderlijk onderdeel. @nl

has holding
status: Published
definition: Relates a manifestation to an item that is included in the manifestation of a collection work.
type: Property
domain: C10007
lexical alias: holding.en
has element type: 2
toolkit label: holding
toolkit definition: An item that is included in the manifestation of a collection work.
sub property of: has related item of manifestation
toolkit definition: Kappale, joka sisältyy kokoelmateoksen manifestaatioon. @fi
toolkit label: kokoelman kappale @fi
definition: Liittää manifestaation kappaleeseen, joka sisältyy kokoelmateoksen manifestaatioon. @fi
label: kokoelman kappale @fi
label: 有馆藏 @zh-hans
definition: 将一种载体表现与被包括于一种收藏作品的载体表现中的一个单件关联起来。 @zh-hans
toolkit label: 馆藏 @zh-hans
toolkit definition: 被包括于一种收藏作品的载体表现中的一个单件 @zh-hans
label: té fons @ca
definition: Relaciona una manifestació amb un ítem que s’inclou en la manifestació d’una obra de col·lecció de recursos. @ca
toolkit label: fons @ca
toolkit definition: Ítem que s’inclou en la manifestació d’una obra de col·lecció de recursos. @ca
label: conserve @fr
definition: Met une manifestation en relation avec un item qui est compris dans la manifestation d’une œuvre de collection de ressources. @fr
toolkit label: conserve @fr
toolkit definition: Item qui est compris dans la manifestation d’une œuvre de collection de ressources. @fr
label: koleksiyonda bulunan kopya ile ilişkilidir @tr
definition: Bir gösterimi, koleksiyon eserinin gösterimine dahil olan kopyayla ilişkilendirir. @tr
toolkit label: koleksiyonda bulunan kopya @tr
toolkit definition: Bir koleksiyon eserinin gösterimine dahil olan bir kopya. @tr
label: tiene ejemplar @es
definition: Relaciona una manifestación con un ítem que está incluido en la manifestación de una obra de colección. @es
toolkit label: ejemplar @es
toolkit definition: Un ítem que está incluido en la manifestación de una obra de colección. @es
has subproperty: P30460
definition: Relateert een manifestatie aan een item dat is opgenomen in de manifestatie van een collectiewerk. @nl
toolkit definition: Een item dat is opgenomen in de manifestatie van een collectiewerk. @nl
label: heeft bezit @nl
toolkit label: bezit @nl

has location of collection
status: Published
definition: Relates a manifestation to a place where the manifestation of a collection work is stored.
type: Property
domain: C10007
lexical alias: locationOfCollection.en
has element type: 2
toolkit label: location of collection
toolkit definition: A place where the manifestation of a collection work is stored.
sub property of: has related place of manifestation
toolkit definition: Paikka, jossa kokoelmateoksen manifestaatiota säilytetään. @fi
toolkit label: kokoelman sijainti @fi
definition: Liittää manifestaation paikkaan, jossa kokoelmateoksen manifestaatiota säilytetään. @fi
label: kokoelman sijainti @fi
label: 有收藏的位置 @zh-hans
definition: 将一种载体表现与一种收藏作品的载体表现被储存的地点关联起来。 @zh-hans
toolkit label: 收藏的位置 @zh-hans
toolkit definition: 一种收藏作品的载体表现被储存的地点 @zh-hans
label: té localització de col·lecció de recursos @ca
definition: Relaciona una manifestació amb un lloc on s’emmagatzema la manifestació d’una obra de col·lecció de recursos. @ca
toolkit label: localització de col·lecció de recursos @ca
toolkit definition: Lloc on s’emmagatzema la manifestació d’una obra de col·lecció de recursos. @ca
label: a pour emplacement d’une collection de ressources @fr
definition: Met une manifestation en relation avec un lieu où la manifestation d’une collection de ressources est conservée. @fr
toolkit label: emplacement d’une collection de ressources @fr
toolkit definition: Lieu où la manifestation d’une collection de ressources est conservée. @fr
label: koleksiyonun konumu ile ilişkilidir @tr
definition: Bir gösterimi, koleksiyon eserinin gösteriminin depolandığı yerle ilişkilendirir. @tr
toolkit label: koleksiyonun konumu @tr
toolkit definition: Koleksiyon eserinin gösteriminin depolandığı yer. @tr
label: tiene ubicación de colección @es
definition: Relaciona una manifestación con un lugar donde la manifestación de una obra de colección es almacenada. @es
toolkit label: ubicación de colección @es
toolkit definition: Un lugar donde la manifestación de una obra de colección es almacenada. @es
has subproperty: P30461
label: heeft locatie van collectie @nl
definition: Relateert een manifestatie aan een plaats waar de manifestatie van een collectiewerk wordt bewaard. @nl
toolkit label: locatie van collectie @nl
toolkit definition: Een locatie waar de manifestatie van een collectiewerk wordt bewaard. @nl

is manifestation described with metadata by
status: Published
definition: Relates a manifestation to a work that is a metadata work for a manifestation.
type: Property
domain: C10007
lexical alias: manifestationDescribedWithMetadataBy.en
has element type: 2
toolkit label: manifestation described with metadata by
toolkit definition: A work that is a metadata work for a manifestation.
sub property of: is manifestation described by
toolkit definition: Teos, joka on manifestaation metatietoteos. @fi
toolkit label: manifestaatiota metatiedoilla kuvaileva teos @fi
definition: Liittää manifestaation teokseen, joka on manifestaation metatietoteos. @fi
label: manifestaatiota metatiedoilla kuvaileva teos @fi
label: 是被……用元数据描述的载体表现 @zh-hans
definition: 将一种载体表现与作为一种载体表现之元数据作品的一种作品关联起来。 @zh-hans
toolkit label: 被……用元数据描述的载体表现 @zh-hans
toolkit definition: 作为一种载体表现之元数据作品的一种作品 @zh-hans
label: és manifestació descrita amb metadades per @ca
definition: Relaciona una manifestació per a una obra de metadades per a una manifestació @ca
toolkit label: manifestació descrita amb metadades per @ca
toolkit definition: Obra que és una obra de metadades per a una manifestació @ca
label: est une manifestation décrite avec des métadonnées par @fr
definition: Met une manifestation en relation avec une œuvre qui consiste en une œuvre de métadonnées pour une manifestation. @fr
toolkit label: manifestation décrite avec des métadonnées par @fr
toolkit definition: Œuvre qui consiste en une œuvre de métadonnées pour une manifestation. @fr
label: tarafından üstveri ile tanımlanmış gösterimdir @tr
definition: Bir gösterimi, gösterim için üst veri eseri olan eserle ilişkilendirir. @tr
toolkit label: Üstveriyle tanımlanan gösterim @tr
toolkit definition: Bir gösterim için üstveri çalışması olan bir eser. @tr
label: es manifestación descrita con metadatos por @es
definition: Relaciona una manifestación con una obra que es una obra de metadatos para una manifestación. @es
toolkit label: manifestación descrita con metadatos por @es
toolkit definition: Una obra que es una obra de metadatos para una manifestación. @es
has subproperty: has finding aid
has subproperty: P30462
label: is manifestatie beschreven met metadata door @nl
definition: Relateert een manifestatie aan een werk dat is een metadatawerk voor een manifestatie. @nl
toolkit label: manifestatie beschreven met metadata door @nl
toolkit definition: Een werk dat is een metadatawerk voor een manifestatie. @nl

has finding aid
status: Published
definition: Relates a manifestation to a work that is a metadata description set for a collection manifestation.
type: Property
domain: C10007
lexical alias: findingAid.en
has element type: 2
toolkit label: finding aid
toolkit definition: A work that is a metadata description set for a collection manifestation.
sub property of: is manifestation described with metadata by
toolkit definition: Teos, joka on kokoelmamanifestaation metatietokokonaisuus. @fi
toolkit label: luettelo @fi
definition: Liittää manifestaation teokseen, joka on kokoelmamanifestaation metatietokokonaisuus. @fi
label: luettelo @fi
label: 有查询工具 @zh-hans
definition: 将一种载体表现与作为一种收藏载体表现之元数据描述集合的一种作品关联起来。 @zh-hans
toolkit label: 查询工具 @zh-hans
toolkit definition: 作为一种收藏载体表现之元数据描述集合的一种作品 @zh-hans
label: té instrument de descripció @ca
definition: Relaciona una manifestació amb una obra que és un conjunt de descripció de metadades per a una manifestació de col·lecció de recursos. @ca
toolkit label: instrument de descripció @ca
toolkit definition: Obra que és un conjunt de descripció de metadades per a una manifestació de col·lecció de recursos. @ca
label: a pour instrument de recherche @fr
definition: Met une manifestation en relation avec une œuvre qui consiste en un ensemble de métadonnées descriptives pour une manifestation de collection de ressources. @fr
toolkit label: instrument de recherche @fr
toolkit definition: Œuvre qui consiste en un ensemble de métadonnées descriptives pour une manifestation de collection de ressources. @fr
label: rehber bilgi ile ilişkilidir @tr
definition: Bir gösterimi, koleksiyon gösterimi için kurulmuş üst veri tanımı olan eserle ilişkilendirir. @tr
toolkit label: rehber bilgi @tr
toolkit definition: Bir koleksiyon gösterimi için oluşturulmuş bir üstveri seti olan bir çalışma. @tr
label: tiene ayuda para hallazgo @es
definition: Relaciona una manifestación con una obra que es un conjunto de descripción de metadatos para una manifestación de colección. @es
toolkit label: ayuda para hallazgo @es
toolkit definition: Una obra que es un conjunto de descripción de metadatos para una manifestación de colección. @es
has subproperty: has catalogue
has subproperty: has hierarchic finding aid
has subproperty: P30463
label: heeft vind-hulpmiddel @nl
definition: Relateert een manifestatie aan een werk dat is een metadata-beschrijvingsset voor een collectiemanifestatie. @nl
toolkit label: vind-vind-hulpmiddel @nl
toolkit definition: Een werk dat is een metadata-beschrijvingsset voor een collectiemanifestatie. @nl

has catalogue
status: Published
definition: Relates a manifestation to a work that is a metadata description set for the items that are held by a collection manifestation.
type: Property
domain: C10007
lexical alias: catalogue.en
has element type: 2
toolkit label: catalogue
toolkit definition: A work that is a metadata description set for the items that are held by a collection manifestation.
alternative label: analytic finding aid
alternative label: finding aid, analytic
sub property of: has finding aid
toolkit definition: Teos, joka on kokoelmamanifestaation sisältämien kappaleiden metatietokokonaisuus. @fi
toolkit label: kokoelmaluettelo @fi
definition: Liittää manifestaation teokseen, joka on kokoelmamanifestaation sisältämien kappaleiden metatietokokonaisuus. @fi
label: kokoelmaluettelo @fi
label: 有目录 @zh-hans
definition: 将一种载体表现与作为一种收藏载体表现所收入的单件的元数据描述集合的一种作品关联起来。 @zh-hans
toolkit label: 目录 @zh-hans
toolkit definition: 作为一种收藏载体表现所收入的单件的元数据描述集合的一种作品 @zh-hans
alternative label: 分析查询工具 @zh-hans
alternative label: 查询工具（分析的） @zh-hans
label: té catàleg @ca
definition: Relaciona una manifestació amb una obra que és un conjunt de descripció de metadades per als ítems que s’apleguen en una manifestació de col·lecció de recursos. @ca
toolkit label: catàleg @ca
toolkit definition: Obra que és un conjunt de descripció de metadades per als ítems que s’apleguen en una manifestació de col·lecció de recursos. @ca
alternative label: instrument de recherche analytique @fr
label: a pour catalogue @fr
definition: Met une manifestation en relation avec une œuvre qui consiste en un ensemble de métadonnées descriptives pour les items conservés par une manifestation de collection de ressources. @fr
toolkit definition: Œuvre qui consiste en un ensemble de métadonnées descriptives pour les items conservés par une manifestation de collection de ressources. @fr
label: katalog ile ilişkilidir @tr
definition: Bir gösterimi, koleksiyon gösterimi tarafından tutulan öğeler için kurulmuş üst veri tanımı olan eserle ilişkilendirir. @tr
toolkit label: katalog @tr
toolkit definition: Bir koleksiyon gösterimi tarafından tutulan kopyalar için oluşturulmuş bir üstveri seti olan bir çalışma. @tr
label: tiene catálogo @es
definition: Relaciona una manifestación con una obra que es un conjunto de descripción de metadatos para los ítems que son contenidos por una manifestación de colección. @es
toolkit label: catálogo @es
toolkit definition: Una obra que es un conjunto de descripción de metadatos para los ítems que están contenidos en una manifestación de colección. @es
has subproperty: P30464
label: heeft catalogus @nl
definition: Relateert een manifestatie aan een werk dat is een metadata-beschrijvingsset voor de items die bewaard worden in een collectiemanifestatie. @nl
toolkit label: catalogus @nl
toolkit definition: Een werk dat is een metadata-beschrijvingsset voor de items die bewaard worden in een collectiemanifestatie. @nl
alternative label: auxiliar de búsqueda analítico @es
alternative label: auxiliar de búsqueda, analítico @es
alternative label: analitik rehber @tr
alternative label: rehber, analitik @tr
alternative label: analyyttinen luettelo @fi
alternative label: luettelo, analyyttinen @fi
alternative label: analytisch vind-hulpmiddel @nl
alternative label: vind-hulpmiddel, analytisch @nl

has hierarchic finding aid
status: Published
definition: Relates a manifestation to a work that is a metadata description set for the sub-collections and items that are held by a collection manifestation.
type: Property
domain: C10007
lexical alias: hierarchicFindingAid.en
has element type: 2
toolkit label: hierarchic finding aid
toolkit definition: A work that is a metadata description set for the sub-collections and items that are held by a collection manifestation.
alternative label: finding aid, hierarchic
scope note: A collection includes an archival collection.
sub property of: has finding aid
scope note: Kokoelma sisältää arkistokokoelman. @fi
alternative label: luettelo, hierarkkinen @fi
toolkit definition: Teos, joka kokoelmamanifestaatioon sisältyvien alakokoelmien ja kappaleiden metatietokokonaisuus. @fi
toolkit label: hierarkkinen luettelo @fi
definition: Liittää manifestaation teokseen, joka kokoelmamanifestaatioon sisältyvien alakokoelmien ja kappaleiden metatietokokonaisuus. @fi
label: hierarkkinen luettelo @fi
alternative label: 查询工具（分级的） @zh-hans
label: 有分级查询工具 @zh-hans
definition: 将一种载体表现与作为一种收藏载体表现所收入的分收藏和单件的元数据描述集合的一种作品关联起来。 @zh-hans
toolkit label: 分级查询工具 @zh-hans
toolkit definition: 作为一种收藏载体表现所收入的分收藏和单件的元数据描述集合的一种作品 @zh-hans
scope note: 收藏包括档案收藏。 @zh-hans
alternative label: jeràrquic, instrument de descripció @ca
label: té instrument de descripció jeràrquic @ca
definition: Relaciona una manifestació amb una obra que és un conjunt de descripció de metadades per a les subcol·leccions de recursos i ítems que s’apleguen en una manifestació de col·lecció de recursos. @ca
toolkit label: instrument de descripció jeràrquic @ca
toolkit definition: Obra que és un conjunt de descripció de metadades per a les subcol·leccions de recursos i ítems que s’apleguen en una manifestació de col·lecció de recursos. @ca
scope note: Una col·lecció de recursos inclou una col·lecció de recursos arxivístics. @ca
label: a pour instrument de recherche hiérarchique @fr
definition: Met une manifestation en relation avec une œuvre qui consiste en un ensemble de métadonnées descriptives pour les sous-collections de ressources et les items conservés par une manifestation de collection de ressources. @fr
toolkit label: instrument de recherche hiérarchique @fr
toolkit definition: Œuvre qui consiste en un ensemble de métadonnées descriptives pour les sous-collections de ressources et les items conservés par une manifestation de collection de ressources. @fr
scope note: Une collection de ressources comprend une collection ou un fonds d’archives. @fr
alternative label: hiyerarşik rehber bilgi @tr
label: hiyerarşik rehber bilgi ile ilişkilidir @tr
definition: Bir gösterimi, alt koleksiyonlar ve koleksiyon eseri tarafından tutulan öğe için kurulmuş üst veri tanımı olan eserle ilişkilendirir. @tr
toolkit label: hiyerarşik rehber bilgi ile ilişkilidir @tr
toolkit definition: Bir koleksiyon gösterimi tarafından tutulan alt koleksiyonlar ve kopyalar için oluşturulmuş bir üstveri seti olan bir çalışma. @tr
scope note: Arşivsel koleksiyonu içeren koleksiyon. @tr
alternative label: ayuda para hallazgo, jerárquica @es
label: tiene ayuda jerárquica para hallazgo @es
definition: Relaciona una manifestación con una obra que es un conjunto de descripción de metadatos para las subcolecciones e ítems que están contenidos en una manifestación de colección. @es
toolkit label: ayuda jerárquica para hallazgo @es
toolkit definition: Una obra que es un conjunto de descripción de metadatos para las subcolecciones e ítems que están contenidos en una manifestación de colección. @es
scope note: Una colección incluye una colección de archivo. @es
has subproperty: P30465
alternative label: vind-vind-hulpmiddel, hiërarchisch @nl
label: heeft hiërarchisch vind-hulpmiddel @nl
definition: Relateert een manifestatie aan een werk dat is een metadata-beschrijvingsset voor de subcollecties en items die bewaard worden in een collectiemanifestatie. @nl
toolkit label: hiërarchisch vind-hulpmiddel @nl
toolkit definition: Een werk dat is een metadata-beschrijvingsset voor de subcollecties en items die bewaard worden in een collectiemanifestatie. @nl
scope note: Een collectie omvat een archiefcollectie. @nl

has index
status: Published
definition: Relates a manifestation to a work that is a systematic guide to the content of a manifestation that embodies a textual work.
type: Property
domain: C10007
lexical alias: index.en
has element type: 2
toolkit label: index
toolkit definition: A work that is a systematic guide to the content of a manifestation that embodies a textual work.
sub property of: has related work of manifestation
toolkit definition: Teos, joka on systemaattinen opas tekstiteoksen sisältävän manifestaation sisältöön. @fi
toolkit label: hakemisto @fi
definition: Liittää manifestaation teokseen, joka on systemaattinen opas tekstiteoksen sisältävän manifestaation sisältöön. @fi
label: hakemisto @fi
label: 有索引 @zh-hans
definition: 将一种载体表现与作为具体化一种文字作品的一种载体表现之内容的系统性指引的一种作品关联起来。 @zh-hans
toolkit label: 索引 @zh-hans
toolkit definition: 作为具体化一种文字作品的一种载体表现之内容的系统性指引的一种作品 @zh-hans
label: té índex @ca
definition: Relaciona una manifestació amb una obra que és una guia sistemàtica del contingut d’una manifestació que materialitza una obra textual. @ca
toolkit label: índex @ca
toolkit definition: Obra que és una guia sistemàtica del contingut d’una manifestació que materialitza una obra textual. @ca
label: a pour index @fr
definition: Met une manifestation en relation avec une œuvre qui constitue un guide systématique du contenu d’une manifestation matérialisant une œuvre textuelle. @fr
toolkit definition: Œuvre qui constitue un guide systématique du contenu d’une manifestation matérialisant une œuvre textuelle. @fr
label: indeks ile ilişkilidir @tr
definition: Bir gösterimi, metinsel bir eseri somutlaştıran gösterimin içeriğine sistematik rehber olan eserle ilişkilendirir. @tr
toolkit label: dizin @tr
toolkit definition: Metinsel bir eseri somutlaştıran gösterimin içeriğine sistematik rehber olan eser. @tr
label: tiene índice @es
definition: Relaciona una manifestación con una obra que es una guía sistemática del contenido de una manifestación que materializa una obra textual. @es
toolkit label: índice @es
toolkit definition: Una obra que es una guía sistemática del contenido de una manifestación que materializa una obra textual. @es
has subproperty: P30466
label: heeft index @nl
definition: Relateert een manifestatie aan een werk dat is een systematische gids op de inhoud van een manifestatie die een tekstwerk belichaamt. @nl
toolkit definition: Een werk dat is een systematische gids op de inhoud van een manifestatie die een tekstwerk belichaamt. @nl