RDA Layout
type: ConceptScheme
description: Concepts for an arrangement of text, images, tactile notation, or other content in a manifestation.
preferred namespace prefix: rdalay
rights: Copyright © 2020 American Library Association, Canadian Federation of Library Associations, and CILIP: Chartered Institute of Library and Information Professionals
licence: deed.en US
creator: RDA Steering Committee
contributor: RSC Technical Working Group
publisher: ALA Digital Reference
type: http://rdaregistry.info/termList/RDALinkedDataWork/1002
issued: 2009-04-12
title: RDA:n layout @fi
description: Käsitteet manifestaatioon sisältyvien tekstin, kuvien, taktiilin nuottikirjoituksen tai muun sisällön sommittelulle. @fi
rights: Copyright © 2020 American Library Association, Canadian Federation of Library Associations ja CILIP: Chartered Institute of Library and Information Professionals @fi
title: Disposition RDA @fr
rights: Copyright © 2020 American Library Association, Fédération canadienne des associations de bibliothèques et CILIP: Chartered Institute of Library and Information Professionals @fr
title: مخطط "وام" @ar
description: مفاهيم لترتيب النص، والصورة، والتدوينة الملموسة، إلخ. في تجسيدة. @ar
rights: حقوق النشر© 2020، جمعية المكتبات الأمريكية، والاتحاد الكندي لجمعيات المكتبات، والمعهد القانوني للمكتبات ومهنيي المعلومات @ar
title: RDA-Vokabular für Layouts @de
description: Begriffe für eine Anordnung von Text, Bildern, taktiler Notation oder anderem Inhalt in einer Manifestation. @de
title: RDA版式 @zh-hans
description: 用于载体表现中对文本、图像、触摸标记或其他内容的安排的概念 @zh-hans
rights: 版权 ? 2020 美国图书馆协会、加拿大图书馆协会联盟、英国图书馆和信息从业人员学会 @zh-hans
description: Concepts décrivant un agencement du texte, des images, de la notation tactile ou de tout autre contenu dans une manifestation. @fr
title: RDA-illusztratív tartalom @hu
description: Fogalmak egy képi tartalom azon kifejezésiforma-típusainak a jelöléséhez, amely kiegészíti az aggregátumban megtestesülő fő kifejezési formákat. @hu
title: RDA Düzenleme @tr
description: Bir gösterimdeki metnin, görüntünün, dokunsal notasyonun veya diğer içeriklerin düzenlenmesine yönelik kavramlar. @tr
version info: v5.4.11
modified: 2025-12-12
title: Diseño RDA @es
description: Conceptos para una disposición de texto, imágenes, notación táctil u otro contenido en una manifestación. @es
rights: Derechos reservados © 2020 American Library Association, Canadian Federation of Library Associations, and CILIP: Chartered Institute of Library and Information Professionals @es
title: Disposició RDA @ca

back to back
type: Concept
in scheme: RDA Layout
status: Published
toolkit label: back to back
toolkit definition: A layout in which the same image is represented in more than one language on each side of a sheet.
scope note: This term applies to cartographic images.
preferred label: back-to-back @it
toolkit label: back-to-back @it
toolkit definition: Ein Layout, bei dem das gleiche Bild in mehr als einer Sprache auf jeder Seite eines Blattes dargestellt wird. @de
scope note: Dieser Terminus trifft auf kartografische Bilder zu. @de
preferred label: kääntöpuolilla @fi
toolkit label: kääntöpuolilla @fi
toolkit definition: Layout, jossa sama kuva esitetään useammalla kuin yhdellä kielellä arkin eri puolilla. @fi
scope note: Termi koskee kartografisia kuvia. @fi
preferred label: giáp lưng @vi
toolkit label: giáp lưng @vi
toolkit definition: Sắp đặt trong đó cùng một hình ảnh được trình bày theo hai hoặc nhiều hơn ngôn ngữ trên mỗi mặt của tờ. @vi
scope note: Thuật ngữ này áp dụng cho hình ảnh bản đồ. @vi
toolkit definition: Layout hvor det samme billede er repræsenteret ved mere end ét sprog på hver side af et ark. @da
scope note: Denne term anvendes til kartografiske billeder. @da
preferred label: dos à dos @fr
toolkit label: dos à dos @fr
toolkit definition: Disposition dans laquelle la même image est présentée dans plus d’une langue sur chaque côté d’une feuille. @fr
scope note: Ce terme s’applique aux images cartographiques. @fr
toolkit definition: Et oppsett der det samme bildet er gjengitt på mer enn ett språk på hver side av et ark. @no
scope note: Dette begrepet gjelder kartografiske bilder. @no
preferred label: cara i cara @ca
toolkit label: cara i cara @ca
toolkit definition: Disposició en què es representa la mateixa imatge en més d’una llengua a cada cara d’un full. @ca
scope note: El terme s’aplica a imatges cartogràfiques. @ca
notation: 1003
toolkit definition: Elrendezés, ami ugyanazt a képet egynél több nyelven jeleníti meg egy lap mindkét oldalán. @hu
scope note: Ez a megnevezés kartográfiai képekre vonatkozik. @hu
preferred label: συνακόλουθη @el
toolkit label: συνακόλουθη @el
toolkit definition: Μια τυπογραφική διάταξη στην οποία η ίδια εικόνα αναπαρίσταται σε περισσότερες της μίας γλώσσες σε κάθε όψη ενός φύλλου. @el
scope note: Αυτός ο όρος βρίσκει εφαρμογή σε χαρτογραφικές εικόνες. @el
preferred label: على كل جانب من الوارق @ar
toolkit label: على كل جانب من الوارق @ar
toolkit definition: تخطيط يتم فيه تمثيل الصورة نفسها بأكثر من لغة على كل جانب من الورقة. @ar
scope note: ينطبق هذا المصطلح على الصور الخرائطية. @ar
toolkit definition: Layout nel quale la stessa immagine viene presentata in più di una lingua su ciascun lato di un foglio. @it
scope note: Il termine si applica alle immagini cartografiche. @it
preferred label: ruggelings @nl
toolkit label: ruggelings @nl
toolkit definition: Een lay-out waarbij hetzelfde beeld vertegenwoordigd is in meer dan één taal elk aan een zijde van een vel. @nl
scope note: Deze term is van toepassing op cartografische beelden. @nl
preferred label: seljakuti @et
toolkit label: seljakuti @et
toolkit definition: Küljendus, mille puhul üks ja sama kujutis esitatakse mitmes keeles lehe eri pooltel. @et
scope note: Termin puudutab kartograafilisi kujutisi. @et
preferred label: abpusēja @lv
toolkit label: abpusēja @lv
toolkit definition: Izkārtojums, kad viens un tas pats kartogrāfiskais attēls vairākās valodās atrodas katrs savā lapas pusē. @lv
scope note: Termins attiecas uz kartogrāfiskiem attēliem. @lv
definition: A layout in which the same image is represented in more than one language on each side of a sheet.
definition: Layout, jossa sama kuva esitetään useammalla kuin yhdellä kielellä arkin eri puolilla. @fi
definition: Ein Layout, bei dem das gleiche Bild in mehr als einer Sprache auf jeder Seite eines Blattes dargestellt wird. @de
definition: Sắp đặt trong đó cùng một hình ảnh được trình bày theo hai hoặc nhiều hơn ngôn ngữ trên mỗi mặt của tờ. @vi
definition: Layout hvor det samme billede er repræsenteret ved mere end ét sprog på hver side af et ark. @da
definition: Disposition dans laquelle la même image est présentée dans plus d’une langue sur chaque côté d’une feuille. @fr
definition: Et oppsett der det samme bildet er gjengitt på mer enn ett språk på hver side av et ark. @no
definition: Disposició en què es representa la mateixa imatge en més d’una llengua a cada cara d’un full. @ca
definition: Elrendezés, ami ugyanazt a képet egynél több nyelven jeleníti meg egy lap mindkét oldalán. @hu
definition: Μια τυπογραφική διάταξη στην οποία η ίδια εικόνα αναπαρίσταται σε περισσότερες της μίας γλώσσες σε κάθε όψη ενός φύλλου. @el
definition: تخطيط يتم فيه تمثيل الصورة نفسها بأكثر من لغة على كل جانب من الورقة. @ar
definition: Layout nel quale la stessa immagine viene presentata in più di una lingua su ciascun lato di un foglio. @it
definition: Een lay-out waarbij hetzelfde beeld vertegenwoordigd is in meer dan één taal elk aan een zijde van een vel. @nl
definition: Küljendus, mille puhul üks ja sama kujutis esitatakse mitmes keeles lehe eri pooltel. @et
definition: Izkārtojums, kad viens un tas pats kartogrāfiskais attēls vairākās valodās atrodas katrs savā lapas pusē. @lv
preferred label: 背靠背 @zh-hans
toolkit label: 背靠背 @zh-hans
toolkit definition: 同一个图像被用多种语言在一个印张的每面表现出来的一种版式 @zh-hans
scope note: 该术语适用于地图图像。 @zh-hans
definition: 同一个图像被用多种语言在一个印张的每面表现出来的一种版式 @zh-hans
preferred label: arka arkaya @tr
toolkit label: arka arkaya @tr
toolkit definition: Aynı görüntünün, bir sayfanın her iki tarafınında birden fazla dilde temsil edildiği bir düzen @tr
scope note: Bu terim, kartografik görüntüler için geçerlidir @tr

bar by bar
type: Concept
in scheme: RDA Layout
status: Published
toolkit label: bar by bar
toolkit definition: A layout that consists of music displayed in indented paragraphs with all of the parts for each measure written consecutively.
scope note: This term applies to tactile music notation.
preferred label: battuta per battuta @it
toolkit label: battuta per battuta @it
preferred label: Takt für Takt @de
toolkit label: Takt für Takt @de
toolkit definition: Ein Layout, bei dem Noten in eingerückten Absätzen dargestellt werden, wobei alle Stimmen für jeden Takt nacheinander folgend geschrieben sind. @de
scope note: Dieser Terminus trifft auf taktile Noten zu. @de
preferred label: tahdit peräkkäin @fi
toolkit label: tahdit peräkkäin @fi
toolkit definition: Layout, jossa sisennetyissä kappaleissa esitetyssä nuottikirjoituksessa stemmojen tahdit on merkitty peräkkäin. @fi
scope note: Termi koskee taktiileja musiikkiaineistoja. @fi
preferred label: gạch nhịp sau gạch nhịp @vi
toolkit label: gạch nhịp sau gạch nhịp @vi
toolkit definition: Sắp đặt bao gồm có âm nhạc được hiện trong các đoạn dự kiến với tất cả các phần cho mỗi nhịp được viết liên tiếp. @vi
scope note: Thuật ngữ này áp dụng cho tài nguyên âm nhạc xúc giác. @vi
preferred label: takt for takt @da
toolkit label: takt for takt @da
toolkit definition: Layout bestående af musik vist i indrykkede afsnit med alle stemmerne for hver takt skrevet efter hinanden. @da
scope note: Denne term anvendes til taktil musiknotation. @da
preferred label: mesure par mesure @fr
toolkit label: mesure par mesure @fr
toolkit definition: Disposition qui consiste en musique présentée sous forme de paragraphes en retrait dans lesquels toutes les parties figurant dans une même mesure sont écrites l’une à la suite de l’autre. @fr
scope note: Ce terme s’applique à la notation musicale tactile. @fr
toolkit definition: Et oppsett som består av noter vist i avsnitt med innrykk der alle stemmene for hver takt er skrevet fortløpende. @no
scope note: Dette begrepet gjelder taktil musikknotasjon. @no
preferred label: compàs per compàs @ca
toolkit label: compàs per compàs @ca
toolkit definition: Disposició que consisteix en música que es visualitza en paràgrafs sagnats i amb totes les parts per a cada compàs escrites consecutivament. @ca
scope note: El terme s’aplica a la notació de música tàctil. @ca
notation: 1004
preferred label: ütem ütem mellett @hu
toolkit label: ütem ütem mellett @hu
toolkit definition: Elrendezés, amiben a zenét behúzott bekezdésekben mutatják be, és minden egyes ütem összes szólamát egymás után írják. @hu
scope note: Ez a megnevezés tapintható zenei lejegyzésekre vonatkozik. @hu
preferred label: μέτρο προς μέτρο @el
toolkit label: μέτρο προς μέτρο @el
toolkit definition: Μια τυπογραφική διάταξη η οποία συνίσταται από μουσική προβαλλόμενη σε παραγράφους με όλα τα μέρη γραμμένα διαδοχικά για κάθε μέτρο. @el
scope note: Αυτός ο όρος βρίσκει εφαρμογή σε απτική μουσική σημειογραφία. @el
preferred label: عارضة (ميزان) تلو عارضة @ar
toolkit label: عارضة (ميزان) تلو عارضة @ar
toolkit definition: تخطيط يتكون من موسيقى معروضة على شكل فقرات بمسافة بادئة مع كتابة جميع الأجزاء لكل ميزان على التوالي. @ar
scope note: ينطبق هذا المصطلح على تدوين الموسيقى اللمسي. @ar
toolkit definition: Layout che consiste di musica presentata in paragrafi indentati con tutte le parti per ciascuna battuta scritte consecutivamente. @it
scope note: Il termine si applica alla notazione musicale tattile. @it
preferred label: maat voor maat @nl
toolkit label: maat voor maat @nl
toolkit definition: Een lay-out die bestaat uit muziek weergegeven door ingesprongen paragrafen met alle partijen voor elke maat achtereenvolgend geschreven. @nl
scope note: Deze term is van toepassing op tactiele muzieknotatie. @nl
preferred label: taktid järjestikku @et
toolkit label: taktid järjestikku @et
toolkit definition: Küljendus, mille puhul muusikanotatsioon on esitatud taandega lõikudena, milles kõik partiid igas taktis on märgitud järjestikku. @et
scope note: Termin puudutab taktiilset muusikanotatsiooni. @et
preferred label: taktssvītra aiz taktssvītras (vertikālais pieraksts) @lv
toolkit label: taktssvītra aiz taktssvītras (vertikālais pieraksts) @lv
toolkit definition: Izkārtojums mūzikā, kas atrādīta ar visām daļām, kas rakstītas secīgi. @lv
scope note: Termins attiecas uz taktilās mūzikas pierakstu. @lv
definition: A layout that consists of music displayed in indented paragraphs with all of the parts for each measure written consecutively.
definition: Layout, jossa sisennetyissä kappaleissa esitetyssä nuottikirjoituksessa stemmojen tahdit on merkitty peräkkäin. @fi
definition: Ein Layout, bei dem Noten in eingerückten Absätzen dargestellt werden, wobei alle Stimmen für jeden Takt nacheinander folgend geschrieben sind. @de
definition: Sắp đặt bao gồm có âm nhạc được hiện trong các đoạn dự kiến với tất cả các phần cho mỗi nhịp được viết liên tiếp. @vi
definition: Layout bestående af musik vist i indrykkede afsnit med alle stemmerne for hver takt skrevet efter hinanden. @da
definition: Disposition qui consiste en musique présentée sous forme de paragraphes en retrait dans lesquels toutes les parties figurant dans une même mesure sont écrites l’une à la suite de l’autre. @fr
definition: Et oppsett som består av noter vist i avsnitt med innrykk der alle stemmene for hver takt er skrevet fortløpende. @no
definition: Disposició que consisteix en música que es visualitza en paràgrafs sagnats i amb totes les parts per a cada compàs escrites consecutivament. @ca
definition: Elrendezés, amiben a zenét behúzott bekezdésekben mutatják be, és minden egyes ütem összes szólamát egymás után írják. @hu
definition: Μια τυπογραφική διάταξη η οποία συνίσταται από μουσική προβαλλόμενη σε παραγράφους με όλα τα μέρη γραμμένα διαδοχικά για κάθε μέτρο. @el
definition: تخطيط يتكون من موسيقى معروضة على شكل فقرات بمسافة بادئة مع كتابة جميع الأجزاء لكل ميزان على التوالي. @ar
definition: Layout che consiste di musica presentata in paragrafi indentati con tutte le parti per ciascuna battuta scritte consecutivamente. @it
definition: Een lay-out die bestaat uit muziek weergegeven door ingesprongen paragrafen met alle partijen voor elke maat achtereenvolgend geschreven. @nl
definition: Küljendus, mille puhul muusikanotatsioon on esitatud taandega lõikudena, milles kõik partiid igas taktis on märgitud järjestikku. @et
definition: Izkārtojums mūzikā, kas atrādīta ar visām daļām, kas rakstītas secīgi. @lv
preferred label: 逐小节 @zh-hans
toolkit label: 逐小节 @zh-hans
toolkit definition: 由每小节所有声部连续书写的按缩格段落显示的乐谱组成的一种版式 @zh-hans

bar over bar
type: Concept
in scheme: RDA Layout
status: Published
toolkit label: bar over bar
toolkit definition: A layout that consists of measures displayed in units called parallels where the beginning of the measure for each part is vertically aligned with the beginning of the same measure for the other parts.
scope note: This term applies to tactile music notation.
preferred label: battuta sopra battuta @it
toolkit label: battuta sopra battuta @it
preferred label: Takt über Takt @de
toolkit label: Takt über Takt @de
toolkit definition: Ein Layout, bei dem Noten in Einheiten, sogenannten Parallelen, dargestellt werden, wobei der Beginn eines Takts bei jeder Stimme senkrecht über dem gleichen Takt für jede andere Stimme steht. @de
scope note: Dieser Terminus trifft auf taktile Noten zu. @de
preferred label: tahdit allekkain @fi
toolkit label: tahdit allekkain @fi
toolkit definition: Layout, jossa rinnakkaisesti esitettyjen stemmojen tahtien alut on pystysuuntaisesti kohdistettu keskenään. @fi
scope note: Termi koskee taktiileja musiikkiaineistoja. @fi
preferred label: gạch nhịp trên gạch nhịp @vi
toolkit label: gạch nhịp trên gạch nhịp @vi
toolkit definition: Sắp đặt gồm có các nhịp được hiện thành các đơn vị gọi là tương đương bắt đầu mỗi nhịp được sắp hàng dọc với bắt đầu bằng cùng nhịp cho mỗi phần hoặc các phần. @vi
scope note: Thuật ngữ này áp dụng cho tài nguyên âm nhạc xúc giác. @vi
preferred label: takt over takt @da
toolkit label: takt over takt @da
toolkit definition: Layout bestående af musik vist i enheder kaldet paralleller og hvor starten af hver stemmes takt er på linje med starten af den samme takt for den anden stemme eller stemmer. @da
scope note: Denne term anvendes til taktil musiknotation. @da
preferred label: mesure sur mesure @fr
toolkit label: mesure sur mesure @fr
toolkit definition: Disposition qui consiste en mesures présentées sous forme d’unités appelées parallèles dans lesquelles le début de chaque mesure dans une partie donnée est aligné verticalement avec le début de la même mesure dans les autres parties. @fr
scope note: Ce terme s’applique à la notation musicale tactile. @fr
toolkit definition: Et oppsett som består av takter som vises i parallelle enheter der begynnelsen av takten for hver stemme er på loddrett linje med begynnelsen av samme takten for alle de andre stemmene. @no
scope note: Dette begrepet gjelder taktil musikknotasjon. @no
preferred label: compàs sobre compàs @ca
toolkit label: compàs sobre compàs @ca
toolkit definition: Disposició que consisteix en compassos que es visualitzen en unitats anomenades paral·lels en què el començament de cada compàs de les parts s’alinea verticalment amb el començament del mateix compàs de les altres parts. @ca
scope note: El terme s’aplica a la notació de música tàctil. @ca
notation: 1005
preferred label: ütem ütem felett @hu
toolkit label: ütem ütem felett @hu
toolkit definition: Elrendezés, amiben az ütemeket parallelnek nevezett egységekben mutatják be, ahol egy szólam ütemének kezdetét függőlegesen a többi szólam azonos ütemének kezdetéhez igazítják. @hu
scope note: Ez a megnevezés tapintható zenei lejegyzésekre vonatkozik. @hu
preferred label: μέτρο πάνω από μέτρο @el
toolkit label: μέτρο πάνω από μέτρο @el
toolkit definition: Μια τυπογραφική διάταξη η οποία συνίσταται από μέτρα προβαλλόμενα σε μονάδες ονομαζόμενες παράλληλοι, όπου η έναρξη του μέτρου για το κάθε μέρος ευθυγραμμίζεται κάθετα με την έναρξη του ίδιου μέτρου για τα άλλα μέρη. @el
scope note: Αυτός ο όρος βρίσκει εφαρμογή σε απτική μουσική σημειογραφία. @el
preferred label: عارضة (ميزان) فوق عارضة @ar
toolkit label: عارضة (ميزان) فوق عارضة @ar
toolkit definition: تخطيط يتكون من موازين يتم عرضها على شكل وحدات تسمى المتوازيات ويتم محاذاة بداية ميزان كل جزء عموديا مع بداية نفس الميزان للأجزاء الأخرى. @ar
scope note: ينطبق هذا المصطلح على تدوين الموسيقى اللمسي. @ar
toolkit definition: Layout che consiste di battute presentate in unità dette parallele dove l'inizio della battuta di ciascuna parte è allineato verticalmente con l'inizio della stessa battuta per tutte le altre parti. @it
scope note: Il termine si applica alla notazione musicale tattile. @it
preferred label: maat boven maat @nl
toolkit label: maat boven maat @nl
toolkit definition: Een lay-out die bestaat uit maten weergegeven door eenheden genaamd parallellen waarbij het begin van de maat voor elke partij verticaal uitgelijnd is met het begin van dezelfde maat voor de andere partijen. @nl
scope note: Deze term is van toepassing op tactiele muzieknotatie. @nl
preferred label: taktid üksteise all @et
toolkit label: taktid üksteise all @et
toolkit definition: Küljendus, mille puhul taktid on esitatud paralleelsete üksustena, nii et kõigi partiide taktide algused on joondatud vertikaalselt. @et
scope note: Termin puudutab taktiilset muusikanotatsiooni. @et
preferred label: taktssvītra virs taktssvītras (horizontālais pieraksts) @lv
toolkit label: taktssvītra virs taktssvītras (horizontālais pieraksts) @lv
toolkit definition: Izkārtojums sastāv no slejām, kas attēlotas paralēli un kur katras daļas sākuma vienība ir vertikāli saskaņota ar citu daļu sākuma vienību. @lv
scope note: Termins attiecas uz taktilās mūzikas pierakstu. @lv
definition: A layout that consists of measures displayed in units called parallels where the beginning of the measure for each part is vertically aligned with the beginning of the same measure for the other parts.
definition: Layout, jossa rinnakkaisesti esitettyjen stemmojen tahtien alut on pystysuuntaisesti kohdistettu keskenään. @fi
definition: Ein Layout, bei dem Noten in Einheiten, sogenannten Parallelen, dargestellt werden, wobei der Beginn eines Takts bei jeder Stimme senkrecht über dem gleichen Takt für jede andere Stimme steht. @de
definition: Sắp đặt gồm có các nhịp được hiện thành các đơn vị gọi là tương đương bắt đầu mỗi nhịp được sắp hàng dọc với bắt đầu bằng cùng nhịp cho mỗi phần hoặc các phần. @vi
definition: Layout bestående af musik vist i enheder kaldet paralleller og hvor starten af hver stemmes takt er på linje med starten af den samme takt for den anden stemme eller stemmer. @da
definition: Disposition qui consiste en mesures présentées sous forme d’unités appelées parallèles dans lesquelles le début de chaque mesure dans une partie donnée est aligné verticalement avec le début de la même mesure dans les autres parties. @fr
definition: Et oppsett som består av takter som vises i parallelle enheter der begynnelsen av takten for hver stemme er på loddrett linje med begynnelsen av samme takten for alle de andre stemmene. @no
definition: Disposició que consisteix en compassos que es visualitzen en unitats anomenades paral·lels en què el començament de cada compàs de les parts s’alinea verticalment amb el començament del mateix compàs de les altres parts. @ca
definition: Elrendezés, amiben az ütemeket parallelnek nevezett egységekben mutatják be, ahol egy szólam ütemének kezdetét függőlegesen a többi szólam azonos ütemének kezdetéhez igazítják. @hu
definition: Μια τυπογραφική διάταξη η οποία συνίσταται από μέτρα προβαλλόμενα σε μονάδες ονομαζόμενες παράλληλοι, όπου η έναρξη του μέτρου για το κάθε μέρος ευθυγραμμίζεται κάθετα με την έναρξη του ίδιου μέτρου για τα άλλα μέρη. @el
definition: تخطيط يتكون من موازين يتم عرضها على شكل وحدات تسمى المتوازيات ويتم محاذاة بداية ميزان كل جزء عموديا مع بداية نفس الميزان للأجزاء الأخرى. @ar
definition: Layout che consiste di battute presentate in unità dette parallele dove l'inizio della battuta di ciascuna parte è allineato verticalmente con l'inizio della stessa battuta per tutte le altre parti. @it
definition: Een lay-out die bestaat uit maten weergegeven door eenheden genaamd parallellen waarbij het begin van de maat voor elke partij verticaal uitgelijnd is met het begin van dezelfde maat voor de andere partijen. @nl
definition: Küljendus, mille puhul taktid on esitatud paralleelsete üksustena, nii et kõigi partiide taktide algused on joondatud vertikaalselt. @et
definition: Izkārtojums sastāv no slejām, kas attēlotas paralēli un kur katras daļas sākuma vienība ir vertikāli saskaņota ar citu daļu sākuma vienību. @lv
preferred label: 上下小节方式 @zh-hans
toolkit label: 上下小节方式 @zh-hans
toolkit definition: 由按被称为平行的单元显示（其中每声部的小节的开始与其他声部的同一个小节的开始对齐）的小节组成的一种版式 @zh-hans

both sides
type: Concept
in scheme: RDA Layout
status: Published
toolkit label: both sides
toolkit definition: A layout that is continued at the same scale on both sides of a sheet or sheets.
scope note: This term applies to cartographic images.
preferred label: entrambi i lati @it
toolkit label: entrambi i lati @it
preferred label: beidseitig @de
toolkit label: beidseitig @de
toolkit definition: Ein Layout, das im selben Maßstab auf beiden Seiten eines Blatts fortgesetzt wird. @de
scope note: Dieser Terminus trifft auf kartografische Bilder zu. @de
preferred label: molemmilla puolilla @fi
toolkit label: molemmilla puolilla @fi
toolkit definition: Layout, joka jatkuu samassa mittakaavassa arkin tai arkkien molemmilla puolilla. @fi
scope note: Termi koskee kartografisia kuvia. @fi
preferred label: cả hai mặt @vi
toolkit label: cả hai mặt @vi
toolkit definition: Sắp đặt được tiếp tục theo cùng tỷ lệ trên cả hai mặt của tờ hoặc các tờ. @vi
scope note: Thuật ngữ này áp dụng cho hình ảnh bản đồ. @vi
preferred label: begge sider @da
toolkit label: begge sider @da
toolkit definition: Layout der er fortsat i samme målestoksforhold på begge sider af et eller flere ark. @da
scope note: Denne term anvendes til kartografiske billeder. @da
preferred label: recto verso @fr
toolkit label: recto verso @fr
toolkit definition: Disposition qui se poursuit à la même échelle sur les deux côtés d’une ou plusieurs feuilles. @fr
scope note: Ce terme s’applique aux images cartographiques. @fr
toolkit definition: Et oppsett som fortsetter i samme målestokk på begge sider av ett eller flere ark. @no
scope note: Dette begrepet gjelder kartografiske bilder. @no
preferred label: totes dues cares @ca
toolkit label: totes dues cares @ca
toolkit definition: Disposició que continua a la mateixa escala a totes dues cares d’un full o fulls. @ca
scope note: El terme s’aplica a imatges cartogràfiques. @ca
notation: 1006
preferred label: rektó-verzó @hu
toolkit label: rektó-verzó @hu
toolkit definition: Elrendezés, ami azonos méretaránnyal egy lap vagy lapok mindkét oldalán folytatódik. @hu
scope note: Ez a megnevezés kartográfiai képekre vonatkozik. @hu
preferred label: δύο πλευρές @el
toolkit label: δύο πλευρές @el
toolkit definition: Μια τυπογραφική διάταξη η οποία συνεχίζεται στην ίδια κλίμακα στις δύο όψεις ενός φύλλου ή φύλλων. @el
scope note: Αυτός ο όρος βρίσκει εφαρμογή σε χαρτογραφικές εικόνες. @el
preferred label: كلا الجانبين @ar
toolkit label: كلا الجانبين @ar
toolkit definition: تخطيط يستمر بنفس السلم الموسيقي على كلا الجانبين من ورقة أو عدة أوراق. @ar
scope note: ينطبق هذا المصطلح على الصور الخرائطية. @ar
toolkit definition: Layout che continua alla stessa scala su entrambi i lati di uno o più fogli. @it
scope note: Il termine si applica alle immagini cartografiche. @it
preferred label: beide zijden @nl
toolkit label: beide zijden @nl
toolkit definition: Een lay-out die is voortgezet op dezelfde schaal aan beide zijden van een vel of vellen. @nl
scope note: Deze term is van toepassing op cartografische beelden. @nl
preferred label: mõlemapoolne @et
toolkit label: mõlemapoolne @et
toolkit definition: Küljendus, mis jätkub samas mõõtkavas lehe või lehtede teisel poolel. @et
scope note: Termin puudutab kartograafilisi kujutisi. @et
preferred label: abas puses @lv
toolkit label: abas puses @lv
toolkit definition: Izkārtojums, kas tiek turpināts tajā pašā mērogā abās loksnes vai lokšņu pusēs. @lv
scope note: Termins attiecas uz kartogrāfiskiem attēliem. @lv
definition: A layout that is continued at the same scale on both sides of a sheet or sheets.
definition: Layout, joka jatkuu samassa mittakaavassa arkin tai arkkien molemmilla puolilla. @fi
definition: Ein Layout, das im selben Maßstab auf beiden Seiten eines Blatts fortgesetzt wird. @de
definition: Sắp đặt được tiếp tục theo cùng tỷ lệ trên cả hai mặt của tờ hoặc các tờ. @vi
definition: Layout der er fortsat i samme målestoksforhold på begge sider af et eller flere ark. @da
definition: Disposition qui se poursuit à la même échelle sur les deux côtés d’une ou plusieurs feuilles. @fr
definition: Et oppsett som fortsetter i samme målestokk på begge sider av ett eller flere ark. @no
definition: Disposició que continua a la mateixa escala a totes dues cares d’un full o fulls. @ca
definition: Elrendezés, ami azonos méretaránnyal egy lap vagy lapok mindkét oldalán folytatódik. @hu
definition: Μια τυπογραφική διάταξη η οποία συνεχίζεται στην ίδια κλίμακα στις δύο όψεις ενός φύλλου ή φύλλων. @el
definition: تخطيط يستمر بنفس السلم الموسيقي على كلا الجانبين من ورقة أو عدة أوراق. @ar
definition: Layout che continua alla stessa scala su entrambi i lati di uno o più fogli. @it
definition: Een lay-out die is voortgezet op dezelfde schaal aan beide zijden van een vel of vellen. @nl
definition: Küljendus, mis jätkub samas mõõtkavas lehe või lehtede teisel poolel. @et
definition: Izkārtojums, kas tiek turpināts tajā pašā mērogā abās loksnes vai lokšņu pusēs. @lv
preferred label: 双面 @zh-hans
toolkit label: 双面 @zh-hans
toolkit definition: 印张两面以同样比例尺连续的一种版式 @zh-hans

double line spacing
type: Concept
in scheme: RDA Layout
status: Published
toolkit label: double line spacing
toolkit definition: A layout containing a full blank line between lines of text.
scope note: This term applies to tactile text.
preferred label: interlinea doppia @it
toolkit label: interlinea doppia @it
preferred label: doppelter Zeilenabstand @de
toolkit label: doppelter Zeilenabstand @de
toolkit definition: Ein Layout, das eine ganze Leerzeile zwischen den Zeilen eines Textes enthält. @de
scope note: Dieser Terminus trifft auf Blätter und taktilen Text zu. @de
preferred label: harvennettu riviväli @fi
toolkit label: harvennettu riviväli @fi
toolkit definition: Layout, jossa tekstirivien välillä on tyhjä rivi. @fi
scope note: Termi koskee taktiilia tekstiä. @fi
preferred label: cách dòng đúp @vi
toolkit label: cách dòng đúp @vi
toolkit definition: Sắp đặt có chứa một dòng trống hoàn toàn giữa các dòng văn bản. @vi
scope note: Thuật ngữ này áp dụng cho văn bản xúc giác. @vi
preferred label: dobbelt linjeafstand @da
toolkit label: dobbelt linjeafstand @da
toolkit definition: Layout indeholdende en hel blank linje mellem linjer med tekst. @da
scope note: Denne term anvendes til taktil tekst. @da
preferred label: double interligne @fr
toolkit label: double interligne @fr
toolkit definition: Disposition comprenant une ligne vide complète entre les lignes de texte. @fr
scope note: Ce terme s’applique au texte tactile. @fr
preferred label: dobbel linjeavstand @no
toolkit label: dobbel linjeavstand @no
toolkit definition: Et oppsett med en hel tom linje mellom hver tekstlinje. @no
scope note: Dette begrepet gjelder taktil tekst. @no
preferred label: espaiament de doble línia @ca
toolkit label: espaiament de doble línia @ca
toolkit definition: Disposició que conté una línia en blanc completa entre les línies del text. @ca
scope note: El terme s’aplica a text tàctil. @ca
notation: 1017
preferred label: kétszeres sorköz @hu
toolkit label: kétszeres sorköz @hu
toolkit definition: Elrendezés, ami a szövegsorok között egy teljes üres sort tartalmaz. @hu
scope note: Ez a megnevezés tapintással olvasható szövegre vonatkozik. @hu
preferred label: διπλό διάκενο @el
toolkit label: διπλό διάκενο @el
toolkit definition: Μια τυπογραφική διάταξη η οποία περιέχει μια πλήρως κενή γραμμή μεταξύ των γραμμών του κειμένου. @el
scope note: Αυτός ο όρος βρίσκει εφαρμογή σε απτικό κείμενο. @el
toolkit definition: Layout contenente una intera riga vuota tra le righe di testo. @it
scope note: Il termine si applica al testo tattile. @it
preferred label: dubbele spatiëring @nl
toolkit label: dubbele spatiëring @nl
toolkit definition: Een lay-out die een volle blanco regel bevat tussen regels tekst. @nl
scope note: Deze term is van toepassing op tactiele tekst. @nl
preferred label: kahekordne reavahe @et
toolkit label: kahekordne reavahe @et
toolkit definition: Küljendus, mille puhul tekstiridade vahel on tühi rida. @et
scope note: Termin puudutab taktiilset teksti. @et
preferred label: dubultatstarpe starp rindām @lv
toolkit label: dubultatstarpe starp rindām @lv
toolkit definition: Izkārtojums, kas satur pilnīgi tukšu rindu starp teksta rindām. @lv
scope note: Termins attiecas uz taktilu tekstu. @lv
definition: A layout containing a full blank line between lines of text.
definition: Layout, jossa tekstirivien välillä on tyhjä rivi. @fi
definition: Ein Layout, das eine ganze Leerzeile zwischen den Zeilen eines Textes enthält. @de
definition: Sắp đặt có chứa một dòng trống hoàn toàn giữa các dòng văn bản. @vi
definition: Layout indeholdende en hel blank linje mellem linjer med tekst. @da
definition: Disposition comprenant une ligne vide complète entre les lignes de texte. @fr
definition: Et oppsett med en hel tom linje mellom hver tekstlinje. @no
definition: Disposició que conté una línia en blanc completa entre les línies del text. @ca
definition: Elrendezés, ami a szövegsorok között egy teljes üres sort tartalmaz. @hu
definition: Μια τυπογραφική διάταξη η οποία περιέχει μια πλήρως κενή γραμμή μεταξύ των γραμμών του κειμένου. @el
definition: Layout contenente una intera riga vuota tra le righe di testo. @it
definition: Een lay-out die een volle blanco regel bevat tussen regels tekst. @nl
definition: Küljendus, mille puhul tekstiridade vahel on tühi rida. @et
definition: Izkārtojums, kas satur pilnīgi tukšu rindu starp teksta rindām. @lv
preferred label: تباعد خط مزدوج @ar
toolkit label: تباعد خط مزدوج @ar
definition: تخطيط يحتوي على سطر كامل فارغ بين سطور النص. @ar
toolkit definition: تخطيط يحتوي على سطر كامل فارغ بين سطور النص. @ar
scope note: ينطبق هذا المصطلح على نص ملموس. @ar
preferred label: 双行间距 @zh-hans

double sided
type: Concept
in scheme: RDA Layout
status: Published
toolkit label: double sided
toolkit definition: A layout that uses both sides of a sheet.
scope note: This term applies to sheets and tactile text.
preferred label: fronte retro @it
toolkit label: fronte retro @it
preferred label: doppelseitig @de
toolkit label: doppelseitig @de
toolkit definition: Ein Layout, das beide Seiten eines Blatts verwendet. @de
scope note: Dieser Terminus trifft auf Blätter und taktilen Text zu. @de
preferred label: kaksipuolinen @fi
toolkit label: kaksipuolinen @fi
toolkit definition: Layout, jossa molemmat puolet arkista ovat käytössä. @fi
scope note: Termi koskee arkkeja sekä taktiilia tekstiä. @fi
preferred label: hai mặt @vi
toolkit label: hai mặt @vi
toolkit definition: Sắp đặt sử dụng cả hai mặt của tờ. @vi
scope note: Thuật ngữ này áp dụng cho tờ và văn bản xúc giác. @vi
preferred label: dobbeltsidet @da
toolkit label: dobbeltsidet @da
toolkit definition: Layout der anvender begge sider af et ark. @da
scope note: Denne term anvendes til ark og taktil tekst. @da
preferred label: double face @fr
toolkit label: double face @fr
toolkit definition: Disposition qui utilise les deux côtés d’une feuille. @fr
scope note: Ce terme s’applique aux feuilles et au texte tactile. @fr
preferred label: tosidig @no
toolkit label: tosidig @no
toolkit definition: Et oppsett som bruker begge sider av et ark. @no
scope note: Dette begrepet gjelder ark og taktil tekst. @no
preferred label: doble cara @ca
toolkit label: doble cara @ca
toolkit definition: Disposició que usa les dues cares d’un full. @ca
scope note: El terme s’aplica a fulls i a text tàctil. @ca
notation: 1001
preferred label: kétoldalas @hu
toolkit label: kétoldalas @hu
toolkit definition: Elrendezés, ami egy lap mindkét oldalát használja. @hu
scope note: Ez a megnevezés lapokra és tapintható szövegre vonatkozik. @hu
preferred label: διπλής όψης @el
toolkit label: διπλής όψης @el
toolkit definition: Μια τυπογραφική διάταξη η οποία χρησιμοποιεί και τις δύο όψεις ενός φύλλου. @el
scope note: Αυτός ο όρος βρίσκει εφαρμογή σε φύλλα και απτικό κείμενο. @el
toolkit definition: Layout che usa entrambi i lati di un foglio. @it
scope note: Il termine si applica ai fogli e al testo tattile. @it
preferred label: dubbelzijdig @nl
toolkit label: dubbelzijdig @nl
toolkit definition: Een lay-out die beide zijden van een vel gebruikt. @nl
scope note: Deze term is van toepassing op vellen en tactiele tekst. @nl
preferred label: kahepoolne @et
toolkit label: kahepoolne @et
toolkit definition: Küljendus, mille puhul on kasutuses lehe mõlemad pooled. @et
scope note: Termin puudutab lehti ja taktiilset teksti. @et
preferred label: divpusējs @lv
toolkit label: divpusējs @lv
toolkit definition: Izkārtojums, kurā teksts ir lapas abās pusēs. @lv
scope note: Termins attiecas uz taktilu tekstu un iespiedloksnēm. @lv
definition: A layout that uses both sides of a sheet.
definition: Layout, jossa molemmat puolet arkista ovat käytössä. @fi
definition: Ein Layout, das beide Seiten eines Blatts verwendet. @de
definition: Sắp đặt sử dụng cả hai mặt của tờ. @vi
definition: Layout der anvender begge sider af et ark. @da
definition: Disposition qui utilise les deux côtés d’une feuille. @fr
definition: Et oppsett som bruker begge sider av et ark. @no
definition: Disposició que usa les dues cares d’un full. @ca
definition: Elrendezés, ami egy lap mindkét oldalát használja. @hu
definition: Μια τυπογραφική διάταξη η οποία χρησιμοποιεί και τις δύο όψεις ενός φύλλου. @el
definition: Layout che usa entrambi i lati di un foglio. @it
definition: Een lay-out die beide zijden van een vel gebruikt. @nl
definition: Küljendus, mille puhul on kasutuses lehe mõlemad pooled. @et
definition: Izkārtojums, kurā teksts ir lapas abās pusēs. @lv
preferred label: مزوج الوجه @ar
toolkit label: مزوج الوجه @ar
definition: تخطيط يَستخدِم كلا وجهي الورقة. @ar
toolkit definition: مخطط يَستخدِم كلا وجهي الورقة. @ar
scope note: ينطبق هذا المصطلح على الأوراق والنصوص اللمسية. @ar
preferred label: 双面 @zh-hans

line by line
type: Concept
in scheme: RDA Layout
status: Published
toolkit label: line by line
toolkit definition: A layout that consists of lines of text that alternate with lines of music for the preceding text.
scope note: This term applies to tactile music notation.
preferred label: linea per linea @it
toolkit label: linea per linea @it
preferred label: Linie für Linie @de
toolkit label: Linie für Linie @de
toolkit definition: Ein Layout, bei dem sich Textzeilen mit Notenzeilen, die zum vorhergehenden Text gehören, abwechseln. @de
scope note: Dieser Terminus trifft auf taktile Noten zu. @de
preferred label: säkeet peräkkäin @fi
toolkit label: säkeet peräkkäin @fi
toolkit definition: Layout, jossa tekstisäkeet vuorottelevat nuottisäkeiden kanssa. Tekstisäkeet edeltävät nuottisäkeitä. @fi
scope note: Termi koskee taktiileja musiikkiaineistoja. @fi
preferred label: dòng sau dòng @vi
toolkit label: dòng sau dòng @vi
toolkit definition: Sắp đặt gồm có các dòng của văn bản xen kẽ với các dòng âm nhạc đối với văn bản có trước. @vi
scope note: Thuật ngữ này áp dụng cho tài nguyên âm nhạc xúc giác. @vi
preferred label: linje for linje @da
toolkit label: linje for linje @da
toolkit definition: Layout bestående skiftevis af linjer med tekst og linjer med musik til den foregående tekst. @da
scope note: Denne term anvendes til taktil musiknotation. @da
preferred label: ligne par ligne @fr
toolkit label: ligne par ligne @fr
toolkit definition: Disposition qui consiste en lignes de texte qui alternent avec des lignes de musique correspondant au texte qui précède. @fr
scope note: Ce terme s’applique à la notation musicale tactile. @fr
toolkit definition: Et oppsett som består av vekselvis linjer med tekst og linjer med musikk til teksten på linjen over. @no
scope note: Dette begrepet gjelder taktil musikknotasjon. @no
preferred label: línia per línia @ca
toolkit label: línia per línia @ca
toolkit definition: Disposició que consisteix en línies de text que s’alternen amb les línies de música del text precedent. @ca
scope note: El terme s’aplica a la notació de música tàctil. @ca
notation: 1007
preferred label: sor sor mellett @hu
toolkit label: sor sor mellett @hu
toolkit definition: Elrendezés, ami szövegsorok és a megelőző szöveghez tartozó zenei sorok váltakozásából áll. @hu
scope note: Ez a megnevezés tapintható zenei lejegyzésekre vonatkozik. @hu
preferred label: γραμμή προς γραμμή @el
toolkit label: γραμμή προς γραμμή @el
toolkit definition: Μια τυπογραφική διάταξη η οποία συνίσταται από γραμμές κειμένου οι οποίες εναλάσσονται με γραμμές μουσικής για το προηγούμενο κείμενο. @el
scope note: Αυτός ο όρος βρίσκει εφαρμογή σε απτική μουσική σημειογραφία. @el
preferred label: سطر تلو الآخر @ar
toolkit label: سطر تلو الآخر @ar
toolkit definition: تخطيط يتكون من أسطر النص تتناوب مع أسطر موسيقى النص الذي يسبقها. @ar
scope note: ينطبق هذا المصطلح على تدوين الموسيقى اللمسية. @ar
toolkit definition: Layout che consiste di righe di testo alternate con le relative righe di musica. @it
scope note: Il termine si applica alla notazione musicale tattile. @it
preferred label: regel voor regel @nl
toolkit label: regel voor regel @nl
toolkit definition: Een lay-out die bestaat uit regels tekst die afwisselen met regels muziek voor de tekst die voorafging. @nl
scope note: Deze term is van toepassing op tactiele muzieknotatie. @nl
preferred label: read järjestikku @et
toolkit label: read järjestikku @et
toolkit definition: Küljendus, mille puhul tekstiread vahelduvad noodiridadega, mis kuuluvad eelneva tekstirea kohta. @et
scope note: Termin puudutab taktiilset muusikanotatsiooni. @et
preferred label: līnija aiz līnijas @lv
toolkit label: līnija aiz līnijas @lv
toolkit definition: Izkārtojums, kas sastāv no teksta rindām, kas iepriekšējo tekstu aizstāj ar mūzikas rindām. @lv
scope note: Termins attiecas uz taktilās mūzikas pierakstu. @lv
definition: A layout that consists of lines of text that alternate with lines of music for the preceding text.
definition: Layout, jossa tekstisäkeet vuorottelevat nuottisäkeiden kanssa. Tekstisäkeet edeltävät nuottisäkeitä. @fi
definition: Ein Layout, bei dem sich Textzeilen mit Notenzeilen, die zum vorhergehenden Text gehören, abwechseln. @de
definition: Sắp đặt gồm có các dòng của văn bản xen kẽ với các dòng âm nhạc đối với văn bản có trước. @vi
definition: Layout bestående skiftevis af linjer med tekst og linjer med musik til den foregående tekst. @da
definition: Disposition qui consiste en lignes de texte qui alternent avec des lignes de musique correspondant au texte qui précède. @fr
definition: Et oppsett som består av vekselvis linjer med tekst og linjer med musikk til teksten på linjen over. @no
definition: Disposició que consisteix en línies de text que s’alternen amb les línies de música del text precedent. @ca
definition: Elrendezés, ami szövegsorok és a megelőző szöveghez tartozó zenei sorok váltakozásából áll. @hu
definition: Μια τυπογραφική διάταξη η οποία συνίσταται από γραμμές κειμένου οι οποίες εναλάσσονται με γραμμές μουσικής για το προηγούμενο κείμενο. @el
definition: مخطط يتكون من سطور نص تتناوب مع سطور موسيقى النص الذي يسبقها. @ar
definition: Layout che consiste di righe di testo alternate con le relative righe di musica. @it
definition: Een lay-out die bestaat uit regels tekst die afwisselen met regels muziek voor de tekst die voorafging. @nl
definition: Küljendus, mille puhul tekstiread vahelduvad noodiridadega, mis kuuluvad eelneva tekstirea kohta. @et
definition: Izkārtojums, kas sastāv no teksta rindām, kas iepriekšējo tekstu aizstāj ar mūzikas rindām. @lv
preferred label: 逐行 @zh-hans
toolkit label: 逐行 @zh-hans
toolkit definition: 由文字行与先前文字对应的乐谱行交替显示而组成的一种版式 @zh-hans

line over line
type: Concept
in scheme: RDA Layout
status: Published
toolkit label: line over line
toolkit definition: A layout that consists of measures displayed in units called parallels, although the measures are not necessarily aligned.
scope note: This term applies to tactile music notation.
preferred label: linea sopra linea @it
toolkit label: linea sopra linea @it
preferred label: Linie über Linie @de
toolkit label: Linie über Linie @de
toolkit definition: Ein Layout, bei dem Takte in parallelen Linien dargestellt werden, wobei die Takte aber nicht zwingend bündig ausgerichtet sind. @de
scope note: Dieser Terminus trifft auf taktile Noten zu. @de
preferred label: säkeet allekkain @fi
toolkit label: säkeet allekkain @fi
toolkit definition: Layout, jossa tahdit on esitetty rinnakkain, mutta niitä ei ole välttämättä tasattu keskenään. @fi
scope note: Termi koskee taktiileja musiikkiaineistoja. @fi
preferred label: dòng trên dòng @vi
toolkit label: dòng trên dòng @vi
toolkit definition: Sắp đặt gồm có các nhịp được hiện song song, nhưng các nhịp đó không cần thẳng hàng. @vi
scope note: Thuật ngữ này áp dụng cho tài nguyên âm nhạc xúc giác. @vi
preferred label: linje over linje @da
toolkit label: linje over linje @da
toolkit definition: Layout bestående af takter vist som enheder der kaldes for paralleller, selvom takterne ikke nødvendigvis er på linje med hinanden. @da
scope note: Denne term anvendes til taktil musiknotation. @da
preferred label: ligne sur ligne @fr
toolkit label: ligne sur ligne @fr
toolkit definition: Disposition qui consiste en mesures présentées sous forme d’unités appelées parallèles, mais dans lesquels les mesures ne sont pas nécessairement alignées les unes avec les autres. @fr
scope note: Ce terme s’applique à la notation musicale tactile. @fr
toolkit definition: Et oppsett som består av takter som vises parallelt, men taktene er ikke nødvendigvis på linje. @no
scope note: Dette begrepet gjelder taktil musikknotasjon. @no
preferred label: línia sobre línia @ca
toolkit label: línia sobre línia @ca
toolkit definition: Disposició que consisteix en compassos que es visualitzen en unitats anomenades paral·lels, tot i que els compassos no estan alineats necessàriament. @ca
scope note: El terme s’aplica a la notació de música tàctil. @ca
notation: 1008
preferred label: sor sor felett @hu
toolkit label: sor sor felett @hu
toolkit definition: Elrendezés, amelyben az ütemeket párhuzamosoknak nevezett egységekben ábrázolják, habár az ütemek nem szükségképpen vannak egymáshoz igazítva. @hu
scope note: Ez a megnevezés tapintható zenei lejegyzésekre vonatkozik. @hu
preferred label: γραμμή πάνω από γραμμή @el
toolkit label: γραμμή πάνω από γραμμή @el
toolkit definition: Μια τυπογραφική διάταξη η οποία συνίσταται από μέτρα που προβάλλονται σε ενότητες που ονομάζονται παράλληλοι, αν και τα μέτρα δεν είναι απαραίτητα ευθυγραμμισμένα. @el
scope note: Αυτός ο όρος βρίσκει εφαρμογή σε απτική μουσική σημειογραφία. @el
preferred label: سطر فوق سطر @ar
toolkit label: سطر فوق سطر @ar
toolkit definition: مخطط عبارة عن موازين تُعرض على شكل وحدات تسمى المتوازيات لكن ليست من الضروري أن تكون متحاذية. @ar
scope note: ينطبق هذا المصطلح على تدوين الموسيقى اللمسية. @ar
toolkit definition: Layout che consiste di battute presentate in unità dette parallele, anche se le battute non sono necessariamente allineate. @it
scope note: Il termine si applica alla notazione musicale tattile. @it
preferred label: regel boven regel @nl
toolkit label: regel boven regel @nl
toolkit definition: Een lay-out die bestaat uit maten weergegeven in eenheden genaamd parallellen, hoewel de maten niet noodzakelijkerwijs uitgelijnd zijn. @nl
scope note: Deze term is van toepassing op tactiele muzieknotatie. @nl
preferred label: read üksteise all @et
toolkit label: read üksteise all @et
toolkit definition: Küljendus, mille puhul taktid on esitatud paralleelsete üksustena, kuid taktide algused ei pruugi olla joondatud. @et
scope note: Termin puudutab taktiilset muusikanotatsiooni. @et
preferred label: līnija virs līnijas @lv
toolkit label: līnija virs līnijas @lv
toolkit definition: Izkārtojums, kas sastāv no paralēlām taktīm, bet tās (taktis) noteiktu nav sakārtotas rindā. @lv
scope note: Termins attiecas uz taktilās mūzikas pierakstu. @lv
definition: A layout that consists of measures displayed in units called parallels, although the measures are not necessarily aligned.
definition: Layout, jossa tahdit on esitetty rinnakkain, mutta niitä ei ole välttämättä tasattu keskenään. @fi
definition: Ein Layout, bei dem Takte in parallelen Linien dargestellt werden, wobei die Takte aber nicht zwingend bündig ausgerichtet sind. @de
definition: Sắp đặt gồm có các nhịp được hiện song song, nhưng các nhịp đó không cần thẳng hàng. @vi
definition: Layout bestående af takter vist som enheder der kaldes for paralleller, selvom takterne ikke nødvendigvis er på linje med hinanden. @da
definition: Disposition qui consiste en mesures présentées sous forme d’unités appelées parallèles, mais dans lesquels les mesures ne sont pas nécessairement alignées les unes avec les autres. @fr
definition: Et oppsett som består av takter som vises parallelt, men taktene er ikke nødvendigvis på linje. @no
definition: Disposició que consisteix en compassos que es visualitzen en unitats anomenades paral·lels, tot i que els compassos no estan alineats necessàriament. @ca
definition: Elrendezés, amelyben az ütemeket párhuzamosoknak nevezett egységekben ábrázolják, habár az ütemek nem szükségképpen vannak egymáshoz igazítva. @hu
definition: Μια τυπογραφική διάταξη η οποία συνίσταται από μέτρα που προβάλλονται σε ενότητες που ονομάζονται παράλληλοι, αν και τα μέτρα δεν είναι απαραίτητα ευθυγραμμισμένα. @el
definition: مخطط عبارة عن موازين تُعرض على شكل وحدات تسمى المتوازيات لكن ليست من الضروري أن تكون متحاذية. @ar
definition: Layout che consiste di battute presentate in unità dette parallele, anche se le battute non sono necessariamente allineate. @it
definition: Een lay-out die bestaat uit maten weergegeven in eenheden genaamd parallellen, hoewel de maten niet noodzakelijkerwijs uitgelijnd zijn. @nl
definition: Küljendus, mille puhul taktid on esitatud paralleelsete üksustena, kuid taktide algused ei pruugi olla joondatud. @et
definition: Izkārtojums, kas sastāv no paralēlām taktīm, bet tās (taktis) noteiktu nav sakārtotas rindā. @lv
preferred label: 上下行方式 @zh-hans
toolkit label: 上下行方式 @zh-hans
toolkit definition: 由按被称为平行的单元显示（然而小节不一定对齐）的小节组成的一种版式 @zh-hans

melody chord system
type: Concept
in scheme: RDA Layout
status: Published
toolkit label: melody chord system
toolkit definition: A layout that consists of chord symbols and melody presented in paragraphs with music braille used for the chord symbols.
scope note: The melody chord system is used chiefly for popular and folk music. This term applies to tactile music notation.
preferred label: sistema di melodia accordale @it
toolkit label: sistema di melodia accordale @it
preferred label: Melodie-Akkordsystem @de
toolkit label: Melodie-Akkordsystem @de
toolkit definition: Ein Layout, bei dem Akkordsymbole und Tonfolgen in Absätzen dargestellt werden. Für die Akkordsymbole wird Braille-Notenschrift verwendet. @de
scope note: Das Melodie-Akkordsystem wird hauptsächlich im Bereich der Volks- und Populärmusik verwendet. Dieser Terminus trifft auf taktile Noten zu. @de
toolkit definition: Layout, jossa sointumerkit ja melodia on jaettu kappaleisiin nuottipistekirjoituksella merkittyjen sointumerkkien kanssa. @fi
scope note: Melody chord systemia käytetään pääasiassa populaari- ja kansanmusiikissa. Termi koskee taktiileja musiikkiaineistoja. @fi
preferred label: hệ thống hợp âm giai điệu @vi
toolkit label: hệ thống hợp âm giai điệu @vi
toolkit definition: Sắp đặt gồm có ký hiệu hơp âm và giai điệu được trình bày trong các đoạn với mã braille âm nhạc được dùng cho ký hiệu hợp âm. @vi
scope note: Thuật ngữ này áp dụng cho tài nguyên âm nhạc xúc giác. @vi
preferred label: melodi-akkordsystem @da
toolkit label: melodi-akkordsystem @da
toolkit definition: Layout bestående af becifring og melodi præsenteret i afsnit med musik-braille anvendt for becifring. @da
scope note: Melodi-akkordssystemet er anvendt primært for populær- og folkemusik. Denne term anvendes til taktil musiknotation. @da
preferred label: système mélodie/accords @fr
toolkit label: système mélodie/accords @fr
toolkit definition: Disposition qui consiste en accords chiffrés et en une mélodie présentés sous forme de paragraphes, les accords chiffrés étant représentés à l’aide du braille musical. @fr
scope note: Le système mélodie/accords est utilisé principalement pour la musique populaire et folklorique. Ce terme s’applique à la notation musicale tactile. @fr
preferred label: melodiakkordsystem @no
toolkit label: melodiakkordsystem @no
toolkit definition: Et oppsett som består av akkordsymboler og melodi vist i avsnitt, der musikalsk punktskrift brukes for akkordsymbolene. @no
scope note: Melodiakkordsystemet brukes hovedsakelig innen populær- og folkemusikk. Dette begrepet gjelder taktil musikknotasjon. @no
preferred label: sistema d’acords i melodia @ca
toolkit label: sistema d’acords i melodia @ca
toolkit definition: Disposició que consisteix en símbols d’acords i melodia presentats en paràgrafs, amb la música en braille usada per als símbols d’acords. @ca
scope note: El sistema d’acords i melodia s’utilitza principalment en la música popular i la música folk. El terme s’aplica a la notació de música tàctil. @ca
notation: 1009
preferred label: dallam-akkord rendszer @hu
toolkit label: dallam-akkord rendszer @hu
toolkit definition: Elrendezés, ami akkordszimbólumokból és dallamból álló bekezdésekből áll, és az akkordszimbólumokat zenei Braille-írásban tartalmazza. @hu
scope note: Ez a megnevezés tapintható zenei lejegyzésekre vonatkozik. @hu
toolkit definition: Μια τυπογραφική διάταξη η οποία συνίσταται από σύμβολα συγχορδιών και μελωδία προβαλλόμενες σε παραγράφους με μουσική γραφή braille, η οποία χρησιμοποιείται για τα σύμβολα των συγχορδιών. @el
scope note: Το melody chord system χρησιμοποιείται κυρίως για δημοφιλή και παραδοσιακή μουσική. Αυτός ο όρος βρίσκει εφαρμογή σε απτική μουσική σημειογραφία. @el
toolkit definition: Layout che consiste di sigle di accordi e melodia presentati in paragrafi con la musica braille usata per le sigle degli accordi. @it
scope note: Il sistema di melodia accordale è usato principalmente per la musica popolare e folk. Il termine si applica alla notazione musicale tattile. @it
preferred label: melodisch akkoordsysteem @nl
toolkit label: melodisch akkoordsysteem @nl
toolkit definition: Een lay-out die bestaat uit akkoordsymbolen en melodie gepresenteerd in paragrafen met muziekbraille gebruikt voor de akkoordsymbolen. @nl
scope note: Het melodisch akkoordsysteem wordt voornamelijk gebruik bij populaire en volksmuziek. Deze term is van toepassing op tactiele muzieknotatie. @nl
preferred label: meloodia akordimärkidega @et
toolkit label: meloodia akordimärkidega @et
toolkit definition: Küljendus, mille puhul akordimärgid ja meloodia on esitatud lõikudena, kusjuures akordimärgid on Braille' noodikirjas. @et
scope note: Meloodia ja akordimärkide süsteemi kasutatakse peamiselt populaar- ja folkmuusika kirjapanekuks. Termin puudutab taktiilset muusikanotatsiooni. @et
preferred label: melodijas akordu sistēma @lv
toolkit label: melodijas akordu sistēma @lv
toolkit definition: Izkārtojums, kas sastāv no akordu simboliem un melodijas, kas attēlots ar Braila rakstu, ko izmanto kā akordu simbolus. @lv
scope note: Melodiju akordu sistēma tiek izmantota galvenokārt tautas mūzikai. Termins attiecas uz mūzikas notāciju uztveršanai ar tausti. @lv
definition: A layout that consists of chord symbols and melody presented in paragraphs with music braille used for the chord symbols.
definition: Layout, jossa sointumerkit ja melodia on jaettu kappaleisiin nuottipistekirjoituksella merkittyjen sointumerkkien kanssa. @fi
definition: Ein Layout, bei dem Akkordsymbole und Tonfolgen in Absätzen dargestellt werden. Für die Akkordsymbole wird Braille-Notenschrift verwendet. @de
definition: Sắp đặt gồm có ký hiệu hơp âm và giai điệu được trình bày trong các đoạn với mã braille âm nhạc được dùng cho ký hiệu hợp âm. @vi
definition: Layout bestående af becifring og melodi præsenteret i afsnit med musik-braille anvendt for becifring. @da
definition: Disposition qui consiste en accords chiffrés et en une mélodie présentés sous forme de paragraphes, les accords chiffrés étant représentés à l’aide du braille musical. @fr
definition: Et oppsett som består av akkordsymboler og melodi vist i avsnitt, der musikalsk punktskrift brukes for akkordsymbolene. @no
definition: Disposició que consisteix en símbols d’acords i melodia presentats en paràgrafs, amb la música en braille usada per als símbols d’acords. @ca
definition: Elrendezés, ami akkordszimbólumokból és dallamból álló bekezdésekből áll, és az akkordszimbólumokat zenei Braille-írásban tartalmazza. @hu
definition: Μια τυπογραφική διάταξη η οποία συνίσταται από σύμβολα συγχορδιών και μελωδία προβαλλόμενες σε παραγράφους με μουσική γραφή braille, η οποία χρησιμοποιείται για τα σύμβολα των συγχορδιών. @el
definition: Layout che consiste di sigle di accordi e melodia presentati in paragrafi con la musica braille usata per le sigle degli accordi. @it
definition: Een lay-out die bestaat uit akkoordsymbolen en melodie gepresenteerd in paragrafen met muziekbraille gebruikt voor de akkoordsymbolen. @nl
definition: Küljendus, mille puhul akordimärgid ja meloodia on esitatud lõikudena, kusjuures akordimärgid on Braille' noodikirjas. @et
definition: Izkārtojums, kas sastāv no akordu simboliem un melodijas, kas attēlots ar Braila rakstu, ko izmanto kā akordu simbolus. @lv
preferred label: نظام لحن الوتر @ar
toolkit label: نظام لحن الوتر @ar
definition: مخطط يتكون من رموز الوتر ولحن يقدم في فقرات برموز برايل للموسيقى المستخدمة لرموز الوتر @ar
toolkit definition: مخطط يتكون من رموز الوتر ولحن يقدم في فقرات برموز برايل للموسيقى المستخدمة لرموز الوتر @ar
scope note: يستخدم نظام وتر اللحن بشكل رئيسي للموسيقى الشعبية والفلكلورية. ينطبق هذا المصطلح على تدوين الموسيقى اللمسية. @ar
preferred label: 旋律和弦体系 @zh-hans
toolkit label: 旋律和弦体系 @zh-hans
toolkit definition: 由呈现在段落中的和弦符号和旋律（其中和弦符号用乐谱布莱叶盲文表示）组成的一种版式 @zh-hans
scope note: 旋律和弦体系主要用于流行音乐和民间音乐。该术语适用于触摸乐谱。 @zh-hans
definition: 由呈现在段落中的和弦符号和旋律（其中和弦符号用乐谱布莱叶盲文表示）组成的一种版式 @zh-hans

open score
type: Concept
in scheme: RDA Layout
status: Published
toolkit label: open score
toolkit definition: A layout that consists of music presented in units called parallels.
scope note: Open score is similar to bar over bar, but used for ensemble scores. This term applies to tactile music notation.
preferred label: partitura a parti late @it
toolkit label: partitura a parti late @it
toolkit definition: Ein Layout, bei dem Noten in parallelen Linien dargestellt werden. @de
scope note: Open score ist dem Layout "Takt über Takt" ähnlich, wird aber für Ensemble-Partituren verwendet. Dieser Terminus trifft auf taktile Noten zu. @de
preferred label: avoin partituuri @fi
toolkit label: avoin partituuri @fi
toolkit definition: Layout, joka koostuu rinnakkain esitetystä nuottikirjoituksesta. @fi
scope note: Avoin partituuri muistuttaa tahdit allekkain -layoutia, mutta avoin partituuri -layoutia käytetään yhtyepartituureissa. Termi koskee taktiilia nuottikirjoitusta. @fi
preferred label: bảng tổng phổ mở @vi
toolkit label: bảng tổng phổ mở @vi
toolkit definition: Sắp đặt gồm có âm nhạc được trình bày trong các đường song song. @vi
scope note: Bảng tổng phổ mở tương tự như gạch nhịp sau gạch nhịp nhưng được dùng cho bảng tổng phổ đồng diễn. Thuật ngữ này áp dụng cho tài nguyên âm nhạc xúc giác. @vi
preferred label: partitur @da
toolkit label: partitur @da
toolkit definition: Layout bestående af musik præsenteret i enheder der kaldes for paralleller. @da
scope note: Denne term anvendes til taktil musiknotation. @da
preferred label: partition ouverte @fr
toolkit label: partition ouverte @fr
toolkit definition: Disposition qui consiste en musique présentée sous forme d’unités appelées parallèles. @fr
scope note: La disposition en partition ouverte est semblable à la disposition mesure sur mesure, mais est utilisée pour les partitions de musique d’ensemble. Ce terme s’applique à la notation musicale tactile. @fr
toolkit definition: Et oppsett som består av musikk som vises parallellt. @no
scope note: Open score ligner bar over bar, men brukes for ensembler. Dette begrepet gjelder taktil musikknotasjon. @no
preferred label: partitura oberta @ca
toolkit label: partitura oberta @ca
toolkit definition: Disposició que consisteix en música presentada en unitats anomenades paral·lels. @ca
scope note: La partitura oberta és similar al compàs per compàs, però s’usa per a partitures de conjunt. El terme s’aplica a la notació de música tàctil. @ca
notation: 1010
preferred label: (nyitott) partitúra @hu
toolkit label: (nyitott) partitúra @hu
toolkit definition: Elrendezés, amelyben a zenét párhuzamosoknak nevezett egységekben ábrázolják. @hu
scope note: A nyitott partitúra hasonló az ütem ütem felettihez, de zenekari kottákban használják. Ez a megnevezés tapintható zenei lejegyzésekre vonatkozik. @hu
preferred label: ανοικτή παρτιτούρα @el
toolkit label: ανοικτή παρτιτούρα @el
toolkit definition: Μια τυπογραφική διάταξη η οποία συνίσταται από μουσική προβαλλόμενη σε ενότητες που ονομάζονται παράλληλοι. @el
scope note: Η ανοικτή παρτιτούρα είναι παρόμοια με εκείνη του μέτρου πάνω από μέτρο αλλά χρησιμοποιείται για παρτιτούρες συνόλου. Αυτός ο όρος βρίσκει εφαρμογή σε απτική μουσική σημειογραφία. @el
toolkit definition: Layout che consiste di musica presentata in unità dette parallele. @it
scope note: La partitura a parti late è simile alla battuta sopra battuta ma usata per le partiture di orchestra. Il termine si applica ala notazione musicale tattile. @it
toolkit definition: Een lay-out die bestaat uit muziek gepresenteerd in eenheden genaamd parallellen. @nl
scope note: Open score is vergelijkbaar met maat boven maat, maar gebruikt bij scores voor gezelschappen. Deze term is van toepassing op tactiele muzieknotatie. @nl
preferred label: partituur @et
toolkit label: partituur @et
toolkit definition: Küljendus, mille puhul taktid on esitatud paralleelsete üksustena. @et
scope note: Partituur sarnaneb tüübiga "taktid üksteise all", kuid rakendatakse ansamblipartituuride puhul. Termin puudutab taktiilset muusikanotatsiooni. @et
preferred label: atvērta partitūra @lv
toolkit label: atvērta partitūra @lv
toolkit definition: Izkārtojums, kas sastāv no mūzikas pieraksta paralēlās līnijās. @lv
scope note: Pieraksta veids atvērtā partitūrā, kas līdzīgs kā taktssvītra virs taktssvītras, bet parasti izmanto ansambļu/mūzikas grupu partitūrās. Termins attiecas uz taktilu mūzikas pierakstu. @lv
definition: A layout that consists of music presented in units called parallels.
definition: Layout, joka koostuu rinnakkain esitetystä nuottikirjoituksesta. @fi
definition: Ein Layout, bei dem Noten in parallelen Linien dargestellt werden. @de
definition: Sắp đặt gồm có âm nhạc được trình bày trong các đường song song. @vi
definition: Layout bestående af musik præsenteret i enheder der kaldes for paralleller. @da
definition: Disposition qui consiste en musique présentée sous forme d’unités appelées parallèles. @fr
definition: Et oppsett som består av musikk som vises parallellt. @no
definition: Disposició que consisteix en música presentada en unitats anomenades paral·lels. @ca
definition: Elrendezés, amelyben a zenét párhuzamosoknak nevezett egységekben ábrázolják. @hu
definition: Μια τυπογραφική διάταξη η οποία συνίσταται από μουσική προβαλλόμενη σε ενότητες που ονομάζονται παράλληλοι. @el
definition: Layout che consiste di musica presentata in unità dette parallele. @it
definition: Een lay-out die bestaat uit muziek gepresenteerd in eenheden genaamd parallellen. @nl
definition: Küljendus, mille puhul taktid on esitatud paralleelsete üksustena. @et
definition: Izkārtojums, kas sastāv no mūzikas pieraksta paralēlās līnijās. @lv
preferred label: مدونة مفتوحة @ar
toolkit label: مدونة مفتوحة @ar
definition: مخطط عبارة عن موسيقى مقدمة في وحدات تسمى المتوازيات. @ar
toolkit definition: مخطط عبارة عن موسيقى مقدمة في وحدات تسمى المتوازيات. @ar
scope note: ينطبق هذا المصطلح على تدوين الموسيقى اللمسية. @ar
preferred label: 开放总谱 @zh-hans
toolkit label: 开放总谱 @zh-hans
toolkit definition: 由按被称为平行的单元呈现的音乐组成的一种版式 @zh-hans
scope note: 开放总谱类似于上下小节方式，但用于乐团总谱。该术语适用于触摸乐谱。 @zh-hans
definition: 由按被称为平行的单元呈现的音乐组成的一种版式 @zh-hans
preferred label: Nota kitapçığı @tr
toolkit label: Nota kitapçığı @tr

outline
type: Concept
in scheme: RDA Layout
status: Published
toolkit label: outline
toolkit definition: A layout that consists of music in the outline format.
scope note: This term applies to tactile music notation.
toolkit definition: Ein Layout, bei dem Noten im Outline Format dargestellt werden. @de
scope note: Dieser Terminus trifft auf taktile Noten zu. @de
toolkit definition: Layout, joka koostuu outline-muotoisesta nuottikirjoituksesta. @fi
scope note: Termi koskee taktiilia nuottikirjoitusta. @fi
preferred label: phác thảo @vi
toolkit label: phác thảo @vi
toolkit definition: Sắp đặt gồm có âm nhạc trong định dạng phác thảo @vi
scope note: Thuật ngữ này áp dụng cho tài nguyên âm nhạc xúc giác. @vi
toolkit definition: Layout bestående af musik i outline-format. @da
scope note: Denne term anvendes til taktil musiknotation. @da
preferred label: notation simplifiée @fr
toolkit label: notation simplifiée @fr
toolkit definition: Disposition qui consiste en musique présentée sous forme de notation simplifiée. @fr
scope note: Ce terme s’applique à la notation musicale tactile. @fr
preferred label: skisse @no
toolkit label: skisse @no
toolkit definition: Et oppsett som består av musikk i skisseformat. @no
scope note: Dette begrepet gjelder taktil musikknotasjon. @no
preferred label: esquema @ca
toolkit label: esquema @ca
toolkit definition: Disposició que consisteix en música en el format esquema. @ca
scope note: El terme s’aplica a la notació de música tàctil. @ca
notation: 1011
toolkit definition: Elrendezés, ami a zenét vázlatos formában jeleníti meg. @hu
scope note: Ez a megnevezés tapintható zenei lejegyzésekre vonatkozik. @hu
preferred label: περίγραμμα @el
toolkit label: περίγραμμα @el
toolkit definition: Μια τυπογραφική διάταξη η οποία συνίσταται από μουσική στη μορφή περιγράμματος. @el
scope note: Αυτός ο όρος βρίσκει εφαρμογή σε απτική μουσική σημειογραφία. @el
toolkit definition: Layout che consiste di musica in formato outline. @it
scope note: Il termine si applica alla notazione musicale tattile. @it
preferred label: overzicht @nl
toolkit label: overzicht @nl
toolkit definition: Een lay-out die bestaat uit muziek in het overzichtsformaat. @nl
scope note: Deze term is van toepassing op tactiele muzieknotatie. @nl
preferred label: skeem @et
toolkit label: skeem @et
toolkit definition: Küljendus, mille puhul muusikanotatsioon on skemaatilises vormis. @et
scope note: Termin puudutab taktiilset muusikanotatsiooni. @et
preferred label: īss satura izklāsts/konspekts / kontūra @lv
toolkit label: īss satura izklāsts/konspekts / kontūra @lv
toolkit definition: Izkārtojums, kas sastāv no mūzikas īsā izklāsta formātā. @lv
scope note: Termins attiecas uz taktilās mūzikas pierakstu. @lv
definition: A layout that consists of music in the outline format.
definition: Layout, joka koostuu outline-muotoisesta nuottikirjoituksesta. @fi
definition: Ein Layout, bei dem Noten im Outline Format dargestellt werden. @de
definition: Sắp đặt gồm có âm nhạc trong định dạng phác thảo @vi
definition: Layout bestående af musik i outline-format. @da
definition: Disposition qui consiste en musique présentée sous forme de notation simplifiée. @fr
definition: Et oppsett som består av musikk i skisseformat. @no
definition: Disposició que consisteix en música en el format esquema. @ca
definition: Elrendezés, ami a zenét vázlatos formában jeleníti meg. @hu
definition: Μια τυπογραφική διάταξη η οποία συνίσταται από μουσική στη μορφή περιγράμματος. @el
definition: Layout che consiste di musica in formato outline. @it
definition: Een lay-out die bestaat uit muziek in het overzichtsformaat. @nl
definition: Küljendus, mille puhul muusikanotatsioon on skemaatilises vormis. @et
definition: Izkārtojums, kas sastāv no mūzikas īsā izklāsta formātā. @lv
preferred label: المخطط التفصيلي @ar
toolkit label: المخطط التفصيلي @ar
definition: مخطط عبارة عن موسيقى في نسق مخطط تفصيلي @ar
toolkit definition: مخطط عبارة عن موسيقى في نسق مخطط تفصيلي @ar
scope note: ينطبق هذا المصطلح على تدوين الموسيقى اللمسية. @ar
preferred label: 概述 @zh-hans
toolkit label: 概述 @zh-hans
toolkit definition: 由概述格式的乐谱组成的一种版式 @zh-hans
scope note: 该术语适用于触摸乐谱。 @zh-hans
definition: 由概述格式的乐谱组成的一种版式 @zh-hans
preferred label: Taslak @tr
toolkit label: Taslak @tr
toolkit definition: Taslak biçimindeki müzikten oluşan bir düzen @tr
scope note: Bu terim, dokunsal müzik notasyonu için geçerlidir. @tr
definition: Taslak biçimindeki müzikten oluşan bir düzen @tr
preferred label: contorno @es

paragraph
type: Concept
in scheme: RDA Layout
status: Published
toolkit label: paragraph
toolkit definition: A layout in braille that consists of music displayed in paragraphs with one part per paragraph.
scope note: This term applies to tactile music notation.
preferred label: paragrafo @it
toolkit label: paragrafo @it
toolkit definition: Ein Layout in Braille, bei dem Noten in Absätzen dargestellt werden, wobei es pro Stimme einen Absatz gibt. @de
scope note: Dieser Terminus trifft auf taktile Noten zu. @de
preferred label: paragrafi @fi
toolkit label: paragrafi @fi
toolkit definition: Layout, jossa nuottipistekirjoitus jaetaan kappaleisiin stemmoittain. @fi
scope note: Termi koskee taktiilia nuottikirjoitusta. @fi
preferred label: đoạn @vi
toolkit label: đoạn @vi
toolkit definition: Sắp đặt theo mã braille gồm có âm nhạc hiện theo đoạn với một phần trong một đoạn. @vi
scope note: Thuật ngữ này áp dụng cho tài nguyên âm nhạc xúc giác. @vi
preferred label: afsnit @da
toolkit label: afsnit @da
toolkit definition: Layout i braille bestående af musik vist i afsnit med en stemme per afsnit. @da
scope note: Denne term anvendes til taktil musiknotation. @da
preferred label: paragraphe @fr
toolkit label: paragraphe @fr
toolkit definition: Disposition en braille qui consiste en musique présentée sous forme de paragraphes contenant chacun une partie. @fr
scope note: Ce terme s’applique à la notation musicale tactile. @fr
preferred label: avsnitt @no
toolkit label: avsnitt @no
toolkit definition: Et oppsett i punktskrift der musikk vises i avsnitt med ett instrument per avsnitt. @no
scope note: Dette begrepet gjelder taktil musikknotasjon. @no
preferred label: paràgraf @ca
toolkit label: paràgraf @ca
toolkit definition: Disposició en braille que consisteix en música que es visualitza en paràgrafs amb una part per paràgraf. @ca
scope note: El terme s’aplica a la notació de música tàctil. @ca
notation: 1012
preferred label: bekezdés @hu
toolkit label: bekezdés @hu
toolkit definition: Braille elrendezés, ami bekezdésekben ábrázolt zenéből áll, és egy bekezdésben egy szólam található. @hu
scope note: Ez a megnevezés tapintható zenei lejegyzésekre vonatkozik. @hu
preferred label: παράγραφος @el
toolkit label: παράγραφος @el
toolkit definition: Μια τυπογραφική διάταξη σε braille, η οποία συνίσταται από μουσική προβαλλόμενη σε παραγράφους με ένα μέρος ανά παράγραφο. @el
scope note: Αυτός ο όρος βρίσκει εφαρμογή σε απτική μουσική σημειογραφία. @el
toolkit definition: Layout in braille che consiste di musica presentata in paragrafi con una parte per paragrafo. @it
scope note: Il termine si applica alla notazione musicale tattile. @it
preferred label: paragraaf @nl
toolkit label: paragraaf @nl
toolkit definition: Een lay-out in braille die bestaat uit muziek weergegeven in paragrafen met één partij per paragraaf. @nl
scope note: Deze term is van toepassing op tactiele muzieknotatie. @nl
preferred label: lõiguti @et
toolkit label: lõiguti @et
toolkit definition: Küljendus, mille puhul Braille' noodikiri on esitatud lõikude kaupa, igas lõigus üks partii. @et
scope note: Termin puudutab taktiilset muusikanotatsiooni. @et
preferred label: paragrāfs @lv
toolkit label: paragrāfs @lv
toolkit definition: Izkārtojums braila rakstā, kurā mūzika attēlota pa rindkopām un vienā rindkopā attēlo vienu balsi. @lv
scope note: Termins attiecas uz taktilās mūzikas pierakstu. @lv
definition: A layout in braille that consists of music displayed in paragraphs with one part per paragraph.
definition: Layout, jossa nuottipistekirjoitus jaetaan kappaleisiin stemmoittain. @fi
definition: Ein Layout in Braille, bei dem Noten in Absätzen dargestellt werden, wobei es pro Stimme einen Absatz gibt. @de
definition: Sắp đặt theo mã braille gồm có âm nhạc hiện theo đoạn với một phần trong một đoạn. @vi
definition: Layout i braille bestående af musik vist i afsnit med en stemme per afsnit. @da
definition: Disposition en braille qui consiste en musique présentée sous forme de paragraphes contenant chacun une partie. @fr
definition: Et oppsett i punktskrift der musikk vises i avsnitt med ett instrument per avsnitt. @no
definition: Disposició en braille que consisteix en música que es visualitza en paràgrafs amb una part per paràgraf. @ca
definition: Braille elrendezés, ami bekezdésekben ábrázolt zenéből áll, és egy bekezdésben egy szólam található. @hu
definition: Μια τυπογραφική διάταξη σε braille, η οποία συνίσταται από μουσική προβαλλόμενη σε παραγράφους με ένα μέρος ανά παράγραφο. @el
definition: Layout in braille che consiste di musica presentata in paragrafi con una parte per paragrafo. @it
definition: Een lay-out in braille die bestaat uit muziek weergegeven in paragrafen met één partij per paragraaf. @nl
definition: Küljendus, mille puhul Braille' noodikiri on esitatud lõikude kaupa, igas lõigus üks partii. @et
definition: Izkārtojums braila rakstā, kurā mūzika attēlota pa rindkopām un vienā rindkopā attēlo vienu balsi. @lv
preferred label: فقرة @ar
toolkit label: فقرة @ar
toolkit definition: مخطط بطريقة برايل عبارة عن موسيقى معروضة في فقرات، جزء واحد لكل فقرة. @ar
scope note: ينطبق هذا المصطلح على تدوين الموسيقى اللمسية. @ar
preferred label: 段落 @zh-hans
toolkit label: 段落 @zh-hans
toolkit definition: 由按段落显示每段一个声部的乐谱组成的布莱叶盲文的一种版式 @zh-hans
scope note: 该术语适用于触摸乐谱。 @zh-hans

section by section
type: Concept
in scheme: RDA Layout
status: Published
toolkit label: section by section
toolkit definition: A layout that consists of music displayed in indented paragraphs with all of the parts for a convenient group of measures written consecutively.
scope note: This term applies to tactile music notation.
preferred label: sezione per sezione @it
toolkit label: sezione per sezione @it
toolkit definition: Ein Layout, das aus Hand- oder Stimmenzeichen besteht, die am linken Rand zu sehen sind. @de
scope note: Dieser Terminus trifft auf taktile Noten zu. @de
preferred label: osat peräkkäin @fi
toolkit label: osat peräkkäin @fi
toolkit definition: Layout, jossa sisennettyihin kappaleisiin jaetun nuottikirjoituksen kaikki stemmat on merkitty sopivasti ryhmiteltyihin tahteihin peräkkäin. @fi
scope note: Termi koskee taktiilia nuottikirjoitusta. @fi
preferred label: mục sau mục @vi
toolkit label: mục sau mục @vi
toolkit definition: Sặp đặt gồm có ký hiệu tay hoặc phần nổi bật trên lề trái. @vi
scope note: Thuật ngữ này áp dụng cho tài nguyên âm nhạc xúc giác. @vi
preferred label: sektion for sektion @da
toolkit label: sektion for sektion @da
toolkit definition: Layout bestående af musik vist i indrykkede afsnit med alle dele til en passende gruppe af takter skrevne efter hinanden. @da
scope note: Denne term anvendes til taktil musiknotation. @da
preferred label: section par section @fr
toolkit label: section par section @fr
toolkit definition: Disposition qui consiste en musique présentée sous forme de paragraphes en retrait dans lesquels toutes les parties figurant dans un groupe approprié de mesures sont écrites l’une à la suite de l’autre. @fr
scope note: Ce terme s’applique à la notation musicale tactile. @fr
toolkit definition: Et oppsett som består av musikk vist i avsnitt hvor alle stemmene vises fortløpende for et passende antall takter. @no
scope note: Dette begrepet gjelder taktil musikknotasjon. @no
preferred label: secció per secció @ca
toolkit label: secció per secció @ca
toolkit definition: Disposició que consisteix en música que es visualitza en paràgrafs sagnats amb totes les parts per a un grup convenient de compassos escrits consecutivament. @ca
scope note: El terme s’aplica a la notació de música tàctil. @ca
notation: 1013
preferred label: szekció @hu
toolkit label: szekció @hu
toolkit definition: Elrendezés, ami egymástól elkülönülő bekezdésekben ábrázolt zenét tartalmaz úgy, hogy minden részt egymást követően a megfelelő ütemcsoporba írtak. @hu
scope note: Ez a megnevezés tapintható zenei lejegyzésekre vonatkozik. @hu
preferred label: τμήμα ανά τμήμα @el
toolkit label: τμήμα ανά τμήμα @el
toolkit definition: Μια τυπογραφική διάταξη η οποία συνίσταται από μουσική προβαλλόμενη σε παραγράφους με όλα τα μέρη ενός πρακτικού συνόλου μέτρων γραμμένων διαδοχικά. @el
scope note: Αυτός ο όρος βρίσκει εφαρμογή σε απτική μουσική σημειογραφία. @el
preferred label: قسم تلو الآخر @ar
toolkit label: قسم تلو الآخر @ar
toolkit definition: مخطط عبارة عن موسيقى معروضة في فقرات ذات مسافات بادئة مع جميع الأجزاء لمجموعة مناسبة من الموازين المكتوبة على التوالي. @ar
scope note: ينطبق هذا المصطلح على تدوين الموسيقى اللمسية. @ar
toolkit definition: Layout che consiste di musica presentata in paragrafi indentati con tutte le parti per un gruppo adeguato di battute scritte consecutivamente. @it
scope note: Il termine si applica alla notazione musicale tattile. @it
preferred label: sectie voor sectie @nl
toolkit label: sectie voor sectie @nl
toolkit definition: Een lay-out die bestaat uit muziek weergegeven door ingesprongen paragrafen met alle partijen voor een geschikte groep maten achtereenvolgend geschreven. @nl
scope note: Deze term is van toepassing op tactiele muzieknotatie. @nl
preferred label: lõigud järjestikku @et
toolkit label: lõigud järjestikku @et
toolkit definition: Küljendus, mille puhul muusikanotatsioon on esitatud taandega lõikudena, milles mingi taktirühma kõik partiid on märgitud järjestikku. @et
scope note: Termin puudutab taktiilset muusikanotatsiooni. @et
preferred label: notācija pa posmiem @lv
toolkit label: notācija pa posmiem @lv
toolkit definition: Izkārtojums, kas sastāv no nošu attēlojuma ar atkāpi izceltās rindkopās, visas balsis katrai grupai rakstot secīgi. @lv
scope note: Termins attiecas uz taktiliem nošu resursiem. @lv
definition: A layout that consists of music displayed in indented paragraphs with all of the parts for a convenient group of measures written consecutively.
definition: Layout, jossa sisennettyihin kappaleisiin jaetun nuottikirjoituksen kaikki stemmat on merkitty sopivasti ryhmiteltyihin tahteihin peräkkäin. @fi
definition: Ein Layout, das aus Hand- oder Stimmenzeichen besteht, die am linken Rand zu sehen sind. @de
definition: Sặp đặt gồm có ký hiệu tay hoặc phần nổi bật trên lề trái. @vi
definition: Layout bestående af musik vist i indrykkede afsnit med alle dele til en passende gruppe af takter skrevne efter hinanden. @da
definition: Disposition qui consiste en musique présentée sous forme de paragraphes en retrait dans lesquels toutes les parties figurant dans un groupe approprié de mesures sont écrites l’une à la suite de l’autre. @fr
definition: Et oppsett som består av musikk vist i avsnitt hvor alle stemmene vises fortløpende for et passende antall takter. @no
definition: Disposició que consisteix en música que es visualitza en paràgrafs sagnats amb totes les parts per a un grup convenient de compassos escrits consecutivament. @ca
definition: Elrendezés, ami egymástól elkülönülő bekezdésekben ábrázolt zenét tartalmaz úgy, hogy minden részt egymást követően a megfelelő ütemcsoporba írtak. @hu
definition: Μια τυπογραφική διάταξη η οποία συνίσταται από μουσική προβαλλόμενη σε παραγράφους με όλα τα μέρη ενός πρακτικού συνόλου μέτρων γραμμένων διαδοχικά. @el
definition: مخطط عبارة عن موسيقى معروضة في فقرات ذات مسافات بادئة مع جميع الأجزاء لمجموعة مناسبة من الموازين المكتوبة على التوالي. @ar
definition: Layout che consiste di musica presentata in paragrafi indentati con tutte le parti per un gruppo adeguato di battute scritte consecutivamente. @it
definition: Een lay-out die bestaat uit muziek weergegeven door ingesprongen paragrafen met alle partijen voor een geschikte groep maten achtereenvolgend geschreven. @nl
definition: Küljendus, mille puhul muusikanotatsioon on esitatud taandega lõikudena, milles mingi taktirühma kõik partiid on märgitud järjestikku. @et
definition: Izkārtojums, kas sastāv no nošu attēlojuma ar atkāpi izceltās rindkopās, visas balsis katrai grupai rakstot secīgi. @lv
preferred label: 逐节 @zh-hans
toolkit label: 逐节 @zh-hans
toolkit definition: 由以一个方便小节组所有声部连续书写的按缩格段落显示的乐谱组成的一种版式 @zh-hans
scope note: 该术语适用于触摸乐谱。 @zh-hans
definition: 由以一个方便小节组所有声部连续书写的按缩格段落显示的乐谱组成的一种版式 @zh-hans

short form scoring
type: Concept
in scheme: RDA Layout
status: Published
toolkit label: short form scoring
toolkit definition: A layout that consists of words, chord symbols, and melody presented in units called parallels with literary braille used for the chord symbols.
scope note: Short form scoring is used chiefly for popular and folk music. This term applies to tactile music notation.
preferred label: partitura a parti strette @it
toolkit label: partitura a parti strette @it
toolkit definition: Ein Layout, bei dem Worte, Akkordsymbole und Tonfolgen in parallelen Linien dargestellt werden. Für die Akkordsymbole werden Braille-Buchstaben verwendet. @de
scope note: Kurzform-Partituren werden hauptsächlich im Bereich der Volks- und Populärmusik verwendet. Dieser Terminus trifft auf taktile Noten zu. @de
toolkit definition: Layout, jossa sanat, sointumerkit ja melodia on esittetty rinnakkain kirjallisuudessa käytettävällä pistekirjoituksella merkittyjen sointumerkkien kanssa. @fi
scope note: Short form scoring -layoutia käytetään pääasiassa populaari- ja kansanmusiikissa. Termi koskee taktiilia nuottikirjoitusta. @fi
preferred label: tổng phổ hình thái ngắn @vi
toolkit label: tổng phổ hình thái ngắn @vi
toolkit definition: Sắp đặt gồm có từ, ký hiệu hợp âm, và giai điệu được trình bày trong các đường song song với mã braille văn học được dùng cho ký hiệu hợp âm. @vi
scope note: Tổng phổ hình thái ngắn được dùng chủ yếu cho âm nhạc đại chúng và dân gian. Thuật ngữ này áp dụng cho tài nguyên âm nhạc xúc giác. @vi
toolkit definition: Layout bestående af ord, becifring og melodi præsenteret i enheder der kaldes for paralleller med braille-tekst anvendt for becifring. @da
scope note: Short form scoring er anvendt primært for populær- og folkemusik. Denne term anvendes til taktil musiknotation. @da
preferred label: notation abrégée @fr
toolkit label: notation abrégée @fr
toolkit definition: Disposition qui consiste en paroles, en accords chiffrés et en une mélodie présentés sous forme d’unités appelées parallèles, les accords chiffrés étant représentés à l’aide du braille littéraire. @fr
scope note: La notation abrégée est utilisée principalement pour la musique populaire et folklorique. Ce terme s’applique à la notation musicale tactile. @fr
toolkit definition: Et oppsett som består av ord, akkordsymboler og melodi vist parallelt, der punktskrift brukes for akkordsymbolene. @no
scope note: Short form scoring brukes hovedsakelig for populær- og folkemusikk. Dette begrepet gjelder taktil musikknotasjon. @no
preferred label: notació abreujada @ca
toolkit label: notació abreujada @ca
toolkit definition: Disposició que consisteix en paraules, símbols d’acords i melodia presentats en unitats anomenades paral·lels, amb el braille literari usat per als símbols d’acords. @ca
scope note: La notació abreujada s’usa principalment per a música popular i folklòrica. El terme s’aplica a la notació de música tàctil. @ca
notation: 1014
preferred label: rövidített partitúra @hu
toolkit label: rövidített partitúra @hu
toolkit definition: Elrendezés, ami szavakból, akkordszimbólumokból és dallamból áll, amiket párhuzamosoknak nevezett egységekben ábrázolnak, és az akkordszimbólumokat Braille-írással adják meg. @hu
scope note: A rövidített partitúra főként a populáris és népzenében használják. Ez a megnevezés tapintható zenei lejegyzésekre vonatkozik. @hu
preferred label: συνοπτική μορφή παρτιτούρας @el
toolkit label: συνοπτική μορφή παρτιτούρας @el
toolkit definition: Μια τυπογραφική διάταξη η οποία συνίσταται από λέξεις, σύμβολα συγχορδιών και μελωδία προβαλλόμενες σε ενότητες, οι οποίες ονομάζονται παράλληλοι με literary braille (απόδοση του περιεχομένου λέξη προς λέξη) που χρησιμοποιείται για τα σύμβολα των συγχορδιών. @el
scope note: Η παρτιτούρα συνοπτικής μορφής χρησιμοποιείται κυρίως για δημοφιλή και παραδοσιακή μουσική. Αυτός ο όρος βρίσκει εφαρμογή στην απτική μουσική σημειογραφία. @el
preferred label: تدوين في نسق موجز @ar
toolkit label: تدوين في نسق موجز @ar
toolkit definition: مخطط يتألف من كلمات ورموز الوتر ولحن في شكل متوازيات، مع تدوين رموز الوتر باستخدام طريقة برايل الأدبية. @ar
scope note: تدوين في نسق موجز يستخدم أساسا للموسيقى الشعبية والفلكلورية. ينطبق هذا المصطلح على تدوين الموسيقى اللمسي. @ar
toolkit definition: Layout che consiste di parole, sigle di accordi e melodia presentati in unità dette parallele con testo braille usato per le sigle degli accordi. @it
scope note: La partitura a parti strette è usata principalmente per la musica popolare e folk. Il termine si applica alla notazione musicale tattile. @it
preferred label: korte vorm score @nl
toolkit label: korte vorm score @nl
toolkit definition: Een lay-out die bestaat uit woorden, akkoordsymbolen en melodie gepresenteerd in eenheden genaamd parallellen met literaire braille gebruikt voor de akkoordsymbolen. @nl
scope note: Korte vorm scores worden voornamelijk gebruikt bij populaire en volksmuziek. Deze term is van toepassing op tactiele muzieknotatie. @nl
preferred label: vähendatud partituur @et
toolkit label: vähendatud partituur @et
toolkit definition: Küljendus, mille puhul sõnad, akordimärgid ja meloodia on esitatud paralleelsete üksustena, kusjuures akordimärgid on Braille' tähestikus. @et
scope note: Vähendatud partituuri kasutatakse peamiselt populaar- ja folkmuusika kirjapanekuks. Termin puudutab taktiilset muusikanotatsiooni. @et
preferred label: īsās formas partitūra @lv
toolkit label: īsās formas partitūra @lv
toolkit definition: Izkārtojums, kas sastāv no vārdiem, akordu apzīmējumiem un melodijas, kas parādās paralēli ar braila tekstu, ko izmanto akorda apzīmējumiem. @lv
scope note: Īsās formas partitūra tiek izmantota galvenokārt populārai un tautas mūzikai. Termins attiecas uz taktilu mūzikas pierakstu. @lv
definition: A layout that consists of words, chord symbols, and melody presented in units called parallels with literary braille used for the chord symbols.
definition: Layout, jossa sanat, sointumerkit ja melodia on esittetty rinnakkain kirjallisuudessa käytettävällä pistekirjoituksella merkittyjen sointumerkkien kanssa. @fi
definition: Ein Layout, bei dem Worte, Akkordsymbole und Tonfolgen in parallelen Linien dargestellt werden. Für die Akkordsymbole werden Braille-Buchstaben verwendet. @de
definition: Sắp đặt gồm có từ, ký hiệu hợp âm, và giai điệu được trình bày trong các đường song song với mã braille văn học được dùng cho ký hiệu hợp âm. @vi
definition: Layout bestående af ord, becifring og melodi præsenteret i enheder der kaldes for paralleller med braille-tekst anvendt for becifring. @da
definition: Disposition qui consiste en paroles, en accords chiffrés et en une mélodie présentés sous forme d’unités appelées parallèles, les accords chiffrés étant représentés à l’aide du braille littéraire. @fr
definition: Et oppsett som består av ord, akkordsymboler og melodi vist parallelt, der punktskrift brukes for akkordsymbolene. @no
definition: Disposició que consisteix en paraules, símbols d’acords i melodia presentats en unitats anomenades paral·lels, amb el braille literari usat per als símbols d’acords. @ca
definition: Elrendezés, ami szavakból, akkordszimbólumokból és dallamból áll, amiket párhuzamosoknak nevezett egységekben ábrázolnak, és az akkordszimbólumokat Braille-írással adják meg. @hu
definition: Μια τυπογραφική διάταξη η οποία συνίσταται από λέξεις, σύμβολα συγχορδιών και μελωδία προβαλλόμενες σε ενότητες, οι οποίες ονομάζονται παράλληλοι με literary braille (απόδοση του περιεχομένου λέξη προς λέξη) που χρησιμοποιείται για τα σύμβολα των συγχορδιών. @el
definition: مخطط يتألف من كلمات ورموز الوتر ولحن في شكل متوازيات، مع تدوين رموز الوتر باستخدام طريقة برايل الأدبية. @ar
definition: Layout che consiste di parole, sigle di accordi e melodia presentati in unità dette parallele con testo braille usato per le sigle degli accordi. @it
definition: Een lay-out die bestaat uit woorden, akkoordsymbolen en melodie gepresenteerd in eenheden genaamd parallellen met literaire braille gebruikt voor de akkoordsymbolen. @nl
definition: Küljendus, mille puhul sõnad, akordimärgid ja meloodia on esitatud paralleelsete üksustena, kusjuures akordimärgid on Braille' tähestikus. @et
definition: Izkārtojums, kas sastāv no vārdiem, akordu apzīmējumiem un melodijas, kas parādās paralēli ar braila tekstu, ko izmanto akorda apzīmējumiem. @lv
preferred label: 短式记谱 @zh-hans
toolkit label: 短式记谱 @zh-hans
toolkit definition: 由以被称为平行的单元呈现的词、和弦符号和旋律（用文字版布莱叶盲文表示和弦符号）组成的一种版式 @zh-hans
scope note: 短式记谱主要用于流行音乐和民间音乐。该术语适用于触摸乐谱。 @zh-hans
definition: 由以被称为平行的单元呈现的词、和弦符号和旋律（用文字版布莱叶盲文表示和弦符号）组成的一种版式 @zh-hans
preferred label: bir müzik eserinin sınıflandırılmış küçük parçası @tr
toolkit label: bir müzik eserinin sınıflandırılmış küçük parçası @tr
toolkit definition: Sözcükler, akor sembolleri ve melodiden oluşan, 'paralel' adı verilen birimlerde sunulan ve akor sembolleri için edebi Braille yazısının kullanıldığı bir düzen @tr
scope note: Bir müzik eserinin sınıflandırılmış küçük bir parçası, genellikle halk ve popüler müzik için kullanılır. Bu terim dokunsal müzik notasyonu için geçerlidir. @tr

single line
type: Concept
in scheme: RDA Layout
status: Published
toolkit label: single line
toolkit definition: A layout that consists of music for single instrumental parts or solos presented in segments of two to five lines, the initial line displaying a measure number or rehearsal designation.
scope note: This term applies to tactile music notation.
preferred label: linea singola @it
toolkit label: linea singola @it
toolkit definition: Ein Layout, bei dem Noten für Einzelinstrumentalstimmen oder Solos in Segmenten von zwei bis fünf Linien dargestellt sind, wobei die erste Linie eine Taktzahl oder eine Probeanweisung enthält. @de
scope note: Dieser Terminus trifft auf taktile Noten zu. @de
preferred label: yksirivinen @fi
toolkit label: yksirivinen @fi
toolkit definition: Layout, jossa yksittäisten musiikki-instrumenttien stemmat tai soolot on esitetty nuottikirjoituksessa kahden-viiden rivin lohkoissa. Ensimmäinen rivi osoittaa tahdin numeron tai harjoitusnumeron. @fi
scope note: Termi koskee taktiilia nuottikirjoitusta. @fi
preferred label: dòng đơn @vi
toolkit label: dòng đơn @vi
toolkit definition: Sắp đặt gồm có âm nhạc cho các phần nhạc khí đơn hoặc độc tấu trình bày trên các đoạn từ hai tới năm dòng, dòng đầu hiện chỉ số nhịp điệu hoặc định danh diễn tập. @vi
scope note: Thuật ngữ này áp dụng cho tài nguyên âm nhạc xúc giác. @vi
preferred label: enkel linje @da
toolkit label: enkel linje @da
toolkit definition: Layout bestående af musik for enkelte instrumentstemmer eller soloer præsenteret i segmenter af to til fem linjer, hvor den første linje viser et taktnummer eller et prøveciffer. @da
scope note: Denne term anvendes til taktil musiknotation. @da
preferred label: ligne individuelle @fr
toolkit label: ligne individuelle @fr
toolkit definition: Disposition qui consiste en musique pour parties instrumentales ou solos individuels présentée en segments de deux à cinq lignes, la première présentant un numéro de mesure ou un repère de répétition. @fr
scope note: Ce terme s’applique à la notation musicale tactile. @fr
preferred label: enkeltlinje @no
toolkit label: enkeltlinje @no
toolkit definition: Ett oppsett som består av musikk for de enkelte instrumentalstemmene eller soloutøverne vist i segmenter med to til fem linjer der den første linjen viser et taktnummer eller en betegnelse for øvelse. @no
scope note: Dette begrepet gjelder taktil musikknotasjon. @no
preferred label: línia individual @ca
toolkit label: línia individual @ca
toolkit definition: Disposició que consisteix en música per a parts d’un sol instrument o solos presentada en segments de dues a cinc línies, la línia inicial mostra un número de compàs o una designació d’assaig. @ca
scope note: El terme s’aplica a la notació de música tàctil. @ca
notation: 1015
preferred label: egysoros @hu
toolkit label: egysoros @hu
toolkit definition: Elrendezés, ami az egyes hangszeres szólamok vagy szólók zenéjét kettő-öt sorban ábrázolja, és a kezdő sor jeleníti meg a ütemértéket vagy az ismétlőjelet. @hu
scope note: Ez a megnevezés tapintható zenei lejegyzésekre vonatkozik. @hu
preferred label: μονή γραμμή @el
toolkit label: μονή γραμμή @el
toolkit definition: Μια τυπογραφική διάταξη η οποία συνίσταται από μουσική για μεμονωμένα οργανικά μέρη ή σόλο προβαλλόμενα σε τμήματα των δύο έως πέντε γραμμών, με την αρχική γραμμή να προβάλλει έναν αριθμό μέτρου ή έναν δοκιμαστικό προορισμό. @el
scope note: Αυτός ο όρος βρίσκει εφαρμογή σε απτική μουσική σημειογραφία. @el
preferred label: سطر منفرد @ar
toolkit label: سطر منفرد @ar
toolkit definition: تخطيط يتكون من أجزاء الموسيقى التي تعزف بآلة واحدة أو للمعزوفات المنفردة، يتم عرضها في قطاعات، كل قطاع من اثنين الى خمسة أسطر يعرض سطر البداية فيها رقم الميزان أو التسمية المحددة للبروفة. @ar
scope note: ينطبق هذا المصطلح على تدوين الموسيقى اللمسية. @ar
toolkit definition: Layout che consiste di musica per parti singole strumentali o solista presentate in segmenti da due a cinque righe, con la riga iniziale che mostra un numero di battuta o un numero di chiamata. @it
scope note: Il termine si applica alla notazione musicale tattile. @it
preferred label: enkele regel @nl
toolkit label: enkele regel @nl
toolkit definition: Een lay-out die bestaat uit muziek voor partijen voor één instrument of solo's gepresenteerd in segmenten van twee tot vijf regels, de eerste regel geeft een maatnummer weer of oefenaanduiding. @nl
scope note: Deze term is van toepassing op tactiele muzieknotatie. @nl
preferred label: ühes joones @et
toolkit label: ühes joones @et
toolkit definition: Küljendus, mille puhul üksikinstrumentide või soolohäälte partiid on esitatud kahe- kuni viierealiste lõikudena, kusjuures algusrea juures on märgitud taktide arv või harjutamistähis. @et
scope note: Termin puudutab taktiilset muusikanotatsiooni. @et
preferred label: atsevišķa līnija @lv
toolkit label: atsevišķa līnija @lv
toolkit definition: Izkārtojums, kas sastāv no atsevišķām instrumentālām daļām vai solo, kas parādīti segmentos no divām līdz piecām līnijām. Sākuma līnija attēlo takts numuru vai mēģinājumu atzīmi. @lv
scope note: Termins attiecas uz taktilu mūzikas pierakstu. @lv
definition: A layout that consists of music for single instrumental parts or solos presented in segments of two to five lines, the initial line displaying a measure number or rehearsal designation.
definition: Layout, jossa yksittäisten musiikki-instrumenttien stemmat tai soolot on esitetty nuottikirjoituksessa kahden-viiden rivin lohkoissa. Ensimmäinen rivi osoittaa tahdin numeron tai harjoitusnumeron. @fi
definition: Ein Layout, bei dem Noten für Einzelinstrumentalstimmen oder Solos in Segmenten von zwei bis fünf Linien dargestellt sind, wobei die erste Linie eine Taktzahl oder eine Probeanweisung enthält. @de
definition: Sắp đặt gồm có âm nhạc cho các phần nhạc khí đơn hoặc độc tấu trình bày trên các đoạn từ hai tới năm dòng, dòng đầu hiện chỉ số nhịp điệu hoặc định danh diễn tập. @vi
definition: Layout bestående af musik for enkelte instrumentstemmer eller soloer præsenteret i segmenter af to til fem linjer, hvor den første linje viser et taktnummer eller et prøveciffer. @da
definition: Disposition qui consiste en musique pour parties instrumentales ou solos individuels présentée en segments de deux à cinq lignes, la première présentant un numéro de mesure ou un repère de répétition. @fr
definition: Ett oppsett som består av musikk for de enkelte instrumentalstemmene eller soloutøverne vist i segmenter med to til fem linjer der den første linjen viser et taktnummer eller en betegnelse for øvelse. @no
definition: Disposició que consisteix en música per a parts d’un sol instrument o solos presentada en segments de dues a cinc línies, la línia inicial mostra un número de compàs o una designació d’assaig. @ca
definition: Elrendezés, ami az egyes hangszeres szólamok vagy szólók zenéjét kettő-öt sorban ábrázolja, és a kezdő sor jeleníti meg a ütemértéket vagy az ismétlőjelet. @hu
definition: Μια τυπογραφική διάταξη η οποία συνίσταται από μουσική για μεμονωμένα οργανικά μέρη ή σόλο προβαλλόμενα σε τμήματα των δύο έως πέντε γραμμών, με την αρχική γραμμή να προβάλλει έναν αριθμό μέτρου ή έναν δοκιμαστικό προορισμό. @el
definition: تخطيط يتكون من أجزاء الموسيقى التي تعزف بآلة واحدة أو للمعزوفات المنفردة، يتم عرضها في قطاعات، كل قطاع من اثنين الى خمسة أسطر يعرض سطر البداية فيها رقم الميزان أو التسمية المحددة للبروفة. @ar
definition: Layout che consiste di musica per parti singole strumentali o solista presentate in segmenti da due a cinque righe, con la riga iniziale che mostra un numero di battuta o un numero di chiamata. @it
definition: Een lay-out die bestaat uit muziek voor partijen voor één instrument of solo's gepresenteerd in segmenten van twee tot vijf regels, de eerste regel geeft een maatnummer weer of oefenaanduiding. @nl
definition: Küljendus, mille puhul üksikinstrumentide või soolohäälte partiid on esitatud kahe- kuni viierealiste lõikudena, kusjuures algusrea juures on märgitud taktide arv või harjutamistähis. @et
definition: Izkārtojums, kas sastāv no atsevišķām instrumentālām daļām vai solo, kas parādīti segmentos no divām līdz piecām līnijām. Sākuma līnija attēlo takts numuru vai mēģinājumu atzīmi. @lv
preferred label: 单行 @zh-hans
toolkit label: 单行 @zh-hans
toolkit definition: 由单个乐器声部或独奏的乐谱（呈现为每段二至五行，第一行显示小节号或排练号）组成的一种版式 @zh-hans

single sided
type: Concept
in scheme: RDA Layout
status: Published
toolkit label: single sided
toolkit definition: A layout that uses only one side of a sheet.
scope note: This term applies to sheets and tactile text.
preferred label: facciata singola @it
toolkit label: facciata singola @it
preferred label: einseitig @de
toolkit label: einseitig @de
toolkit definition: Ein Layout, das nur eine Seiten eines Blatts verwendet. @de
scope note: Dieser Terminus trifft auf Blätter und taktilen Text zu. @de
preferred label: yksipuolinen @fi
toolkit label: yksipuolinen @fi
toolkit definition: Layout, jossa vain arkin toinen puoli on käytössä. @fi
scope note: Termi koskee arkkeja sekä taktiilia tekstiä. @fi
preferred label: một mặt @vi
toolkit label: một mặt @vi
toolkit definition: Sắp đặt sử dụng chỉ một mặt của tờ. @vi
scope note: Thuật ngữ này áp dụng cho tờ và văn bản xúc giác. @vi
preferred label: enkeltsidet @da
toolkit label: enkeltsidet @da
toolkit definition: Layout der anvender den ene side af et ark. @da
scope note: Denne term anvendes til ark og taktil tekst. @da
preferred label: simple face @fr
toolkit label: simple face @fr
toolkit definition: Disposition qui utilise un seul côté d’une feuille. @fr
scope note: Ce terme s’applique aux feuilles et au texte tactile. @fr
preferred label: enkeltsidig @no
toolkit label: enkeltsidig @no
toolkit definition: Et oppsett som bruker bare den ene siden av et ark. @no
scope note: Dette begrepet gjelder ark og taktil tekst. @no
preferred label: una cara @ca
toolkit label: una cara @ca
toolkit definition: Disposició que usa només una cara d’un full. @ca
scope note: El terme s’aplica a fulls i a text tàctil. @ca
notation: 1002
preferred label: egyoldalas @hu
toolkit label: egyoldalas @hu
toolkit definition: Elrendezés, ami egy lapnak csak egy oldalát használja. @hu
scope note: Ez a megnevezés lapokra és tapintással olvasható szövegre vonatkozik. @hu
preferred label: μονής όψης @el
toolkit label: μονής όψης @el
toolkit definition: Μια τυπογραφική διάταξη η οποία χρησιμοποιεί τη μία μόνο όψη ενός φύλλου. @el
scope note: Αυτός ο όρος βρίσκει εφαρμογή σε φύλλα και απτικό κείμενο. @el
preferred label: أحادي الوجه @ar
toolkit label: أحادي الوجه @ar
toolkit definition: تخطيط يَستخدِم جانبًا واحدًا فقط من الورقة. @ar
scope note: ينطبق هذا المصطلح على الأوراق والنصوص اللمسية. @ar
toolkit definition: Layout che usa un solo lato di un foglio. @it
scope note: Il termine si applica ai fogli e al testo tattile. @it
preferred label: enkelzijdig @nl
toolkit label: enkelzijdig @nl
toolkit definition: Een lay-out die slechts één zijde van een vel gebruikt. @nl
scope note: Deze term is van toepassing op vellen en tactiele tekst. @nl
preferred label: ühepoolne @et
toolkit label: ühepoolne @et
toolkit definition: Küljendus, mille puhul on kasutuses ainult üks lehepool. @et
scope note: Termin puudutab lehti ja taktiilset teksti. @et
preferred label: vienpusējs @lv
toolkit label: vienpusējs @lv
toolkit definition: Izkārtojums, kurā izmantota tikai ar viena loksnes puse. @lv
scope note: Termins attiecas uz loksnēm un taktilu tekstu. @lv
definition: A layout that uses only one side of a sheet.
definition: Layout, jossa vain arkin toinen puoli on käytössä. @fi
definition: Ein Layout, das nur eine Seiten eines Blatts verwendet. @de
definition: Sắp đặt sử dụng chỉ một mặt của tờ. @vi
definition: Layout der anvender den ene side af et ark. @da
definition: Disposition qui utilise un seul côté d’une feuille. @fr
definition: Et oppsett som bruker bare den ene siden av et ark. @no
definition: Disposició que usa només una cara d’un full. @ca
definition: Elrendezés, ami egy lapnak csak egy oldalát használja. @hu
definition: Μια τυπογραφική διάταξη η οποία χρησιμοποιεί τη μία μόνο όψη ενός φύλλου. @el
definition: تخطيط يَستخدِم جانبًا واحدًا فقط من الورقة. @ar
definition: Layout che usa un solo lato di un foglio. @it
definition: Een lay-out die slechts één zijde van een vel gebruikt. @nl
definition: Küljendus, mille puhul on kasutuses ainult üks lehepool. @et
definition: Izkārtojums, kurā izmantota tikai ar viena loksnes puse. @lv
preferred label: 单面 @zh-hans

vertical score
type: Concept
in scheme: RDA Layout
status: Published
toolkit label: vertical score
toolkit definition: A layout that consists of musical parts that are combined and written as chords.
scope note: This term applies to tactile music notation.
preferred label: partitura verticale @it
toolkit label: partitura verticale @it
toolkit definition: Ein Layout, bei dem mehrere Stimmen kombiniert und als Akkord geschrieben werden. @de
scope note: Dieser Terminus trifft auf taktile Noten zu. @de
preferred label: vertikaalinen partituuri @fi
toolkit label: vertikaalinen partituuri @fi
toolkit definition: Layout, jossa nuottikirjoituksen stemmat on yhdistetty ja merkitty sointuina. @fi
scope note: Termi koskee taktiilia nuottikirjoitusta. @fi
preferred label: bảng tổng phổ dọc @vi
toolkit label: bảng tổng phổ dọc @vi
toolkit definition: Sắp đặt gồm có các phần âm nhạc được kết hợp và viết như là hợp âm. @vi
scope note: Thuật ngữ này áp dụng cho tài nguyên âm nhạc xúc giác. @vi
preferred label: vertikalt partitur @da
toolkit label: vertikalt partitur @da
toolkit definition: Layout bestående af musikstemmer der er kombineret og skrevet som akkorder. @da
scope note: Denne term anvendes til taktil musiknotation. @da
preferred label: partition verticale @fr
toolkit label: partition verticale @fr
toolkit definition: Disposition qui consiste en parties musicales combinées ensemble et écrites sous forme d’accords. @fr
scope note: Ce terme s’applique à la notation musicale tactile. @fr
toolkit definition: Et oppsett som består av musikalske stemmer som kombineres og skrives som akkorder. @no
scope note: Dette begrepet gjelder taktil musikknotasjon. @no
preferred label: partitura vertical @ca
toolkit label: partitura vertical @ca
toolkit definition: Disposició que consisteix en parts musicals que estan combinades i escrites com a acords. @ca
scope note: El terme s’aplica a la notació de música tàctil. @ca
notation: 1016
preferred label: vertikális partitúra @hu
toolkit label: vertikális partitúra @hu
toolkit definition: Elrendezés, ami olyan zenei szólamokból áll, amelyeket kombinálnak és akkordként írnak le. @hu
scope note: Ez a megnevezés tapintható zenei lejegyzésekre vonatkozik. @hu
preferred label: κάθετη παρτιτούρα @el
toolkit label: κάθετη παρτιτούρα @el
toolkit definition: Μια τυπογραφική διάταξη η οποία συνίσταται από μουσικά μέρη τα οποία συνδυάζονται και γράφονται ως συγχορδίες. @el
scope note: Αυτός ο όρος βρίσκει εφαρμογή σε απτική μουσική σημειογραφία. @el
toolkit definition: Layout che consiste di parti musicali combinate e scritte come accordi. @it
scope note: Il termine si applica alla notazione musicale tattile. @it
preferred label: verticale score @nl
toolkit label: verticale score @nl
toolkit definition: Een lay-out die bestaat uit muzikale partijen die gecombineerd zijn en geschreven als akkoorden. @nl
scope note: Deze term is van toepassing op tactiele muzieknotatie. @nl
preferred label: vertikaalne paigutus @et
toolkit label: vertikaalne paigutus @et
toolkit definition: Küljendus, mille puhul kombineeritud partiid on märgitud akordidena. @et
scope note: Termin puudutab taktiilset muusikanotatsiooni. @et
preferred label: vertikāla partitūra @lv
toolkit label: vertikāla partitūra @lv
toolkit definition: Izkārtojums, kas sastāv no mūzikas daļām, kas apvienotas un pierakstītas akordos. @lv
scope note: Termins attiecas uz taktilās mūzikas pierakstu. @lv
definition: A layout that consists of musical parts that are combined and written as chords.
definition: Layout, jossa nuottikirjoituksen stemmat on yhdistetty ja merkitty sointuina. @fi
definition: Ein Layout, bei dem mehrere Stimmen kombiniert und als Akkord geschrieben werden. @de
definition: Sắp đặt gồm có các phần âm nhạc được kết hợp và viết như là hợp âm. @vi
definition: Layout bestående af musikstemmer der er kombineret og skrevet som akkorder. @da
definition: Disposition qui consiste en parties musicales combinées ensemble et écrites sous forme d’accords. @fr
definition: Et oppsett som består av musikalske stemmer som kombineres og skrives som akkorder. @no
definition: Disposició que consisteix en parts musicals que estan combinades i escrites com a acords. @ca
definition: Elrendezés, ami olyan zenei szólamokból áll, amelyeket kombinálnak és akkordként írnak le. @hu
definition: Μια τυπογραφική διάταξη η οποία συνίσταται από μουσικά μέρη τα οποία συνδυάζονται και γράφονται ως συγχορδίες. @el
definition: Layout che consiste di parti musicali combinate e scritte come accordi. @it
definition: Een lay-out die bestaat uit muzikale partijen die gecombineerd zijn en geschreven als akkoorden. @nl
definition: Küljendus, mille puhul kombineeritud partiid on märgitud akordidena. @et
definition: Izkārtojums, kas sastāv no mūzikas daļām, kas apvienotas un pierakstītas akordos. @lv
preferred label: تدوين رأسي @ar
toolkit label: تدوين رأسي @ar
definition: تخطيط يتكون من أجزاء موسيقية تُجمع وتُكتب في صورة أوتار. @ar
toolkit definition: تخطيط يتكون من أجزاء موسيقية تُجمع وتُكتب في صورة أوتار. @ar
scope note: ينطبق هذا المصطلح على تدوين الموسيقى اللمسي. @ar
preferred label: 垂直总谱 @zh-hans
toolkit label: 垂直总谱 @zh-hans
toolkit definition: 由组合起来写成和弦的音乐声部组成的一种版式 @zh-hans
scope note: 该术语适用于触摸乐谱。 @zh-hans
definition: 由组合起来写成和弦的音乐声部组成的一种版式 @zh-hans

Published
type: Concept